<?xml version="1.0" encoding="UTF-8"?>
<svg data-name="Layer 1" viewBox="0 0 782.39 634.12" xmlns="http://www.w3.org/2000/svg">
<polygon points="782.01 634.12 524.27 634.12 524.27 632.02 782.39 632.02" fill="#3f3d56"/>
<circle cx="6.8126" cy="6.814" r="6.8133" fill="#e6e6e6"/>
<circle cx="41.302" cy="6.814" r="6.8133" fill="#e6e6e6"/>
<circle cx="75.791" cy="6.814" r="6.8133" fill="#e6e6e6"/>
<circle cx="110.28" cy="6.814" r="6.8133" fill="#e6e6e6"/>
<circle cx="144.77" cy="6.814" r="6.8133" fill="#e6e6e6"/>
<circle cx="179.26" cy="6.814" r="6.8133" fill="#e6e6e6"/>
<circle cx="213.75" cy="6.814" r="6.8133" fill="#e6e6e6"/>
<circle cx="248.24" cy="6.814" r="6.8133" fill="#e6e6e6"/>
<circle cx="282.72" cy="6.814" r="6.8133" fill="#e6e6e6"/>
<circle cx="317.21" cy="6.814" r="6.8133" fill="#e6e6e6"/>
<circle cx="6.8126" cy="41.736" r="6.8133" fill="#e6e6e6"/>
<circle cx="41.302" cy="41.736" r="6.8133" fill="#e6e6e6"/>
<circle cx="75.791" cy="41.736" r="6.8133" fill="#e6e6e6"/>
<circle cx="110.28" cy="41.736" r="6.8133" fill="#014ffd"/>
<circle cx="144.77" cy="41.736" r="6.8133" fill="#e6e6e6"/>
<circle cx="179.26" cy="41.736" r="6.8133" fill="#e6e6e6"/>
<circle cx="213.75" cy="41.736" r="6.8133" fill="#e6e6e6"/>
<circle cx="248.24" cy="41.736" r="6.8133" fill="#e6e6e6"/>
<circle cx="282.72" cy="41.736" r="6.8133" fill="#e6e6e6"/>
<circle cx="317.21" cy="41.736" r="6.8133" fill="#e6e6e6"/>
<circle cx="6.8126" cy="76.658" r="6.8133" fill="#e6e6e6"/>
<circle cx="41.302" cy="76.658" r="6.8133" fill="#e6e6e6"/>
<circle cx="75.791" cy="76.658" r="6.8133" fill="#e6e6e6"/>
<circle cx="110.28" cy="76.658" r="6.8133" fill="#e6e6e6"/>
<circle cx="144.77" cy="76.658" r="6.8133" fill="#e6e6e6"/>
<circle cx="179.26" cy="76.658" r="6.8133" fill="#e6e6e6"/>
<circle cx="213.75" cy="76.658" r="6.8133" fill="#e6e6e6"/>
<circle cx="248.24" cy="76.658" r="6.8133" fill="#e6e6e6"/>
<circle cx="282.72" cy="76.658" r="6.8133" fill="#e6e6e6"/>
<circle cx="317.21" cy="76.658" r="6.8133" fill="#e6e6e6"/>
<circle cx="6.8126" cy="111.58" r="6.8133" fill="#e6e6e6"/>
<circle cx="41.302" cy="111.58" r="6.8133" fill="#e6e6e6"/>
<circle cx="75.791" cy="111.58" r="6.8133" fill="#e6e6e6"/>
<circle cx="110.28" cy="111.58" r="6.8133" fill="#e6e6e6"/>
<circle cx="144.77" cy="111.58" r="6.8133" fill="#e6e6e6"/>
<circle cx="179.26" cy="111.58" r="6.8133" fill="#e6e6e6"/>
<circle cx="213.75" cy="111.58" r="6.8133" fill="#e6e6e6"/>
<circle cx="248.24" cy="111.58" r="6.8133" fill="#e6e6e6"/>
<circle cx="282.72" cy="111.58" r="6.8133" fill="#e6e6e6"/>
<circle cx="317.21" cy="111.58" r="6.8133" fill="#e6e6e6"/>
<circle cx="6.8126" cy="146.5" r="6.8133" fill="#e6e6e6"/>
<circle cx="41.302" cy="146.5" r="6.8133" fill="#014ffd"/>
<circle cx="75.791" cy="146.5" r="6.8133" fill="#e6e6e6"/>
<circle cx="110.28" cy="146.5" r="6.8133" fill="#e6e6e6"/>
<circle cx="144.77" cy="146.5" r="6.8133" fill="#e6e6e6"/>
<circle cx="179.26" cy="146.5" r="6.8133" fill="#e6e6e6"/>
<circle cx="213.75" cy="146.5" r="6.8133" fill="#e6e6e6"/>
<circle cx="248.24" cy="146.5" r="6.8133" fill="#e6e6e6"/>
<circle cx="282.72" cy="146.5" r="6.8133" fill="#e6e6e6"/>
<circle cx="317.21" cy="146.5" r="6.8133" fill="#e6e6e6"/>
<circle cx="6.8126" cy="181.42" r="6.8133" fill="#e6e6e6"/>
<circle cx="41.302" cy="181.42" r="6.8133" fill="#e6e6e6"/>
<circle cx="75.791" cy="181.42" r="6.8133" fill="#e6e6e6"/>
<circle cx="110.28" cy="181.42" r="6.8133" fill="#e6e6e6"/>
<circle cx="144.77" cy="181.42" r="6.8133" fill="#e6e6e6"/>
<circle cx="179.26" cy="181.42" r="6.8133" fill="#e6e6e6"/>
<circle cx="213.75" cy="181.42" r="6.8133" fill="#e6e6e6"/>
<circle cx="248.24" cy="181.42" r="6.8133" fill="#e6e6e6"/>
<circle cx="282.72" cy="181.42" r="6.8133" fill="#e6e6e6"/>
<circle cx="317.21" cy="181.42" r="6.8133" fill="#e6e6e6"/>
<circle cx="6.8126" cy="216.35" r="6.8133" fill="#e6e6e6"/>
<circle cx="41.302" cy="216.35" r="6.8133" fill="#e6e6e6"/>
<circle cx="75.791" cy="216.35" r="6.8133" fill="#014ffd"/>
<circle cx="110.28" cy="216.35" r="6.8133" fill="#e6e6e6"/>
<circle cx="144.77" cy="216.35" r="6.8133" fill="#e6e6e6"/>
<circle cx="179.26" cy="216.35" r="6.8133" fill="#e6e6e6"/>
<circle cx="213.75" cy="216.35" r="6.8133" fill="#e6e6e6"/>
<circle cx="248.24" cy="216.35" r="6.8133" fill="#e6e6e6"/>
<circle cx="282.72" cy="216.35" r="6.8133" fill="#e6e6e6"/>
<circle cx="317.21" cy="216.35" r="6.8133" fill="#e6e6e6"/>
<circle cx="6.8126" cy="251.27" r="6.8133" fill="#e6e6e6"/>
<circle cx="41.302" cy="251.27" r="6.8133" fill="#e6e6e6"/>
<circle cx="75.791" cy="251.27" r="6.8133" fill="#e6e6e6"/>
<circle cx="110.28" cy="251.27" r="6.8133" fill="#e6e6e6"/>
<circle cx="144.77" cy="251.27" r="6.8133" fill="#e6e6e6"/>
<circle cx="179.26" cy="251.27" r="6.8133" fill="#e6e6e6"/>
<circle cx="213.75" cy="251.27" r="6.8133" fill="#e6e6e6"/>
<circle cx="248.24" cy="251.27" r="6.8133" fill="#e6e6e6"/>
<circle cx="282.72" cy="251.27" r="6.8133" fill="#e6e6e6"/>
<circle cx="317.21" cy="251.27" r="6.8133" fill="#e6e6e6"/>
<circle cx="6.8126" cy="286.19" r="6.8133" fill="#e6e6e6"/>
<circle cx="41.302" cy="286.19" r="6.8133" fill="#e6e6e6"/>
<circle cx="75.791" cy="286.19" r="6.8133" fill="#e6e6e6"/>
<circle cx="110.28" cy="286.19" r="6.8133" fill="#e6e6e6"/>
<circle cx="144.77" cy="286.19" r="6.8133" fill="#e6e6e6"/>
<circle cx="179.26" cy="286.19" r="6.8133" fill="#e6e6e6"/>
<circle cx="213.75" cy="286.19" r="6.8133" fill="#e6e6e6"/>
<circle cx="248.24" cy="286.19" r="6.8133" fill="#e6e6e6"/>
<circle cx="282.72" cy="286.19" r="6.8133" fill="#e6e6e6"/>
<circle cx="317.21" cy="286.19" r="6.8133" fill="#e6e6e6"/>
<circle cx="6.8126" cy="321.11" r="6.8133" fill="#e6e6e6"/>
<circle cx="41.302" cy="321.11" r="6.8133" fill="#e6e6e6"/>
<circle cx="75.791" cy="321.11" r="6.8133" fill="#e6e6e6"/>
<circle cx="110.28" cy="321.11" r="6.8133" fill="#e6e6e6"/>
<circle cx="144.77" cy="321.11" r="6.8133" fill="#e6e6e6"/>
<circle cx="179.26" cy="321.11" r="6.8133" fill="#e6e6e6"/>
<circle cx="213.75" cy="321.11" r="6.8133" fill="#e6e6e6"/>
<circle cx="248.24" cy="321.11" r="6.8133" fill="#e6e6e6"/>
<circle cx="282.72" cy="321.11" r="6.8133" fill="#e6e6e6"/>
<circle cx="317.21" cy="321.11" r="6.8133" fill="#e6e6e6"/>
<path transform="translate(-208.8 -132.94)" d="m609.21 193.83a8.614 8.614 0 0 1 8.614 8.614v344.56a8.614 8.614 0 0 1-8.614 8.614h-247.22a8.614 8.614 0 0 1-8.614-8.614v-344.56a8.614 8.614 0 0 1 8.614-8.614h247.22" fill="#e6e6e6"/>
<path transform="translate(-208.8 -132.94)" d="m362.99 546h245.22v-342.55h-245.22z" fill="#fff"/>
<path transform="translate(-208.8 -132.94)" d="m553.65 257.64a1.7228 1.7228 0 0 1 1.7228 1.7228v3.4456a1.7228 1.7228 0 0 1-1.7228 1.7228h-136.1a1.7228 1.7228 0 0 1-1.7228-1.7228v-3.4456a1.7228 1.7228 0 0 1 1.7228-1.7228h136.1" fill="#e6e6e6"/>
<path transform="translate(-208.8 -132.94)" d="m553.65 274.01a1.7228 1.7228 0 0 1 1.7228 1.7228v3.4456a1.7228 1.7228 0 0 1-1.7228 1.7228h-136.1a1.7228 1.7228 0 0 1-1.7228-1.7228v-3.4456a1.7228 1.7228 0 0 1 1.7228-1.7228h136.1" fill="#e6e6e6"/>
<path transform="translate(-208.8 -132.94)" d="m553.65 290.38a1.7228 1.7228 0 0 1 1.7228 1.7228v3.4456a1.7228 1.7228 0 0 1-1.7228 1.7228h-136.1a1.7228 1.7228 0 0 1-1.7228-1.7228v-3.4456a1.7228 1.7228 0 0 1 1.7228-1.7228h136.1" fill="#014ffd"/>
<path transform="translate(-208.8 -132.94)" d="m553.65 307.1a1.7228 1.7228 0 0 1 1.7228 1.7228v3.4456a1.7228 1.7228 0 0 1-1.7228 1.7228h-136.1a1.7228 1.7228 0 0 1-1.7228-1.7228v-3.4456a1.7228 1.7228 0 0 1 1.7228-1.7228h136.1" fill="#e6e6e6"/>
<path transform="translate(-208.8 -132.94)" d="m553.65 323.47a1.7228 1.7228 0 0 1 1.7228 1.7228v3.4456a1.7228 1.7228 0 0 1-1.7228 1.7228h-136.1a1.7228 1.7228 0 0 1-1.7228-1.7228v-3.4456a1.7228 1.7228 0 0 1 1.7228-1.7228h136.1" fill="#e6e6e6"/>
<path transform="translate(-208.8 -132.94)" d="m553.65 339.83a1.7228 1.7228 0 0 1 1.7228 1.7228v3.4456a1.7228 1.7228 0 0 1-1.7228 1.7228h-136.1a1.7228 1.7228 0 0 1-1.7228-1.7228v-3.4456a1.7228 1.7228 0 0 1 1.7228-1.7228h136.1" fill="#e6e6e6"/>
<path transform="translate(-208.8 -132.94)" d="m418.42 394.89a2.002 2.002 0 0 0-2 2v92.916a2.0023 2.0023 0 0 0 2 2h134.13a2.0023 2.0023 0 0 0 2-2v-92.916a2.002 2.002 0 0 0-2-2z" fill="#014ffd"/>
<polygon points="277.24 161.18 275.83 160.81 306.56 45.221 484.78 45.221 484.78 46.678 307.68 46.678" fill="#3f3d56"/>
<path transform="translate(-208.8 -132.94)" d="m708.15 194.18a15.291 15.291 0 1 1 15.291-15.291 15.308 15.308 0 0 1-15.291 15.291zm0-29.126a13.835 13.835 0 1 0 13.835 13.835 13.85 13.85 0 0 0-13.835-13.835z" fill="#3f3d56"/>
<circle cx="499.35" cy="45.95" r="5.8251" fill="#014ffd"/>
<polygon points="272.48 356.94 273.88 357.32 242.94 472.84 64.712 472.5 64.715 471.05 241.82 471.39" fill="#3f3d56"/>
<path transform="translate(-208.8 -132.94)" d="m258.98 589.4a15.291 15.291 0 1 1-15.32 15.262 15.308 15.308 0 0 1 15.32-15.262zm-0.05582 29.125a13.835 13.835 0 1 0-13.808-13.861 13.85 13.85 0 0 0 13.808 13.861z" fill="#3f3d56"/>
<circle cx="50.15" cy="471.75" r="5.8251" fill="#014ffd"/>
<polygon points="616.83 600.59 606.55 600.59 608.39 543.7 635.55 545.17" fill="#ffb8b8"/>
<path transform="translate(-208.8 -132.94)" d="m827.04 766.23c-3.1021 1.4158-5.7005-10.055-8.3171-7.4832-7.3191 7.1926-14.882 8.7589-24.651 5.6186l-0.22627-0.03823a4.5752 4.5752 0 0 1-2.8838-5.9622 4.5752 4.5752 0 0 1 3.1743-2.8322l7.7839-1.946 12.222-21.494 12.477-0.84288a29.808 29.808 0 0 1 5.5131 25.429c-1.1322 4.6212-2.8801 8.5415-5.0916 9.5508z" fill="#2f2e41"/>
<polygon points="714.47 593.07 704.91 596.85 685.69 543.28 711.49 534.65" fill="#ffb8b8"/>
<path transform="translate(-208.8 -132.94)" d="m936.6 755.9c-2.3639 2.4575-8.999-7.2532-10.486-3.8996-4.1606 9.3804-10.617 13.618-20.856 14.291l-0.22447 0.04767a4.5752 4.5752 0 0 1-4.8746-4.4836 4.5752 4.5752 0 0 1 1.9101-3.8011l6.5225-4.6725 3.4597-24.482 11.292-5.3728a29.808 29.808 0 0 1 14.479 21.619c0.64682 4.7137 0.46335 9.0021-1.2219 10.754z" fill="#2f2e41"/>
<path transform="translate(-208.8 -132.94)" d="m892.07 451.3-15.778 4.0573a8.2577 8.2577 0 0 1-10.308-7.6802 8.2577 8.2577 0 0 1 8.5179-8.5708l13.898 0.44833 26.781-9.7518-25.313-18.878 2.9364-26.427 49.331 39.604a8.1947 8.1947 0 0 1 3.0437 5.8064 8.1947 8.1947 0 0 1-6.0086 8.4873c-11.559 9.4331-28.399 12.322-47.101 12.904z" fill="#ffb8b8"/>
<circle cx="647.3" cy="193.57" r="25.693" fill="#ffb8b8"/>
<path transform="translate(-208.8 -132.94)" d="m887.67 361.74-34.502 13.948a46.631 46.631 0 0 0-8.075-30.832l28.629-6.6068c-0.37229 8.7438 4.3559 16.56 13.948 23.491z" fill="#ffb8b8"/>
<path transform="translate(-208.8 -132.94)" d="m893.91 421.57c-27.812 2.226-43.025-1.4673-66.435-15.049l8.809-20.554a17.001 17.001 0 0 1 7.0034-16.278l9.1465-6.4788 27.895-8.075 1.2513 0.06256a15.269 15.269 0 0 1 14.462 14.079c6.0602 18.111 6.0995 35.617-2.1325 52.293z" fill="#014ffd"/>
<path transform="translate(-208.8 -132.94)" d="m888.4 464.51-59.461-6.6068-4.4045-19.086c-9.763-14.738-5.5017-28.237 5.8727-41.109 20.733 13.306 39.978 19.056 67.536 14.682-7.3286 17.823-14.097 35.34-9.5431 52.12z" fill="#2f2e41"/>
<path transform="translate(-208.8 -132.94)" d="m934.65 686.94-47.349-2.5693-15.416-122.59-12.479 121.86-56.158-2.5693c17.131-80.111 29.031-156.16 25.693-226.1l58.727 5.1386c19.903 20.986 29.786 54.485 35.603 94.33s10.506 86.036 11.378 132.5z" fill="#2f2e41"/>
<circle cx="675.58" cy="161.34" r="8.8313" fill="#2f2e41"/>
<path transform="translate(-208.8 -132.94)" d="m875.29 292.12a8.8244 8.8244 0 0 1 8.8271-8.2541c-0.18236-0.02313-0.36309-0.05126-0.549-0.06321a8.8313 8.8313 0 0 0-1.1332 17.626c0.18595 0.01195 0.36879 0.0072 0.55261 0.00761a8.8244 8.8244 0 0 1-7.6975-9.3165z" fill="#2f2e41"/>
<path transform="translate(-208.8 -132.94)" d="m875.24 295.89c-7.8761-6.5337-30.467 1.7704-31.925 6.1631-10.651 1.4515-18.715 7.6655-18.715 18.715v6e-5c6.3322 2.5941 13.534 2.2744 21.319 0 12.41 10.113 13.261 22.827 5.7135 37.429l9.285 0.18568 11.509-16.821 0.55038 17.062 21.283-0.42689v-24.451a51.121 51.121 0 0 0-5.4582-23.42c-3.3167-6.4435-8.4638-10.206-13.563-14.436z" fill="#2f2e41"/>
<ellipse cx="646.61" cy="200.24" rx="4.2232" ry="5.9124" fill="#ffb8b8"/>
<path transform="translate(-208.8 -132.94)" d="m823.11 559.93a1.483 1.483 0 0 1 1.483 1.483v59.319a1.483 1.483 0 0 1-1.483 1.483h-42.562a1.483 1.483 0 0 1-1.483-1.483v-59.319a1.483 1.483 0 0 1 1.483-1.483h42.562" fill="#014ffd"/>
<path transform="translate(-208.8 -132.94)" d="m828.94 537.92 1.4373 24.913a10.819 10.819 0 0 1-12.375 11.327c-6.3295-0.93081-6.4734-7.121-4.9217-13.328l5.9117-23.647c14.502-51.998 18.417-103.04 17.684-152.81a12.498 12.498 0 0 1 12.834-12.714 12.491 12.491 0 0 1 12.121 12.927c-2.0529 58.45-10.578 111.53-32.691 153.33z" fill="#ffb8b8"/>
</svg>
