<?xml version="1.0" encoding="UTF-8"?>
<svg xmlns="http://www.w3.org/2000/svg" xmlns:xlink="http://www.w3.org/1999/xlink" width="432pt" height="360pt" viewBox="0 0 432 360" version="1.1">
<defs>
<g>
<symbol overflow="visible" id="glyph0-0">
<path style="stroke:none;" d=""/>
</symbol>
<symbol overflow="visible" id="glyph0-1">
<path style="stroke:none;" d="M 2.421875 -6.359375 C 1.84375 -6.359375 1.3125 -6.09375 0.984375 -5.671875 C 0.578125 -5.109375 0.375 -4.25 0.375 -3.078125 C 0.375 -0.9375 1.078125 0.203125 2.421875 0.203125 C 3.734375 0.203125 4.453125 -0.9375 4.453125 -3.03125 C 4.453125 -4.25 4.265625 -5.078125 3.859375 -5.671875 C 3.53125 -6.109375 3.015625 -6.359375 2.421875 -6.359375 Z M 2.421875 -5.671875 C 3.25 -5.671875 3.671875 -4.828125 3.671875 -3.09375 C 3.671875 -1.28125 3.265625 -0.4375 2.40625 -0.4375 C 1.578125 -0.4375 1.171875 -1.3125 1.171875 -3.0625 C 1.171875 -4.828125 1.578125 -5.671875 2.421875 -5.671875 Z M 2.421875 -5.671875 "/>
</symbol>
<symbol overflow="visible" id="glyph0-2">
<path style="stroke:none;" d="M 1.6875 -0.921875 L 0.765625 -0.921875 L 0.765625 0 L 1.6875 0 Z M 1.6875 -0.921875 "/>
</symbol>
<symbol overflow="visible" id="glyph0-3">
<path style="stroke:none;" d="M 4.453125 -0.765625 L 1.171875 -0.765625 C 1.25 -1.296875 1.53125 -1.625 2.296875 -2.09375 L 3.171875 -2.59375 C 4.046875 -3.0625 4.5 -3.71875 4.5 -4.5 C 4.5 -5.03125 4.28125 -5.53125 3.921875 -5.875 C 3.546875 -6.203125 3.09375 -6.359375 2.5 -6.359375 C 1.703125 -6.359375 1.125 -6.078125 0.78125 -5.53125 C 0.546875 -5.203125 0.453125 -4.796875 0.4375 -4.15625 L 1.21875 -4.15625 C 1.234375 -4.59375 1.296875 -4.84375 1.40625 -5.0625 C 1.59375 -5.4375 2 -5.6875 2.46875 -5.6875 C 3.171875 -5.6875 3.703125 -5.171875 3.703125 -4.484375 C 3.703125 -3.96875 3.40625 -3.53125 2.859375 -3.21875 L 2.046875 -2.75 C 0.75 -2 0.375 -1.40625 0.296875 -0.015625 L 4.453125 -0.015625 Z M 4.453125 -0.765625 "/>
</symbol>
<symbol overflow="visible" id="glyph0-4">
<path style="stroke:none;" d="M 4.1875 -6.234375 L 0.96875 -6.234375 L 0.5 -2.84375 L 1.21875 -2.84375 C 1.578125 -3.265625 1.875 -3.421875 2.359375 -3.421875 C 3.203125 -3.421875 3.71875 -2.84375 3.71875 -1.921875 C 3.71875 -1.03125 3.203125 -0.484375 2.359375 -0.484375 C 1.6875 -0.484375 1.265625 -0.828125 1.078125 -1.53125 L 0.3125 -1.53125 C 0.40625 -1.015625 0.5 -0.78125 0.6875 -0.546875 C 1.03125 -0.078125 1.671875 0.203125 2.375 0.203125 C 3.640625 0.203125 4.515625 -0.71875 4.515625 -2.03125 C 4.515625 -3.265625 3.6875 -4.109375 2.5 -4.109375 C 2.0625 -4.109375 1.703125 -4 1.34375 -3.734375 L 1.59375 -5.46875 L 4.1875 -5.46875 Z M 4.1875 -6.234375 "/>
</symbol>
<symbol overflow="visible" id="glyph0-5">
<path style="stroke:none;" d="M 4.578125 -6.234375 L 0.40625 -6.234375 L 0.40625 -5.46875 L 3.78125 -5.46875 C 2.28125 -3.359375 1.6875 -2.046875 1.21875 0 L 2.046875 0 C 2.390625 -2 3.171875 -3.71875 4.578125 -5.59375 Z M 4.578125 -6.234375 "/>
</symbol>
<symbol overflow="visible" id="glyph0-6">
<path style="stroke:none;" d="M 2.28125 -4.53125 L 2.28125 0 L 3.046875 0 L 3.046875 -6.359375 L 2.546875 -6.359375 C 2.265625 -5.390625 2.09375 -5.25 0.890625 -5.09375 L 0.890625 -4.53125 Z M 2.28125 -4.53125 "/>
</symbol>
<symbol overflow="visible" id="glyph0-7">
<path style="stroke:none;" d="M 1.9375 -2.921875 L 2.359375 -2.921875 C 3.203125 -2.921875 3.65625 -2.53125 3.65625 -1.765625 C 3.65625 -0.96875 3.171875 -0.484375 2.375 -0.484375 C 1.515625 -0.484375 1.109375 -0.921875 1.0625 -1.84375 L 0.28125 -1.84375 C 0.3125 -1.34375 0.40625 -1 0.546875 -0.71875 C 0.875 -0.109375 1.484375 0.203125 2.34375 0.203125 C 3.625 0.203125 4.453125 -0.578125 4.453125 -1.78125 C 4.453125 -2.59375 4.140625 -3.03125 3.390625 -3.296875 C 3.96875 -3.53125 4.265625 -3.96875 4.265625 -4.609375 C 4.265625 -5.703125 3.546875 -6.359375 2.359375 -6.359375 C 1.109375 -6.359375 0.4375 -5.65625 0.40625 -4.3125 L 1.1875 -4.3125 C 1.203125 -4.703125 1.234375 -4.921875 1.328125 -5.109375 C 1.5 -5.46875 1.890625 -5.6875 2.375 -5.6875 C 3.0625 -5.6875 3.46875 -5.265625 3.46875 -4.578125 C 3.46875 -4.140625 3.3125 -3.859375 2.96875 -3.71875 C 2.765625 -3.625 2.484375 -3.59375 1.9375 -3.578125 Z M 1.9375 -2.921875 "/>
</symbol>
<symbol overflow="visible" id="glyph0-8">
<path style="stroke:none;" d="M 2.875 -1.546875 L 2.875 0 L 3.65625 0 L 3.65625 -1.546875 L 4.578125 -1.546875 L 4.578125 -2.234375 L 3.65625 -2.234375 L 3.65625 -6.359375 L 3.078125 -6.359375 L 0.25 -2.359375 L 0.25 -1.546875 Z M 2.875 -2.234375 L 0.921875 -2.234375 L 2.875 -5.046875 Z M 2.875 -2.234375 "/>
</symbol>
<symbol overflow="visible" id="glyph1-0">
<path style="stroke:none;" d=""/>
</symbol>
<symbol overflow="visible" id="glyph1-1">
<path style="stroke:none;" d="M 6.09375 0 L 7.78125 -5.765625 L 6.75 -5.765625 L 5.609375 -1.28125 L 4.484375 -5.765625 L 3.359375 -5.765625 L 2.25 -1.28125 L 1.078125 -5.765625 L 0.0625 -5.765625 L 1.734375 0 L 2.765625 0 L 3.890625 -4.515625 L 5.046875 0 Z M 6.09375 0 "/>
</symbol>
<symbol overflow="visible" id="glyph1-2">
<path style="stroke:none;" d="M 2.796875 -5.765625 L 1.84375 -5.765625 L 1.84375 -7.34375 L 0.9375 -7.34375 L 0.9375 -5.765625 L 0.15625 -5.765625 L 0.15625 -5.015625 L 0.9375 -5.015625 L 0.9375 -0.65625 C 0.9375 -0.0625 1.328125 0.25 2.046875 0.25 C 2.28125 0.25 2.484375 0.234375 2.796875 0.171875 L 2.796875 -0.59375 C 2.65625 -0.5625 2.546875 -0.546875 2.359375 -0.546875 C 1.953125 -0.546875 1.84375 -0.65625 1.84375 -1.0625 L 1.84375 -5.015625 L 2.796875 -5.015625 Z M 2.796875 -5.765625 "/>
</symbol>
<symbol overflow="visible" id="glyph2-0">
<path style="stroke:none;" d=""/>
</symbol>
<symbol overflow="visible" id="glyph2-1">
<path style="stroke:none;" d="M -8.015625 -5.4375 L -8.015625 -4.53125 L -5.03125 -4.53125 C -5.625 -4.140625 -5.921875 -3.53125 -5.921875 -2.765625 C -5.921875 -1.265625 -4.734375 -0.28125 -2.890625 -0.28125 C -0.953125 -0.28125 0.25 -1.234375 0.25 -2.796875 C 0.25 -3.59375 -0.046875 -4.140625 -0.765625 -4.625 L 0 -4.625 L 0 -5.4375 Z M -5.078125 -2.921875 C -5.078125 -3.90625 -4.203125 -4.53125 -2.8125 -4.53125 C -1.484375 -4.53125 -0.609375 -3.890625 -0.609375 -2.921875 C -0.609375 -1.90625 -1.5 -1.25 -2.84375 -1.25 C -4.1875 -1.25 -5.078125 -1.90625 -5.078125 -2.921875 Z M -5.078125 -2.921875 "/>
</symbol>
<symbol overflow="visible" id="glyph2-2">
<path style="stroke:none;" d="M -2.578125 -5.640625 C -3.453125 -5.640625 -3.984375 -5.578125 -4.40625 -5.40625 C -5.359375 -5.03125 -5.921875 -4.15625 -5.921875 -3.078125 C -5.921875 -1.46875 -4.703125 -0.4375 -2.8125 -0.4375 C -0.90625 -0.4375 0.25 -1.4375 0.25 -3.0625 C 0.25 -4.375 -0.5 -5.296875 -1.75 -5.515625 L -1.75 -4.59375 C -0.984375 -4.34375 -0.59375 -3.828125 -0.59375 -3.09375 C -0.59375 -2.515625 -0.859375 -2.015625 -1.34375 -1.703125 C -1.671875 -1.484375 -2 -1.40625 -2.578125 -1.390625 Z M -3.328125 -1.421875 C -4.390625 -1.5 -5.078125 -2.140625 -5.078125 -3.0625 C -5.078125 -4 -4.359375 -4.65625 -3.328125 -4.65625 Z M -3.328125 -1.421875 "/>
</symbol>
<symbol overflow="visible" id="glyph2-3">
<path style="stroke:none;" d="M -5.765625 -0.765625 L 0 -0.765625 L 0 -1.6875 L -3.171875 -1.6875 C -4.359375 -1.6875 -5.125 -2.3125 -5.125 -3.25 C -5.125 -3.984375 -4.6875 -4.4375 -4 -4.4375 L 0 -4.4375 L 0 -5.359375 L -4.359375 -5.359375 C -5.3125 -5.359375 -5.921875 -4.640625 -5.921875 -3.53125 C -5.921875 -2.671875 -5.59375 -2.125 -4.796875 -1.609375 L -5.765625 -1.609375 Z M -5.765625 -0.765625 "/>
</symbol>
<symbol overflow="visible" id="glyph2-4">
<path style="stroke:none;" d="M -4.15625 -4.8125 C -5.296875 -4.8125 -5.921875 -4.0625 -5.921875 -2.734375 C -5.921875 -1.390625 -5.234375 -0.515625 -4.171875 -0.515625 C -3.265625 -0.515625 -2.84375 -0.984375 -2.515625 -2.34375 L -2.296875 -3.203125 C -2.140625 -3.84375 -1.90625 -4.09375 -1.5 -4.09375 C -0.953125 -4.09375 -0.59375 -3.546875 -0.59375 -2.75 C -0.59375 -2.25 -0.734375 -1.84375 -0.984375 -1.609375 C -1.140625 -1.46875 -1.3125 -1.390625 -1.71875 -1.34375 L -1.71875 -0.375 C -0.390625 -0.421875 0.25 -1.171875 0.25 -2.671875 C 0.25 -4.125 -0.46875 -5.046875 -1.578125 -5.046875 C -2.4375 -5.046875 -2.90625 -4.5625 -3.171875 -3.421875 L -3.390625 -2.546875 C -3.5625 -1.796875 -3.8125 -1.46875 -4.21875 -1.46875 C -4.75 -1.46875 -5.078125 -1.953125 -5.078125 -2.6875 C -5.078125 -3.4375 -4.765625 -3.828125 -4.15625 -3.84375 Z M -4.15625 -4.8125 "/>
</symbol>
<symbol overflow="visible" id="glyph2-5">
<path style="stroke:none;" d="M -5.765625 -1.65625 L -5.765625 -0.734375 L 0 -0.734375 L 0 -1.65625 Z M -8.015625 -1.65625 L -8.015625 -0.71875 L -6.859375 -0.71875 L -6.859375 -1.65625 Z M -8.015625 -1.65625 "/>
</symbol>
<symbol overflow="visible" id="glyph2-6">
<path style="stroke:none;" d="M -5.765625 -2.796875 L -5.765625 -1.84375 L -7.34375 -1.84375 L -7.34375 -0.9375 L -5.765625 -0.9375 L -5.765625 -0.15625 L -5.015625 -0.15625 L -5.015625 -0.9375 L -0.65625 -0.9375 C -0.0625 -0.9375 0.25 -1.328125 0.25 -2.046875 C 0.25 -2.28125 0.234375 -2.484375 0.171875 -2.796875 L -0.59375 -2.796875 C -0.5625 -2.65625 -0.546875 -2.546875 -0.546875 -2.359375 C -0.546875 -1.953125 -0.65625 -1.84375 -1.0625 -1.84375 L -5.015625 -1.84375 L -5.015625 -2.796875 Z M -5.765625 -2.796875 "/>
</symbol>
<symbol overflow="visible" id="glyph2-7">
<path style="stroke:none;" d="M -5.765625 -4.265625 L -1.28125 -2.671875 L -5.765625 -1.203125 L -5.765625 -0.21875 L 0.015625 -2.171875 L 0.9375 -1.8125 C 1.34375 -1.65625 1.5 -1.46875 1.5 -1.078125 C 1.5 -0.921875 1.46875 -0.796875 1.4375 -0.59375 L 2.25 -0.59375 C 2.359375 -0.78125 2.390625 -0.96875 2.390625 -1.203125 C 2.390625 -1.5 2.296875 -1.828125 2.125 -2.0625 C 1.90625 -2.359375 1.671875 -2.515625 1.203125 -2.6875 L -5.765625 -5.265625 Z M -5.765625 -4.265625 "/>
</symbol>
</g>
<clipPath id="clip1">
  <path d="M 42.152344 5.480469 L 426.523438 5.480469 L 426.523438 325.851562 L 42.152344 325.851562 Z M 42.152344 5.480469 "/>
</clipPath>
<clipPath id="clip2">
  <path d="M 42.152344 273 L 426.523438 273 L 426.523438 274 L 42.152344 274 Z M 42.152344 273 "/>
</clipPath>
<clipPath id="clip3">
  <path d="M 42.152344 197 L 426.523438 197 L 426.523438 198 L 42.152344 198 Z M 42.152344 197 "/>
</clipPath>
<clipPath id="clip4">
  <path d="M 42.152344 121 L 426.523438 121 L 426.523438 122 L 42.152344 122 Z M 42.152344 121 "/>
</clipPath>
<clipPath id="clip5">
  <path d="M 42.152344 45 L 426.523438 45 L 426.523438 46 L 42.152344 46 Z M 42.152344 45 "/>
</clipPath>
<clipPath id="clip6">
  <path d="M 69 5.480469 L 70 5.480469 L 70 325.851562 L 69 325.851562 Z M 69 5.480469 "/>
</clipPath>
<clipPath id="clip7">
  <path d="M 154 5.480469 L 156 5.480469 L 156 325.851562 L 154 325.851562 Z M 154 5.480469 "/>
</clipPath>
<clipPath id="clip8">
  <path d="M 240 5.480469 L 242 5.480469 L 242 325.851562 L 240 325.851562 Z M 240 5.480469 "/>
</clipPath>
<clipPath id="clip9">
  <path d="M 326 5.480469 L 328 5.480469 L 328 325.851562 L 326 325.851562 Z M 326 5.480469 "/>
</clipPath>
<clipPath id="clip10">
  <path d="M 412 5.480469 L 413 5.480469 L 413 325.851562 L 412 325.851562 Z M 412 5.480469 "/>
</clipPath>
<clipPath id="clip11">
  <path d="M 42.152344 310 L 426.523438 310 L 426.523438 312 L 42.152344 312 Z M 42.152344 310 "/>
</clipPath>
<clipPath id="clip12">
  <path d="M 42.152344 234 L 426.523438 234 L 426.523438 236 L 42.152344 236 Z M 42.152344 234 "/>
</clipPath>
<clipPath id="clip13">
  <path d="M 42.152344 158 L 426.523438 158 L 426.523438 160 L 42.152344 160 Z M 42.152344 158 "/>
</clipPath>
<clipPath id="clip14">
  <path d="M 42.152344 82 L 426.523438 82 L 426.523438 85 L 42.152344 85 Z M 42.152344 82 "/>
</clipPath>
<clipPath id="clip15">
  <path d="M 42.152344 7 L 426.523438 7 L 426.523438 9 L 42.152344 9 Z M 42.152344 7 "/>
</clipPath>
<clipPath id="clip16">
  <path d="M 111 5.480469 L 113 5.480469 L 113 325.851562 L 111 325.851562 Z M 111 5.480469 "/>
</clipPath>
<clipPath id="clip17">
  <path d="M 197 5.480469 L 199 5.480469 L 199 325.851562 L 197 325.851562 Z M 197 5.480469 "/>
</clipPath>
<clipPath id="clip18">
  <path d="M 283 5.480469 L 285 5.480469 L 285 325.851562 L 283 325.851562 Z M 283 5.480469 "/>
</clipPath>
<clipPath id="clip19">
  <path d="M 369 5.480469 L 371 5.480469 L 371 325.851562 L 369 325.851562 Z M 369 5.480469 "/>
</clipPath>
</defs>
<g id="surface5">
<rect x="0" y="0" width="432" height="360" style="fill:rgb(100%,100%,100%);fill-opacity:1;stroke:none;"/>
<rect x="0" y="0" width="432" height="360" style="fill:rgb(100%,100%,100%);fill-opacity:1;stroke:none;"/>
<path style="fill:none;stroke-width:1.066978;stroke-linecap:round;stroke-linejoin:round;stroke:rgb(100%,100%,100%);stroke-opacity:1;stroke-miterlimit:10;" d="M 0 360 L 432 360 L 432 0 L 0 0 Z M 0 360 "/>
<g clip-path="url(#clip1)" clip-rule="nonzero">
<path style=" stroke:none;fill-rule:nonzero;fill:rgb(92.156863%,92.156863%,92.156863%);fill-opacity:1;" d="M 42.152344 325.847656 L 426.523438 325.847656 L 426.523438 5.476562 L 42.152344 5.476562 Z M 42.152344 325.847656 "/>
</g>
<g clip-path="url(#clip2)" clip-rule="nonzero">
<path style="fill:none;stroke-width:0.533489;stroke-linecap:butt;stroke-linejoin:round;stroke:rgb(100%,100%,100%);stroke-opacity:1;stroke-miterlimit:10;" d="M 42.152344 273.320312 L 426.519531 273.320312 "/>
</g>
<g clip-path="url(#clip3)" clip-rule="nonzero">
<path style="fill:none;stroke-width:0.533489;stroke-linecap:butt;stroke-linejoin:round;stroke:rgb(100%,100%,100%);stroke-opacity:1;stroke-miterlimit:10;" d="M 42.152344 197.382812 L 426.519531 197.382812 "/>
</g>
<g clip-path="url(#clip4)" clip-rule="nonzero">
<path style="fill:none;stroke-width:0.533489;stroke-linecap:butt;stroke-linejoin:round;stroke:rgb(100%,100%,100%);stroke-opacity:1;stroke-miterlimit:10;" d="M 42.152344 121.445312 L 426.519531 121.445312 "/>
</g>
<g clip-path="url(#clip5)" clip-rule="nonzero">
<path style="fill:none;stroke-width:0.533489;stroke-linecap:butt;stroke-linejoin:round;stroke:rgb(100%,100%,100%);stroke-opacity:1;stroke-miterlimit:10;" d="M 42.152344 45.507812 L 426.519531 45.507812 "/>
</g>
<g clip-path="url(#clip6)" clip-rule="nonzero">
<path style="fill:none;stroke-width:0.533489;stroke-linecap:butt;stroke-linejoin:round;stroke:rgb(100%,100%,100%);stroke-opacity:1;stroke-miterlimit:10;" d="M 69.472656 325.847656 L 69.472656 5.480469 "/>
</g>
<g clip-path="url(#clip7)" clip-rule="nonzero">
<path style="fill:none;stroke-width:0.533489;stroke-linecap:butt;stroke-linejoin:round;stroke:rgb(100%,100%,100%);stroke-opacity:1;stroke-miterlimit:10;" d="M 155.242188 325.847656 L 155.242188 5.480469 "/>
</g>
<g clip-path="url(#clip8)" clip-rule="nonzero">
<path style="fill:none;stroke-width:0.533489;stroke-linecap:butt;stroke-linejoin:round;stroke:rgb(100%,100%,100%);stroke-opacity:1;stroke-miterlimit:10;" d="M 241.015625 325.847656 L 241.015625 5.480469 "/>
</g>
<g clip-path="url(#clip9)" clip-rule="nonzero">
<path style="fill:none;stroke-width:0.533489;stroke-linecap:butt;stroke-linejoin:round;stroke:rgb(100%,100%,100%);stroke-opacity:1;stroke-miterlimit:10;" d="M 326.785156 325.847656 L 326.785156 5.480469 "/>
</g>
<g clip-path="url(#clip10)" clip-rule="nonzero">
<path style="fill:none;stroke-width:0.533489;stroke-linecap:butt;stroke-linejoin:round;stroke:rgb(100%,100%,100%);stroke-opacity:1;stroke-miterlimit:10;" d="M 412.558594 325.847656 L 412.558594 5.480469 "/>
</g>
<g clip-path="url(#clip11)" clip-rule="nonzero">
<path style="fill:none;stroke-width:1.066978;stroke-linecap:butt;stroke-linejoin:round;stroke:rgb(100%,100%,100%);stroke-opacity:1;stroke-miterlimit:10;" d="M 42.152344 311.285156 L 426.519531 311.285156 "/>
</g>
<g clip-path="url(#clip12)" clip-rule="nonzero">
<path style="fill:none;stroke-width:1.066978;stroke-linecap:butt;stroke-linejoin:round;stroke:rgb(100%,100%,100%);stroke-opacity:1;stroke-miterlimit:10;" d="M 42.152344 235.351562 L 426.519531 235.351562 "/>
</g>
<g clip-path="url(#clip13)" clip-rule="nonzero">
<path style="fill:none;stroke-width:1.066978;stroke-linecap:butt;stroke-linejoin:round;stroke:rgb(100%,100%,100%);stroke-opacity:1;stroke-miterlimit:10;" d="M 42.152344 159.414062 L 426.519531 159.414062 "/>
</g>
<g clip-path="url(#clip14)" clip-rule="nonzero">
<path style="fill:none;stroke-width:1.066978;stroke-linecap:butt;stroke-linejoin:round;stroke:rgb(100%,100%,100%);stroke-opacity:1;stroke-miterlimit:10;" d="M 42.152344 83.476562 L 426.519531 83.476562 "/>
</g>
<g clip-path="url(#clip15)" clip-rule="nonzero">
<path style="fill:none;stroke-width:1.066978;stroke-linecap:butt;stroke-linejoin:round;stroke:rgb(100%,100%,100%);stroke-opacity:1;stroke-miterlimit:10;" d="M 42.152344 7.539062 L 426.519531 7.539062 "/>
</g>
<g clip-path="url(#clip16)" clip-rule="nonzero">
<path style="fill:none;stroke-width:1.066978;stroke-linecap:butt;stroke-linejoin:round;stroke:rgb(100%,100%,100%);stroke-opacity:1;stroke-miterlimit:10;" d="M 112.359375 325.847656 L 112.359375 5.480469 "/>
</g>
<g clip-path="url(#clip17)" clip-rule="nonzero">
<path style="fill:none;stroke-width:1.066978;stroke-linecap:butt;stroke-linejoin:round;stroke:rgb(100%,100%,100%);stroke-opacity:1;stroke-miterlimit:10;" d="M 198.128906 325.847656 L 198.128906 5.480469 "/>
</g>
<g clip-path="url(#clip18)" clip-rule="nonzero">
<path style="fill:none;stroke-width:1.066978;stroke-linecap:butt;stroke-linejoin:round;stroke:rgb(100%,100%,100%);stroke-opacity:1;stroke-miterlimit:10;" d="M 283.902344 325.847656 L 283.902344 5.480469 "/>
</g>
<g clip-path="url(#clip19)" clip-rule="nonzero">
<path style="fill:none;stroke-width:1.066978;stroke-linecap:butt;stroke-linejoin:round;stroke:rgb(100%,100%,100%);stroke-opacity:1;stroke-miterlimit:10;" d="M 369.671875 325.847656 L 369.671875 5.480469 "/>
</g>
<path style=" stroke:none;fill-rule:nonzero;fill:rgb(34.901961%,34.901961%,34.901961%);fill-opacity:0.501961;" d="M 59.621094 311.285156 L 73.597656 311.285156 L 73.597656 253.035156 L 59.621094 253.035156 Z M 59.621094 311.285156 "/>
<path style=" stroke:none;fill-rule:nonzero;fill:rgb(34.901961%,34.901961%,34.901961%);fill-opacity:0.501961;" d="M 73.597656 311.285156 L 87.574219 311.285156 L 87.574219 253.035156 L 73.597656 253.035156 Z M 73.597656 311.285156 "/>
<path style=" stroke:none;fill-rule:nonzero;fill:rgb(34.901961%,34.901961%,34.901961%);fill-opacity:0.501961;" d="M 87.578125 311.285156 L 101.554688 311.285156 L 101.554688 253.035156 L 87.578125 253.035156 Z M 87.578125 311.285156 "/>
<path style=" stroke:none;fill-rule:nonzero;fill:rgb(34.901961%,34.901961%,34.901961%);fill-opacity:0.501961;" d="M 101.554688 311.285156 L 115.53125 311.285156 L 115.53125 253.035156 L 101.554688 253.035156 Z M 101.554688 311.285156 "/>
<path style=" stroke:none;fill-rule:nonzero;fill:rgb(34.901961%,34.901961%,34.901961%);fill-opacity:0.501961;" d="M 115.53125 311.285156 L 129.507812 311.285156 L 129.507812 253.035156 L 115.53125 253.035156 Z M 115.53125 311.285156 "/>
<path style=" stroke:none;fill-rule:nonzero;fill:rgb(34.901961%,34.901961%,34.901961%);fill-opacity:0.501961;" d="M 129.507812 311.285156 L 143.484375 311.285156 L 143.484375 194.785156 L 129.507812 194.785156 Z M 129.507812 311.285156 "/>
<path style=" stroke:none;fill-rule:nonzero;fill:rgb(34.901961%,34.901961%,34.901961%);fill-opacity:0.501961;" d="M 143.484375 311.285156 L 157.460938 311.285156 L 157.460938 253.035156 L 143.484375 253.035156 Z M 143.484375 311.285156 "/>
<path style=" stroke:none;fill-rule:nonzero;fill:rgb(34.901961%,34.901961%,34.901961%);fill-opacity:0.501961;" d="M 157.460938 311.285156 L 171.4375 311.285156 L 171.4375 253.035156 L 157.460938 253.035156 Z M 157.460938 311.285156 "/>
<path style=" stroke:none;fill-rule:nonzero;fill:rgb(34.901961%,34.901961%,34.901961%);fill-opacity:0.501961;" d="M 171.4375 311.285156 L 185.414062 311.285156 L 185.414062 194.785156 L 171.4375 194.785156 Z M 171.4375 311.285156 "/>
<path style=" stroke:none;fill-rule:nonzero;fill:rgb(34.901961%,34.901961%,34.901961%);fill-opacity:0.501961;" d="M 185.414062 311.285156 L 199.390625 311.285156 L 199.390625 253.035156 L 185.414062 253.035156 Z M 185.414062 311.285156 "/>
<path style=" stroke:none;fill-rule:nonzero;fill:rgb(34.901961%,34.901961%,34.901961%);fill-opacity:0.501961;" d="M 199.394531 311.285156 L 213.371094 311.285156 L 213.371094 194.785156 L 199.394531 194.785156 Z M 199.394531 311.285156 "/>
<path style=" stroke:none;fill-rule:nonzero;fill:rgb(34.901961%,34.901961%,34.901961%);fill-opacity:0.501961;" d="M 213.371094 311.285156 L 227.347656 311.285156 L 227.347656 194.785156 L 213.371094 194.785156 Z M 213.371094 311.285156 "/>
<path style=" stroke:none;fill-rule:nonzero;fill:rgb(34.901961%,34.901961%,34.901961%);fill-opacity:0.501961;" d="M 227.347656 311.285156 L 241.324219 311.285156 L 241.324219 20.039062 L 227.347656 20.039062 Z M 227.347656 311.285156 "/>
<path style=" stroke:none;fill-rule:nonzero;fill:rgb(34.901961%,34.901961%,34.901961%);fill-opacity:0.501961;" d="M 241.324219 311.285156 L 255.300781 311.285156 L 255.300781 136.539062 L 241.324219 136.539062 Z M 241.324219 311.285156 "/>
<path style=" stroke:none;fill-rule:nonzero;fill:rgb(34.901961%,34.901961%,34.901961%);fill-opacity:0.501961;" d="M 255.300781 311.285156 L 269.277344 311.285156 L 269.277344 194.785156 L 255.300781 194.785156 Z M 255.300781 311.285156 "/>
<path style=" stroke:none;fill-rule:nonzero;fill:rgb(34.901961%,34.901961%,34.901961%);fill-opacity:0.501961;" d="M 269.277344 311.285156 L 283.253906 311.285156 L 283.253906 194.785156 L 269.277344 194.785156 Z M 269.277344 311.285156 "/>
<path style=" stroke:none;fill-rule:nonzero;fill:rgb(34.901961%,34.901961%,34.901961%);fill-opacity:0.501961;" d="M 283.253906 311.285156 L 297.230469 311.285156 L 297.230469 253.035156 L 283.253906 253.035156 Z M 283.253906 311.285156 "/>
<path style=" stroke:none;fill-rule:nonzero;fill:rgb(34.901961%,34.901961%,34.901961%);fill-opacity:0.501961;" d="M 381.09375 311.285156 L 395.070312 311.285156 L 395.070312 253.035156 L 381.09375 253.035156 Z M 381.09375 311.285156 "/>
<path style=" stroke:none;fill-rule:nonzero;fill:rgb(34.901961%,34.901961%,34.901961%);fill-opacity:0.501961;" d="M 395.070312 311.285156 L 409.046875 311.285156 L 409.046875 194.785156 L 395.070312 194.785156 Z M 395.070312 311.285156 "/>
<path style="fill:none;stroke-width:1.066978;stroke-linecap:butt;stroke-linejoin:round;stroke:rgb(0%,0%,0%);stroke-opacity:0.501961;stroke-miterlimit:10;" d="M 70.589844 272.8125 L 71.246094 272.246094 L 72.558594 271.121094 L 73.871094 270.003906 L 74.527344 269.449219 L 75.183594 268.898438 L 76.496094 267.804688 L 77.808594 266.726562 L 79.121094 265.664062 L 79.777344 265.136719 L 81.089844 264.097656 L 81.746094 263.585938 L 82.40625 263.074219 L 83.0625 262.570312 L 84.375 261.578125 L 85.03125 261.085938 L 85.6875 260.601562 L 86.34375 260.121094 L 87.65625 259.175781 L 88.3125 258.710938 L 88.96875 258.25 L 89.625 257.796875 L 90.28125 257.347656 L 90.9375 256.902344 L 91.59375 256.464844 L 92.25 256.03125 L 92.90625 255.601562 L 93.5625 255.179688 L 94.21875 254.761719 L 94.878906 254.351562 L 95.535156 253.941406 L 96.847656 253.144531 L 97.503906 252.753906 L 98.816406 251.988281 L 99.472656 251.613281 L 100.128906 251.242188 L 100.785156 250.878906 L 101.441406 250.519531 L 102.097656 250.164062 L 103.410156 249.46875 L 104.722656 248.796875 L 105.378906 248.46875 L 106.035156 248.144531 L 106.695312 247.824219 L 107.351562 247.507812 L 108.664062 246.890625 L 109.320312 246.589844 L 109.976562 246.292969 L 111.289062 245.714844 L 111.945312 245.429688 L 113.257812 244.875 L 114.570312 244.335938 L 115.226562 244.074219 L 116.539062 243.558594 L 117.851562 243.058594 L 118.507812 242.816406 L 119.167969 242.574219 L 121.136719 241.871094 L 121.792969 241.644531 L 123.105469 241.199219 L 124.417969 240.761719 L 125.074219 240.550781 L 125.730469 240.335938 L 127.042969 239.921875 L 128.355469 239.515625 L 129.667969 239.117188 L 130.980469 238.726562 L 131.640625 238.53125 L 133.609375 237.957031 L 138.859375 236.457031 L 139.515625 236.273438 L 140.171875 236.085938 L 140.828125 235.894531 L 142.140625 235.519531 L 143.453125 235.136719 L 144.113281 234.941406 L 145.425781 234.550781 L 146.082031 234.351562 L 148.050781 233.742188 L 149.363281 233.320312 L 150.019531 233.105469 L 151.332031 232.667969 L 152.644531 232.214844 L 153.300781 231.980469 L 153.957031 231.742188 L 154.613281 231.5 L 155.269531 231.253906 L 155.929688 231.003906 L 157.242188 230.488281 L 157.898438 230.21875 L 158.554688 229.945312 L 159.210938 229.667969 L 159.867188 229.382812 L 160.523438 229.09375 L 161.179688 228.792969 L 161.835938 228.488281 L 162.492188 228.175781 L 163.148438 227.855469 L 163.804688 227.53125 L 164.460938 227.195312 L 165.117188 226.855469 L 165.773438 226.503906 L 166.429688 226.144531 L 167.085938 225.78125 L 167.742188 225.402344 L 168.402344 225.019531 L 169.058594 224.625 L 169.714844 224.222656 L 170.371094 223.8125 L 171.027344 223.386719 L 171.683594 222.957031 L 172.339844 222.515625 L 172.996094 222.0625 L 173.652344 221.601562 L 174.308594 221.125 L 174.964844 220.644531 L 175.621094 220.144531 L 176.277344 219.640625 L 176.933594 219.125 L 177.589844 218.59375 L 178.246094 218.058594 L 178.902344 217.503906 L 179.558594 216.945312 L 180.214844 216.367188 L 180.875 215.78125 L 181.53125 215.183594 L 182.1875 214.570312 L 182.84375 213.953125 L 184.15625 212.671875 L 184.8125 212.011719 L 185.46875 211.339844 L 186.125 210.660156 L 186.78125 209.964844 L 187.4375 209.261719 L 188.09375 208.542969 L 188.75 207.816406 L 189.40625 207.078125 L 190.0625 206.324219 L 190.71875 205.566406 L 191.375 204.789062 L 192.03125 204.007812 L 192.6875 203.210938 L 193.347656 202.40625 L 194.003906 201.597656 L 195.316406 199.941406 L 195.972656 199.097656 L 196.628906 198.246094 L 197.285156 197.390625 L 197.941406 196.523438 L 198.597656 195.652344 L 199.253906 194.773438 L 199.910156 193.886719 L 200.566406 192.996094 L 201.222656 192.101562 L 201.878906 191.203125 L 203.191406 189.390625 L 203.847656 188.476562 L 204.503906 187.566406 L 205.164062 186.652344 L 207.132812 183.910156 L 208.445312 182.089844 L 209.101562 181.183594 L 209.757812 180.28125 L 211.070312 178.492188 L 211.726562 177.605469 L 212.382812 176.730469 L 213.039062 175.859375 L 213.695312 175 L 214.351562 174.148438 L 215.007812 173.308594 L 215.664062 172.480469 L 216.320312 171.664062 L 216.976562 170.863281 L 217.636719 170.074219 L 218.292969 169.304688 L 218.949219 168.546875 L 219.605469 167.808594 L 220.261719 167.089844 L 220.917969 166.382812 L 221.574219 165.710938 L 222.230469 165.042969 L 222.886719 164.40625 L 223.542969 163.792969 L 224.199219 163.191406 L 224.855469 162.628906 L 225.511719 162.078125 L 226.167969 161.566406 L 226.824219 161.070312 L 227.480469 160.601562 L 228.136719 160.171875 L 228.792969 159.75 L 229.449219 159.382812 L 230.109375 159.027344 L 230.765625 158.710938 L 231.421875 158.425781 L 232.078125 158.160156 L 232.734375 157.945312 L 233.390625 157.75 L 234.046875 157.597656 L 234.703125 157.472656 L 235.359375 157.378906 L 236.015625 157.332031 L 236.671875 157.300781 L 237.328125 157.324219 L 237.984375 157.371094 L 238.640625 157.457031 L 239.296875 157.585938 L 239.953125 157.734375 L 240.609375 157.9375 L 241.265625 158.164062 L 241.921875 158.4375 L 242.582031 158.742188 L 243.238281 159.074219 L 243.894531 159.460938 L 244.550781 159.863281 L 245.207031 160.324219 L 245.863281 160.808594 L 246.519531 161.328125 L 247.175781 161.890625 L 247.832031 162.472656 L 248.488281 163.113281 L 249.144531 163.769531 L 249.800781 164.46875 L 250.457031 165.203125 L 251.113281 165.960938 L 251.769531 166.769531 L 252.425781 167.59375 L 253.082031 168.464844 L 253.738281 169.359375 L 254.394531 170.28125 L 255.054688 171.242188 L 255.710938 172.222656 L 256.367188 173.246094 L 257.023438 174.289062 L 257.679688 175.363281 L 258.335938 176.464844 L 258.992188 177.582031 L 259.648438 178.742188 L 260.304688 179.917969 L 260.960938 181.121094 L 261.617188 182.347656 L 262.273438 183.589844 L 262.929688 184.863281 L 263.585938 186.148438 L 264.242188 187.464844 L 264.898438 188.792969 L 265.554688 190.136719 L 266.210938 191.507812 L 266.871094 192.882812 L 267.527344 194.285156 L 268.183594 195.695312 L 268.839844 197.121094 L 269.496094 198.5625 L 270.152344 200.011719 L 270.808594 201.476562 L 271.464844 202.945312 L 272.121094 204.429688 L 272.777344 205.921875 L 273.433594 207.417969 L 274.746094 210.433594 L 275.402344 211.949219 L 276.058594 213.46875 L 276.714844 214.992188 L 278.683594 219.574219 L 279.34375 221.101562 L 280.65625 224.15625 L 281.3125 225.679688 L 281.96875 227.199219 L 282.625 228.714844 L 283.9375 231.730469 L 284.59375 233.230469 L 285.25 234.722656 L 285.90625 236.210938 L 287.21875 239.15625 L 287.875 240.613281 L 288.53125 242.0625 L 289.1875 243.5 L 289.84375 244.925781 L 290.5 246.34375 L 291.15625 247.746094 L 291.816406 249.136719 L 292.472656 250.515625 L 293.128906 251.875 L 293.785156 253.230469 L 294.441406 254.558594 L 295.097656 255.878906 L 295.753906 257.183594 L 296.410156 258.46875 L 297.066406 259.746094 L 297.722656 260.996094 L 298.378906 262.234375 L 299.035156 263.453125 L 299.691406 264.65625 L 300.347656 265.84375 L 301.003906 267.007812 L 301.660156 268.160156 L 302.316406 269.285156 L 302.972656 270.398438 L 303.628906 271.492188 L 304.289062 272.5625 L 304.945312 273.621094 L 305.601562 274.648438 L 306.257812 275.664062 L 306.914062 276.65625 L 307.570312 277.632812 L 308.226562 278.589844 L 308.882812 279.519531 L 309.539062 280.4375 L 310.195312 281.328125 L 310.851562 282.199219 L 311.507812 283.054688 L 312.164062 283.882812 L 312.820312 284.703125 L 313.476562 285.488281 L 314.132812 286.261719 L 314.789062 287.011719 L 315.445312 287.742188 L 316.105469 288.457031 L 316.761719 289.140625 L 317.417969 289.8125 L 318.074219 290.460938 L 318.730469 291.089844 L 319.386719 291.703125 L 320.042969 292.285156 L 320.699219 292.863281 L 321.355469 293.40625 L 322.011719 293.9375 L 322.667969 294.449219 L 323.324219 294.9375 L 323.980469 295.414062 L 324.636719 295.859375 L 325.292969 296.296875 L 325.949219 296.707031 L 326.605469 297.101562 L 327.261719 297.480469 L 327.917969 297.835938 L 328.578125 298.179688 L 329.234375 298.496094 L 329.890625 298.800781 L 330.546875 299.085938 L 331.203125 299.347656 L 331.859375 299.601562 L 332.515625 299.828125 L 333.171875 300.042969 L 333.828125 300.238281 L 334.484375 300.417969 L 335.140625 300.582031 L 335.796875 300.722656 L 336.453125 300.855469 L 337.109375 300.964844 L 337.765625 301.058594 L 338.421875 301.140625 L 339.078125 301.199219 L 339.734375 301.253906 L 340.390625 301.28125 L 341.050781 301.296875 L 341.707031 301.296875 L 342.363281 301.28125 L 343.019531 301.257812 L 343.675781 301.210938 L 344.332031 301.152344 L 344.988281 301.078125 L 345.644531 300.992188 L 346.300781 300.894531 L 346.957031 300.777344 L 347.613281 300.652344 L 348.269531 300.507812 L 348.925781 300.355469 L 349.582031 300.191406 L 350.238281 300.011719 L 350.894531 299.824219 L 351.550781 299.617188 L 352.207031 299.402344 L 352.863281 299.175781 L 353.523438 298.9375 L 354.179688 298.695312 L 354.835938 298.433594 L 355.492188 298.167969 L 356.148438 297.886719 L 356.804688 297.597656 L 357.460938 297.304688 L 358.117188 296.996094 L 358.773438 296.683594 L 359.429688 296.359375 L 360.085938 296.03125 L 360.742188 295.695312 L 362.054688 295 L 363.367188 294.28125 L 364.679688 293.539062 L 365.335938 293.164062 L 365.996094 292.78125 L 366.652344 292.398438 L 368.621094 291.226562 L 370.589844 290.042969 L 371.246094 289.644531 L 373.214844 288.460938 L 374.527344 287.679688 L 375.183594 287.292969 L 375.839844 286.910156 L 376.496094 286.53125 L 377.152344 286.15625 L 377.8125 285.785156 L 378.46875 285.421875 L 379.125 285.0625 L 379.78125 284.710938 L 380.4375 284.367188 L 381.09375 284.027344 L 381.75 283.699219 L 382.40625 283.375 L 383.0625 283.0625 L 383.71875 282.757812 L 384.375 282.460938 L 385.6875 281.898438 L 386.34375 281.640625 L 387 281.386719 L 387.65625 281.144531 L 388.3125 280.917969 L 388.96875 280.695312 L 389.625 280.496094 L 390.285156 280.300781 L 390.941406 280.125 L 391.597656 279.960938 L 392.253906 279.804688 L 392.910156 279.671875 L 393.566406 279.542969 L 394.222656 279.4375 L 394.878906 279.339844 L 395.535156 279.257812 L 396.191406 279.195312 L 396.847656 279.140625 L 397.503906 279.109375 L 398.160156 279.085938 L 398.816406 279.078125 L 399.472656 279.089844 L 400.128906 279.109375 L 400.785156 279.152344 L 401.441406 279.203125 L 402.097656 279.273438 L 402.757812 279.355469 L 403.414062 279.453125 L 404.070312 279.566406 L 404.726562 279.691406 L 405.382812 279.835938 L 406.039062 279.988281 "/>
<g style="fill:rgb(30.196078%,30.196078%,30.196078%);fill-opacity:1;">
  <use xlink:href="#glyph0-1" x="20.21875" y="314.200195"/>
  <use xlink:href="#glyph0-2" x="25.21875" y="314.200195"/>
  <use xlink:href="#glyph0-1" x="27.21875" y="314.200195"/>
  <use xlink:href="#glyph0-1" x="32.21875" y="314.200195"/>
</g>
<g style="fill:rgb(30.196078%,30.196078%,30.196078%);fill-opacity:1;">
  <use xlink:href="#glyph0-1" x="20.21875" y="238.266602"/>
  <use xlink:href="#glyph0-2" x="25.21875" y="238.266602"/>
  <use xlink:href="#glyph0-3" x="27.21875" y="238.266602"/>
  <use xlink:href="#glyph0-4" x="32.21875" y="238.266602"/>
</g>
<g style="fill:rgb(30.196078%,30.196078%,30.196078%);fill-opacity:1;">
  <use xlink:href="#glyph0-1" x="20.21875" y="162.329102"/>
  <use xlink:href="#glyph0-2" x="25.21875" y="162.329102"/>
  <use xlink:href="#glyph0-4" x="27.21875" y="162.329102"/>
  <use xlink:href="#glyph0-1" x="32.21875" y="162.329102"/>
</g>
<g style="fill:rgb(30.196078%,30.196078%,30.196078%);fill-opacity:1;">
  <use xlink:href="#glyph0-1" x="20.21875" y="86.391602"/>
  <use xlink:href="#glyph0-2" x="25.21875" y="86.391602"/>
  <use xlink:href="#glyph0-5" x="27.21875" y="86.391602"/>
  <use xlink:href="#glyph0-4" x="32.21875" y="86.391602"/>
</g>
<g style="fill:rgb(30.196078%,30.196078%,30.196078%);fill-opacity:1;">
  <use xlink:href="#glyph0-6" x="20.21875" y="10.454102"/>
  <use xlink:href="#glyph0-2" x="25.21875" y="10.454102"/>
  <use xlink:href="#glyph0-1" x="27.21875" y="10.454102"/>
  <use xlink:href="#glyph0-1" x="32.21875" y="10.454102"/>
</g>
<path style="fill:none;stroke-width:1.066978;stroke-linecap:butt;stroke-linejoin:round;stroke:rgb(20%,20%,20%);stroke-opacity:1;stroke-miterlimit:10;" d="M 39.410156 311.285156 L 42.152344 311.285156 "/>
<path style="fill:none;stroke-width:1.066978;stroke-linecap:butt;stroke-linejoin:round;stroke:rgb(20%,20%,20%);stroke-opacity:1;stroke-miterlimit:10;" d="M 39.410156 235.351562 L 42.152344 235.351562 "/>
<path style="fill:none;stroke-width:1.066978;stroke-linecap:butt;stroke-linejoin:round;stroke:rgb(20%,20%,20%);stroke-opacity:1;stroke-miterlimit:10;" d="M 39.410156 159.414062 L 42.152344 159.414062 "/>
<path style="fill:none;stroke-width:1.066978;stroke-linecap:butt;stroke-linejoin:round;stroke:rgb(20%,20%,20%);stroke-opacity:1;stroke-miterlimit:10;" d="M 39.410156 83.476562 L 42.152344 83.476562 "/>
<path style="fill:none;stroke-width:1.066978;stroke-linecap:butt;stroke-linejoin:round;stroke:rgb(20%,20%,20%);stroke-opacity:1;stroke-miterlimit:10;" d="M 39.410156 7.539062 L 42.152344 7.539062 "/>
<path style="fill:none;stroke-width:1.066978;stroke-linecap:butt;stroke-linejoin:round;stroke:rgb(20%,20%,20%);stroke-opacity:1;stroke-miterlimit:10;" d="M 112.359375 328.589844 L 112.359375 325.847656 "/>
<path style="fill:none;stroke-width:1.066978;stroke-linecap:butt;stroke-linejoin:round;stroke:rgb(20%,20%,20%);stroke-opacity:1;stroke-miterlimit:10;" d="M 198.128906 328.589844 L 198.128906 325.847656 "/>
<path style="fill:none;stroke-width:1.066978;stroke-linecap:butt;stroke-linejoin:round;stroke:rgb(20%,20%,20%);stroke-opacity:1;stroke-miterlimit:10;" d="M 283.902344 328.589844 L 283.902344 325.847656 "/>
<path style="fill:none;stroke-width:1.066978;stroke-linecap:butt;stroke-linejoin:round;stroke:rgb(20%,20%,20%);stroke-opacity:1;stroke-miterlimit:10;" d="M 369.671875 328.589844 L 369.671875 325.847656 "/>
<g style="fill:rgb(30.196078%,30.196078%,30.196078%);fill-opacity:1;">
  <use xlink:href="#glyph0-3" x="109.859375" y="337.196289"/>
</g>
<g style="fill:rgb(30.196078%,30.196078%,30.196078%);fill-opacity:1;">
  <use xlink:href="#glyph0-7" x="195.628906" y="337.196289"/>
</g>
<g style="fill:rgb(30.196078%,30.196078%,30.196078%);fill-opacity:1;">
  <use xlink:href="#glyph0-8" x="281.402344" y="337.196289"/>
</g>
<g style="fill:rgb(30.196078%,30.196078%,30.196078%);fill-opacity:1;">
  <use xlink:href="#glyph0-4" x="367.171875" y="337.196289"/>
</g>
<g style="fill:rgb(0%,0%,0%);fill-opacity:1;">
  <use xlink:href="#glyph1-1" x="228.835938" y="350.538086"/>
  <use xlink:href="#glyph1-2" x="236.835938" y="350.538086"/>
</g>
<g style="fill:rgb(0%,0%,0%);fill-opacity:1;">
  <use xlink:href="#glyph2-1" x="13.499023" y="182.164062"/>
  <use xlink:href="#glyph2-2" x="13.499023" y="176.164062"/>
  <use xlink:href="#glyph2-3" x="13.499023" y="170.164062"/>
  <use xlink:href="#glyph2-4" x="13.499023" y="164.164062"/>
  <use xlink:href="#glyph2-5" x="13.499023" y="159.164062"/>
  <use xlink:href="#glyph2-6" x="13.499023" y="157.164062"/>
  <use xlink:href="#glyph2-7" x="13.499023" y="154.164062"/>
</g>
</g>
</svg>
