[
{
	"uri": "/en/chapter1/",
	"title": "Basics",
	"tags": [],
	"description": "",
	"content": "Chapter 1 Basics Discover what this Hugo theme is all about and the core-concepts behind it.\n"
},
{
	"uri": "/en/chapter2/",
	"title": "Basics",
	"tags": [],
	"description": "",
	"content": "Chapter 1 Basics Discover what this Hugo theme is all about and the core-concepts behind it.\n"
},
{
	"uri": "/en/chapter3/",
	"title": "Basics",
	"tags": [],
	"description": "",
	"content": "Chapter 1 Basics Discover what this Hugo theme is all about and the core-concepts behind it.\n"
},
{
	"uri": "/en/categories/",
	"title": "Categories",
	"tags": [],
	"description": "",
	"content": ""
},
{
	"uri": "/en/credits/",
	"title": "Credits",
	"tags": [],
	"description": "",
	"content": "Contributors Thanks to them  for making Open Source Software a better place !\n.ghContributors{ display:flex; flex-flow: wrap; align-content: flex-start } .ghContributors  div{ width: 50% ; display: inline-flex; margin-bottom: 5px; } .ghContributors  div label{ padding-left: 4px ; } .ghContributors  div span{ font-size: x-small; padding-left: 4px ; }   @matcornic 162 commits   @matalo33 48 commits   @coliff 19 commits   @lierdakil 16 commits   @mdavids 10 commits   @ozobi 5 commits   @Xipas 5 commits   @Alan-Cha 4 commits   @pdelaby 4 commits   @helfper 4 commits   @Chris-Greaves 3 commits   @mreithub 3 commits   @massimeddu 3 commits   @LinuxSuRen 3 commits   @dptelecom 3 commits   @willwade 3 commits   @diemol 2 commits   @denisvm 2 commits   @hucste 2 commits   @ImgBotApp 2 commits   @jamesbooker 2 commits   @jice-lavocat 2 commits   @wikijm 2 commits   @lfalin 2 commits   @JianLoong 2 commits   @armsnyder 1 commits   @afilini 1 commits   @MrAkaki 1 commits   @AmirLavasani 1 commits   @afs2015 1 commits   @arifpedia 1 commits   @berryp 1 commits   @MrMoio 1 commits   @ChrisLasar 1 commits   @DCsunset 1 commits   @IEvangelist 1 commits   @fritzmg 1 commits   @bogaertg 1 commits   @geoffreybauduin 1 commits   @giuliov 1 commits   @haitch 1 commits   @zeegin 1 commits   @RealOrangeOne 1 commits   @jared-stehler 1 commits   @JohnBlood 1 commits   @JohnAllen2tgt 1 commits   @kamilchm 1 commits   @gwleclerc 1 commits   @lloydbenson 1 commits   @massimocireddu 1 commits   @sykesm 1 commits   @nvasudevan 1 commits   @nnja 1 commits   @owulveryck 1 commits   @654wak654 1 commits   @PierreAdam 1 commits   @qiwenmin 1 commits   @ripienaar 1 commits   @stou 1 commits   @razonyang 1 commits   @HontoNoRoger 1 commits   @pocc 1 commits   @EnigmaCurry 1 commits   @taiidani 1 commits   @exKAZUu 1 commits   @Oddly 1 commits   @sandrogauci 1 commits   @shelane 1 commits   @mbbx6spp 1 commits   @swenzel 1 commits   @tedyoung 1 commits   @Thiht 1 commits   @editicalu 1 commits   @fossabot 1 commits   @kamar535 1 commits   @mtbt03 1 commits   @ngocbichdao 1 commits   @nonumeros 1 commits   @pgorod 1 commits   @proelbtn 1 commits   And a special thanks to @vjeantet for his work on docdock, a fork of hugo-theme-learn. v2.0.0 of this theme is inspired by his work.\nPackages and libraries  mermaid - generation of diagram and flowchart from text in a similar manner as markdown font awesome - the iconic font and CSS framework jQuery - The Write Less, Do More, JavaScript Library lunr - Lunr enables you to provide a great search experience without the need for external, server-side, search services\u0026hellip; horsey - Progressive and customizable autocomplete component clipboard.js - copy text to clipboard highlight.js - Javascript syntax highlighter modernizr - A JavaScript toolkit that allows web developers to use new CSS3 and HTML5 features while maintaining a fine level of control over browsers that don\u0026rsquo;t support  Tooling  Netlify - Continuous deployement and hosting of this documentation Hugo  "
},
{
	"uri": "/en/",
	"title": "Learn Theme for Hugo",
	"tags": [],
	"description": "",
	"content": ""
},
{
	"uri": "/en/showcase/",
	"title": "Showcase",
	"tags": [],
	"description": "",
	"content": "TAT by OVH Tshark.dev by Ross Jacobs inteliver by Amir Lavasani "
},
{
	"uri": "/en/tags/",
	"title": "Tags",
	"tags": [],
	"description": "",
	"content": ""
},
{
	"uri": "/en/vitrine/",
	"title": "Vitrine",
	"tags": [],
	"description": "",
	"content": "TAT par OVH Tshark.dev par Ross Jacobs inteliver by Amir Lavasani "
}]