{
  "/api": {
    "target": "http://localhost",
    "secure": false,
    "pathRewrite": {
      "^/api": "geodesign-php/"
    }
  },
  "/exportfile": {
    "target": "http://localhost",
    "secure": false,
    "pathRewrite": {
      "^/exportfile": "geodesign/"
    }
  }
}
