{
  "imports": {
    "react": "https://deno.land/x/aleph/",
    "graphql": "https://raw.githubusercontent.com/adelsz/graphql-deno/v15.0.0/mod.ts",
    "GraphQLSchema": "https://raw.githubusercontent.com/adelsz/graphql-deno/v15.0.0/mod.ts",
    "GraphQLObjectType": "https://raw.githubusercontent.com/adelsz/graphql-deno/v15.0.0/mod.ts",
    "GraphQLString": "https://raw.githubusercontent.com/adelsz/graphql-deno/v15.0.0/mod.ts",
    "applyGraphQL": "https://deno.land/x/oak_graphql/mod.ts",
    "gql": "https://deno.land/x/oak_graphql/mod.ts",
    "Application": "https://deno.land/x/oak/mod.ts"
  }
}
