<?xml version="1.0" encoding="UTF-8" standalone="no"?>
<svg
   xmlns:dc="http://purl.org/dc/elements/1.1/"
   xmlns:cc="http://creativecommons.org/ns#"
   xmlns:rdf="http://www.w3.org/1999/02/22-rdf-syntax-ns#"
   xmlns:svg="http://www.w3.org/2000/svg"
   xmlns="http://www.w3.org/2000/svg"
   xmlns:sodipodi="http://sodipodi.sourceforge.net/DTD/sodipodi-0.dtd"
   xmlns:inkscape="http://www.inkscape.org/namespaces/inkscape"
   version="1.1"
   id="Capa_1"
   x="0px"
   y="0px"
   width="33.75"
   height="33.75"
   viewBox="0 0 33.75 33.75"
   xml:space="preserve"
   sodipodi:docname="meetup.svg"
   inkscape:version="1.0.2 (e86c8708, 2021-01-15)"><metadata
   id="metadata977"><rdf:RDF><cc:Work
       rdf:about=""><dc:format>image/svg+xml</dc:format><dc:type
         rdf:resource="http://purl.org/dc/dcmitype/StillImage" /><dc:title></dc:title></cc:Work></rdf:RDF></metadata><defs
   id="defs975" /><sodipodi:namedview
   pagecolor="#ffffff"
   bordercolor="#666666"
   borderopacity="1"
   objecttolerance="10"
   gridtolerance="10"
   guidetolerance="10"
   inkscape:pageopacity="0"
   inkscape:pageshadow="2"
   inkscape:window-width="1628"
   inkscape:window-height="1035"
   id="namedview973"
   showgrid="false"
   inkscape:zoom="7.2838875"
   inkscape:cx="-8.5119382"
   inkscape:cy="37.068118"
   inkscape:window-x="0"
   inkscape:window-y="25"
   inkscape:window-maximized="0"
   inkscape:current-layer="Capa_1" />
<g
   id="g940"
   transform="matrix(0.31454054,0.00646964,-0.00637698,0.31173262,2.2369606,1.6090303)">
	<g
   id="g938">
		<path
   d="m 46.774,47.62 c 0.101,-1.275 0.053,-2.562 0.07,-3.844 -0.115,-0.028 -0.229,-0.054 -0.344,-0.081 -0.582,1.641 -1.165,3.283 -1.749,4.937 1.797,0.541 1.906,0.513 2.023,-1.012 z"
   id="path930" />
		<path
   d="m 80.266,52.878 c 3.944,-2.041 5.846,-6.327 4.35,-10.172 -3.116,2.701 -3.581,6.44 -4.35,10.172 z"
   id="path932" />
		<path
   d="m 35.268,47.847 c -0.029,-1.389 -0.059,-2.694 -0.088,-3.998 -0.119,-0.03 -0.237,-0.061 -0.357,-0.09 -0.33,0.848 -0.733,1.675 -0.972,2.548 -0.396,1.451 -0.352,1.462 1.417,1.54 z"
   id="path934" />
		<path
   d="M 48.875,0 C 21.883,0 0,21.882 0,48.875 0,75.868 21.883,97.75 48.875,97.75 75.867,97.75 97.75,75.868 97.75,48.875 97.75,21.882 75.867,0 48.875,0 Z M 26.512,57.939 c -0.687,0.201 -0.905,-0.064 -1.101,-0.709 -1.113,-3.688 -2.283,-7.358 -3.48,-11.188 -0.065,0.495 -0.147,0.902 -0.166,1.313 -0.118,2.233 -0.206,4.468 -0.335,6.7 -0.029,0.526 -0.086,1.096 -0.307,1.557 -0.162,0.332 -0.592,0.634 -0.961,0.746 -0.533,0.162 -1.148,0.055 -1.681,0.215 -1.373,0.408 -2.108,-0.291 -2.735,-1.362 -0.767,-1.315 -1.588,-2.597 -2.387,-3.894 -0.056,0.004 -0.111,0.009 -0.166,0.014 0.153,1.188 0.286,2.38 0.477,3.562 0.107,0.686 -0.166,1.088 -0.763,1.34 -0.133,0.054 -0.253,0.129 -0.384,0.18 C 9.876,57.427 9.362,57.069 8.939,54.301 8.329,50.308 8.48,46.304 8.621,42.298 c 0.008,-0.23 0.267,-0.554 0.488,-0.654 0.448,-0.201 0.944,-0.317 1.433,-0.396 1.96,-0.324 2.471,-0.064 3.383,1.673 0.905,1.729 1.799,3.463 2.704,5.195 0.123,0.232 0.268,0.455 0.451,0.761 0.406,-1.919 0.686,-3.734 1.186,-5.488 0.474,-1.661 1.143,-3.27 1.81,-4.867 0.121,-0.289 0.646,-0.573 0.985,-0.575 0.955,-0.008 1.968,-0.039 2.838,0.275 0.531,0.191 1.04,0.941 1.215,1.539 0.602,2.076 1.072,4.19 1.56,6.298 0.852,3.689 1.675,7.383 2.535,11.18 -0.784,0.2 -1.747,0.421 -2.697,0.7 z m 5.082,-1.377 c -1.814,-1.16 -2.542,-2.637 -2.51,-4.674 0.037,-2.397 -0.035,-4.792 0.631,-7.146 0.533,-1.894 1.839,-3.092 3.229,-4.347 1.387,-1.247 2.732,-0.773 4.24,-0.513 1.671,0.289 1.979,1.392 2.054,2.722 0.13,2.326 0.589,4.645 0.027,6.985 -0.142,0.593 -0.318,0.894 -0.937,0.859 -1.618,-0.089 -3.234,-0.171 -4.972,-0.259 -0.209,1.561 -0.285,3.117 0.622,4.516 0.88,1.357 2.047,1.629 3.58,0.931 1.343,-0.61 2.777,-0.295 3.876,0.853 -2.508,1.79 -7.334,1.674 -9.84,0.073 z M 47.38,57.35 c -0.76,-0.164 -1.562,-0.154 -2.313,-0.345 -2.746,-0.7 -4.38,-3.088 -4.477,-5.944 -0.093,-2.761 0.582,-5.357 1.706,-7.75 0.801,-1.707 2.289,-3.105 3.568,-4.557 0.231,-0.265 0.965,-0.259 1.402,-0.14 0.949,0.258 1.888,0.607 2.763,1.051 0.326,0.167 0.672,0.721 0.652,1.081 -0.076,1.51 -0.299,3.011 -0.445,4.519 -0.168,1.79 -0.314,3.583 -0.478,5.482 -1.637,1.031 -3.43,0.395 -5.239,0.146 -0.579,1.767 0.253,3.01 1.274,4.185 0.843,0.971 1.934,1.015 3.027,0.63 0.658,-0.232 1.215,-0.734 1.851,-1.041 0.279,-0.133 0.667,-0.17 0.965,-0.094 0.715,0.179 1.154,0.646 1.164,1.527 -1.695,0.867 -3.388,1.689 -5.42,1.25 z m 15.956,-7.972 c -1.243,0.173 -2.486,0.354 -3.734,0.513 -0.438,0.058 -0.81,0.026 -0.758,0.709 0.086,1.194 0.023,2.4 0.055,3.602 0.028,1.204 0.094,2.404 0.148,3.718 -0.925,0.153 -1.811,0.3 -2.835,0.47 -0.077,-1.396 -0.137,-2.725 -0.228,-4.05 -0.092,-1.336 -0.211,-2.672 -0.328,-4.119 -0.909,-0.052 -1.75,-0.125 -2.592,-0.14 -0.789,-0.016 -1.348,-0.255 -1.274,-1.161 0.063,-0.896 0.64,-1.189 1.468,-1.14 0.691,0.041 1.389,0.065 2.166,0.1 -0.291,-2.794 -0.619,-5.426 -0.824,-8.067 -0.146,-1.908 -0.219,-3.829 -0.172,-5.741 0.049,-2.028 0.92,-2.503 2.762,-1.676 1.891,0.849 1.793,0.95 1.75,2.976 -0.067,3.113 0.121,6.231 0.16,9.348 0.008,0.684 -0.199,1.367 -0.23,2.055 -0.014,0.264 0.184,0.538 0.287,0.808 0.144,-0.216 0.395,-0.423 0.414,-0.65 0.058,-0.658 0.488,-0.906 0.918,-0.576 1.06,0.812 2.021,1.755 3.02,2.648 -0.057,0.121 -0.114,0.247 -0.173,0.373 z m 8.135,6.753 c -0.385,0.409 -0.873,0.854 -1.391,0.975 -0.922,0.215 -1.898,0.275 -2.85,0.254 -1.104,-0.027 -1.812,-0.811 -2.021,-1.771 -0.556,-2.515 -0.979,-5.057 -1.403,-7.599 -0.123,-0.729 -0.097,-1.488 -0.068,-2.23 0.033,-1.054 0.529,-1.381 1.535,-1.057 0.301,0.098 0.586,0.255 0.879,0.384 1.957,0.861 1.914,0.922 1.935,3.003 0.021,2.127 0.216,4.25 0.351,6.375 0.016,0.234 0.137,0.461 0.246,0.816 2.282,-1.948 2.941,-4.38 2.933,-7.071 -0.005,-0.627 -0.224,-1.26 -0.187,-1.879 0.027,-0.45 0.228,-0.966 0.525,-1.288 0.179,-0.191 0.727,-0.15 1.062,-0.057 0.508,0.139 0.972,0.422 1.459,0.633 1.129,0.484 1.381,1.318 1.336,2.521 -0.083,2.45 -1.31,4.284 -2.812,6.04 -0.537,0.627 -0.966,1.35 -1.529,1.951 z m 14.853,-3.688 c -1.375,1.162 -2.748,2.334 -4.196,3.398 -0.545,0.399 -1.304,0.506 -1.981,0.753 -0.443,1.935 -0.185,4.722 0.879,9.075 -1.104,0.032 -2.188,0.104 -3.272,0.059 -0.183,-0.009 -0.452,-0.506 -0.496,-0.805 -0.401,-2.621 -0.746,-5.249 -1.153,-7.867 -0.066,-0.435 -0.283,-0.932 -0.595,-1.226 -0.923,-0.872 -0.85,-1.534 0.285,-2.125 0.212,-0.11 0.353,-0.476 0.403,-0.746 0.476,-2.354 0.795,-4.75 1.41,-7.067 0.677,-2.546 2.154,-4.639 4.568,-5.843 0.646,-0.323 1.565,-0.261 2.324,-0.15 0.714,0.106 1.369,0.602 2.084,0.77 1.943,0.451 2.407,2 2.584,3.599 0.348,3.141 -0.284,6.02 -2.844,8.175 z"
   id="path936" />
	</g>
</g>
<g
   id="g942">
</g>
<g
   id="g944">
</g>
<g
   id="g946">
</g>
<g
   id="g948">
</g>
<g
   id="g950">
</g>
<g
   id="g952">
</g>
<g
   id="g954">
</g>
<g
   id="g956">
</g>
<g
   id="g958">
</g>
<g
   id="g960">
</g>
<g
   id="g962">
</g>
<g
   id="g964">
</g>
<g
   id="g966">
</g>
<g
   id="g968">
</g>
<g
   id="g970">
</g>
<path
   style="opacity:0.99;fill:#ff0000;fill-opacity:0;stroke-width:0.137289"
   d="M 46.472437,97.595582 C 25.723912,96.665204 7.6584552,82.292986 1.914747,62.147109 -0.78434431,52.680132 -0.48524058,42.283477 2.7547543,32.948999 8.5783121,16.171234 23.197624,3.7511015 40.63764,0.76482214 45.837016,-0.12547441 52.284821,-0.09995277 57.468388,0.83144144 75.005957,3.9826287 89.52687,16.546661 95.144202,33.429951 c 2.416543,7.26309 3.112077,14.856915 2.043374,22.309515 -2.27738,15.881311 -12.172891,29.585404 -26.577019,36.805973 -7.453237,3.736193 -15.569893,5.434348 -24.13812,5.050143 z M 81.023178,65.384041 c -0.865869,-4.061399 -1.123518,-6.068613 -0.973892,-7.587091 0.05021,-0.509586 0.130373,-0.987458 0.178133,-1.061938 0.04776,-0.07448 0.439338,-0.237209 0.870174,-0.361618 0.832649,-0.240436 2.173753,-1.209458 4.794438,-3.464245 1.962973,-1.688903 2.790565,-2.964459 3.211092,-4.949211 0.376628,-1.777562 0.179323,-4.664334 -0.394663,-5.7743 -0.410337,-0.793505 -1.011575,-1.210183 -2.595144,-1.798526 -1.329164,-0.493823 -1.69304,-0.573297 -2.624694,-0.573256 -0.961393,4.3e-5 -1.167382,0.04849 -1.853406,0.435937 -1.102105,0.622432 -2.59092,2.17884 -3.204404,3.349887 -0.279876,0.534239 -0.664676,1.522722 -0.855112,2.196629 -0.288125,1.019606 -1.448769,6.827601 -1.448769,7.249804 0,0.07069 -0.288307,0.393219 -0.640684,0.716736 -0.81581,0.748994 -0.845344,1.162216 -0.144219,2.017845 0.613481,0.748675 0.65485,0.922759 1.338193,5.631213 0.304843,2.10047 0.628823,3.938431 0.719956,4.084357 0.149842,0.239936 0.334953,0.265323 1.934595,0.265323 h 1.768897 z m -23.018438,-7.2182 1.02967,-0.169893 v -3.976165 -3.976167 l 2.127985,-0.301363 c 1.170391,-0.16575 2.169789,-0.305127 2.220885,-0.309729 0.0511,-0.0046 0.113591,-0.115802 0.138878,-0.247113 0.04661,-0.242007 -1.751927,-1.995642 -2.79663,-2.726817 -0.620639,-0.434377 -1.048462,-0.350682 -1.164147,0.22774 -0.07361,0.368065 -0.457147,0.862722 -0.459264,0.592326 -0.08757,-11.183267 -0.149054,-13.710359 -0.340687,-14.002827 -0.306524,-0.467814 -1.928427,-1.192246 -2.81603,-1.257797 -0.995207,-0.0735 -1.320416,0.244825 -1.526251,1.493938 -0.234007,1.420079 0.02801,6.076398 0.67714,12.03376 l 0.243093,2.230951 h -1.466543 c -1.73004,0 -2.017602,0.141754 -2.140089,1.054959 -0.06478,0.482961 -0.02408,0.624234 0.262353,0.910666 0.304246,0.304244 0.492575,0.348522 1.83576,0.431586 0.823205,0.05091 1.562679,0.113007 1.643279,0.137995 0.150166,0.04656 0.393561,2.773712 0.56118,6.287841 l 0.09015,1.889937 0.4248,-0.07697 c 0.23364,-0.04233 0.888152,-0.15342 1.45447,-0.24686 z M 27.801088,57.676929 c 1.354305,-0.365932 1.438701,-0.409339 1.394635,-0.717293 -0.08598,-0.600877 -2.49025,-11.129651 -3.255486,-14.256414 -1.093063,-4.466271 -1.259172,-4.677041 -3.768011,-4.781115 -1.905377,-0.07904 -1.955368,-0.0394 -2.864461,2.271457 -0.861511,2.189901 -1.287069,3.656174 -1.831717,6.311224 -0.35544,1.732705 -0.457062,2.050796 -0.592116,1.853406 -0.08967,-0.131057 -0.769628,-1.412109 -1.511017,-2.846782 -1.794763,-3.473066 -2.147576,-4.016283 -2.780408,-4.280925 -0.93961,-0.392931 -3.5529144,0.06309 -3.9065984,0.681698 -0.2501882,0.437592 -0.2430908,9.421462 0.00886,11.218784 0.5296513,3.778283 0.9293271,4.252603 3.0528704,3.623023 1.117137,-0.331205 1.770141,-0.708353 1.923117,-1.110712 0.125039,-0.328877 0.02807,-1.362948 -0.364329,-3.885204 -0.05718,-0.367536 0.25247,0.05209 1.317004,1.784761 0.765469,1.245901 1.495008,2.379714 1.621199,2.519586 0.500233,0.554463 0.968347,0.677026 2.212124,0.579178 1.596882,-0.125628 2.124298,-0.285736 2.530173,-0.768091 0.434534,-0.516414 0.462186,-0.731423 0.703855,-5.472777 0.109254,-2.143457 0.218527,-3.917078 0.24283,-3.941381 0.0243,-0.0243 0.834064,2.501104 1.79947,5.612015 0.965406,3.110912 1.819858,5.734011 1.898784,5.82911 0.206725,0.249088 0.551512,0.213556 2.169219,-0.223548 z m 11.137185,-0.07559 c 0.500022,-0.105987 1.294457,-0.387216 1.765413,-0.624953 l 0.856282,-0.43225 -0.312343,-0.332475 C 40.41703,55.327534 38.771413,55.06609 37.411341,55.60218 c -0.890263,0.350909 -1.857382,0.354841 -2.423158,0.0099 -1.075662,-0.655898 -1.768326,-2.382 -1.665899,-4.151378 0.03425,-0.591715 0.09277,-1.106335 0.130033,-1.143599 0.03726,-0.03726 1.215518,-9.61e-4 2.618345,0.08054 1.787084,0.103901 2.631413,0.105036 2.820585,0.0038 0.635742,-0.340238 0.846645,-2.909491 0.529343,-6.448523 -0.307929,-3.434496 -0.54509,-3.813563 -2.636256,-4.213669 -1.650896,-0.315868 -2.479134,-0.26627 -3.285738,0.196767 -1.078168,0.618928 -2.824884,2.531783 -3.409348,3.733629 -0.775518,1.594715 -0.967902,2.917697 -0.976558,6.715592 l -0.0074,3.226299 0.378204,0.770122 c 0.742201,1.511314 2.518215,2.77269 4.513532,3.20564 1.148446,0.249194 3.796413,0.256746 4.9412,0.01409 z m 11.11968,-0.287187 c 0.445896,-0.115543 1.275248,-0.421771 1.843007,-0.680506 0.988527,-0.450486 1.028511,-0.486687 0.943203,-0.853915 -0.3225,-1.388288 -1.435008,-1.655498 -2.98938,-0.718014 -1.87342,1.129913 -3.152837,1.029569 -4.234516,-0.332114 -1.007291,-1.268037 -1.395532,-2.461942 -1.126467,-3.464067 0.0747,-0.278231 0.105755,-0.281453 1.062117,-0.11019 2.105209,0.376995 4.138374,0.118608 4.273012,-0.543041 0.0331,-0.16267 0.09572,-0.759116 0.139163,-1.325434 0.04344,-0.566318 0.243536,-2.734989 0.444662,-4.819266 0.426137,-4.416072 0.420806,-4.456648 -0.657393,-5.003012 -0.918155,-0.465264 -2.630108,-1.023579 -3.138586,-1.023579 -0.527102,0 -1.2616,0.651055 -2.763621,2.449661 -1.57056,1.880674 -2.527354,4.025113 -3.068349,6.877006 -0.244238,1.287517 -0.280315,3.887105 -0.06681,4.814134 0.532377,2.311561 2.427766,4.148279 4.672712,4.528069 0.481688,0.08149 1.184697,0.201146 1.562242,0.265901 1.093625,0.187573 2.23036,0.165009 3.105004,-0.06163 z M 69.6886,57.246943 c 0.98885,-0.187532 1.421111,-0.561549 3.182538,-2.753712 1.60853,-2.001878 2.574531,-3.702763 2.846219,-5.011479 0.235935,-1.136491 0.130421,-2.693993 -0.215021,-3.173962 -0.404366,-0.56184 -2.174491,-1.409171 -2.949649,-1.411949 -0.554557,-0.002 -0.650589,0.04528 -0.879575,0.432922 -0.15728,0.266255 -0.252946,0.679228 -0.246473,1.063992 0.0058,0.345861 0.02189,1.277531 0.03572,2.070377 0.04284,2.456588 -0.624803,4.410179 -2.01584,5.898511 -0.708604,0.758167 -0.710655,0.759184 -0.840474,0.416798 -0.07158,-0.188773 -0.201978,-1.764168 -0.289784,-3.500878 -0.08781,-1.73671 -0.1808,-3.577574 -0.206654,-4.09081 -0.05827,-1.156776 -0.245039,-1.381853 -1.721615,-2.074768 -1.391358,-0.652924 -1.903932,-0.738421 -2.334887,-0.389454 -0.702943,0.569209 -0.460282,3.423445 0.809372,9.519953 0.578703,2.778769 0.915369,3.143077 2.905389,3.143941 0.650399,2.74e-4 1.51473,-0.06249 1.920734,-0.139482 z"
   id="path979" /><path
   style="opacity:0.99;fill:#ff0000;fill-opacity:0;stroke-width:0.137289"
   d="M 46.472437,97.595582 C 25.723912,96.665204 7.6584552,82.292986 1.914747,62.147109 -0.78434431,52.680132 -0.48524058,42.283477 2.7547543,32.948999 8.5783121,16.171234 23.197624,3.7511015 40.63764,0.76482214 45.837016,-0.12547441 52.284821,-0.09995277 57.468388,0.83144144 75.005957,3.9826287 89.52687,16.546661 95.144202,33.429951 c 2.416543,7.26309 3.112077,14.856915 2.043374,22.309515 -2.27738,15.881311 -12.172891,29.585404 -26.577019,36.805973 -7.453237,3.736193 -15.569893,5.434348 -24.13812,5.050143 z M 81.023178,65.384041 c -0.865869,-4.061399 -1.123518,-6.068613 -0.973892,-7.587091 0.05021,-0.509586 0.130373,-0.987458 0.178133,-1.061938 0.04776,-0.07448 0.439338,-0.237209 0.870174,-0.361618 0.832649,-0.240436 2.173753,-1.209458 4.794438,-3.464245 1.962973,-1.688903 2.790565,-2.964459 3.211092,-4.949211 0.376628,-1.777562 0.179323,-4.664334 -0.394663,-5.7743 -0.410337,-0.793505 -1.011575,-1.210183 -2.595144,-1.798526 -1.329164,-0.493823 -1.69304,-0.573297 -2.624694,-0.573256 -0.961393,4.3e-5 -1.167382,0.04849 -1.853406,0.435937 -1.102105,0.622432 -2.59092,2.17884 -3.204404,3.349887 -0.279876,0.534239 -0.664676,1.522722 -0.855112,2.196629 -0.288125,1.019606 -1.448769,6.827601 -1.448769,7.249804 0,0.07069 -0.288307,0.393219 -0.640684,0.716736 -0.81581,0.748994 -0.845344,1.162216 -0.144219,2.017845 0.613481,0.748675 0.65485,0.922759 1.338193,5.631213 0.304843,2.10047 0.628823,3.938431 0.719956,4.084357 0.149842,0.239936 0.334953,0.265323 1.934595,0.265323 h 1.768897 z m -23.018438,-7.2182 1.02967,-0.169893 v -3.976165 -3.976167 l 2.127985,-0.301363 c 1.170391,-0.16575 2.169789,-0.305127 2.220885,-0.309729 0.0511,-0.0046 0.113591,-0.115802 0.138878,-0.247113 0.04661,-0.242007 -1.751927,-1.995642 -2.79663,-2.726817 -0.620639,-0.434377 -1.048462,-0.350682 -1.164147,0.22774 -0.07361,0.368065 -0.457147,0.862722 -0.459264,0.592326 -0.08757,-11.183267 -0.149054,-13.710359 -0.340687,-14.002827 -0.306524,-0.467814 -1.928427,-1.192246 -2.81603,-1.257797 -0.995207,-0.0735 -1.320416,0.244825 -1.526251,1.493938 -0.234007,1.420079 0.02801,6.076398 0.67714,12.03376 l 0.243093,2.230951 h -1.466543 c -1.73004,0 -2.017602,0.141754 -2.140089,1.054959 -0.06478,0.482961 -0.02408,0.624234 0.262353,0.910666 0.304246,0.304244 0.492575,0.348522 1.83576,0.431586 0.823205,0.05091 1.562679,0.113007 1.643279,0.137995 0.150166,0.04656 0.393561,2.773712 0.56118,6.287841 l 0.09015,1.889937 0.4248,-0.07697 c 0.23364,-0.04233 0.888152,-0.15342 1.45447,-0.24686 z M 27.801088,57.676929 c 1.354305,-0.365932 1.438701,-0.409339 1.394635,-0.717293 -0.08598,-0.600877 -2.49025,-11.129651 -3.255486,-14.256414 -1.093063,-4.466271 -1.259172,-4.677041 -3.768011,-4.781115 -1.905377,-0.07904 -1.955368,-0.0394 -2.864461,2.271457 -0.861511,2.189901 -1.287069,3.656174 -1.831717,6.311224 -0.35544,1.732705 -0.457062,2.050796 -0.592116,1.853406 -0.08967,-0.131057 -0.769628,-1.412109 -1.511017,-2.846782 -1.794763,-3.473066 -2.147576,-4.016283 -2.780408,-4.280925 -0.93961,-0.392931 -3.5529144,0.06309 -3.9065984,0.681698 -0.2501882,0.437592 -0.2430908,9.421462 0.00886,11.218784 0.5296513,3.778283 0.9293271,4.252603 3.0528704,3.623023 1.117137,-0.331205 1.770141,-0.708353 1.923117,-1.110712 0.125039,-0.328877 0.02807,-1.362948 -0.364329,-3.885204 -0.05718,-0.367536 0.25247,0.05209 1.317004,1.784761 0.765469,1.245901 1.495008,2.379714 1.621199,2.519586 0.500233,0.554463 0.968347,0.677026 2.212124,0.579178 1.596882,-0.125628 2.124298,-0.285736 2.530173,-0.768091 0.434534,-0.516414 0.462186,-0.731423 0.703855,-5.472777 0.109254,-2.143457 0.218527,-3.917078 0.24283,-3.941381 0.0243,-0.0243 0.834064,2.501104 1.79947,5.612015 0.965406,3.110912 1.819858,5.734011 1.898784,5.82911 0.206725,0.249088 0.551512,0.213556 2.169219,-0.223548 z m 11.137185,-0.07559 c 0.500022,-0.105987 1.294457,-0.387216 1.765413,-0.624953 l 0.856282,-0.43225 -0.312343,-0.332475 C 40.41703,55.327534 38.771413,55.06609 37.411341,55.60218 c -0.890263,0.350909 -1.857382,0.354841 -2.423158,0.0099 -1.075662,-0.655898 -1.768326,-2.382 -1.665899,-4.151378 0.03425,-0.591715 0.09277,-1.106335 0.130033,-1.143599 0.03726,-0.03726 1.215518,-9.61e-4 2.618345,0.08054 1.787084,0.103901 2.631413,0.105036 2.820585,0.0038 0.635742,-0.340238 0.846645,-2.909491 0.529343,-6.448523 -0.307929,-3.434496 -0.54509,-3.813563 -2.636256,-4.213669 -1.650896,-0.315868 -2.479134,-0.26627 -3.285738,0.196767 -1.078168,0.618928 -2.824884,2.531783 -3.409348,3.733629 -0.775518,1.594715 -0.967902,2.917697 -0.976558,6.715592 l -0.0074,3.226299 0.378204,0.770122 c 0.742201,1.511314 2.518215,2.77269 4.513532,3.20564 1.148446,0.249194 3.796413,0.256746 4.9412,0.01409 z m 11.11968,-0.287187 c 0.445896,-0.115543 1.275248,-0.421771 1.843007,-0.680506 0.988527,-0.450486 1.028511,-0.486687 0.943203,-0.853915 -0.3225,-1.388288 -1.435008,-1.655498 -2.98938,-0.718014 -1.87342,1.129913 -3.152837,1.029569 -4.234516,-0.332114 -1.007291,-1.268037 -1.395532,-2.461942 -1.126467,-3.464067 0.0747,-0.278231 0.105755,-0.281453 1.062117,-0.11019 2.105209,0.376995 4.138374,0.118608 4.273012,-0.543041 0.0331,-0.16267 0.09572,-0.759116 0.139163,-1.325434 0.04344,-0.566318 0.243536,-2.734989 0.444662,-4.819266 0.426137,-4.416072 0.420806,-4.456648 -0.657393,-5.003012 -0.918155,-0.465264 -2.630108,-1.023579 -3.138586,-1.023579 -0.527102,0 -1.2616,0.651055 -2.763621,2.449661 -1.57056,1.880674 -2.527354,4.025113 -3.068349,6.877006 -0.244238,1.287517 -0.280315,3.887105 -0.06681,4.814134 0.532377,2.311561 2.427766,4.148279 4.672712,4.528069 0.481688,0.08149 1.184697,0.201146 1.562242,0.265901 1.093625,0.187573 2.23036,0.165009 3.105004,-0.06163 z M 69.6886,57.246943 c 0.98885,-0.187532 1.421111,-0.561549 3.182538,-2.753712 1.60853,-2.001878 2.574531,-3.702763 2.846219,-5.011479 0.235935,-1.136491 0.130421,-2.693993 -0.215021,-3.173962 -0.404366,-0.56184 -2.174491,-1.409171 -2.949649,-1.411949 -0.554557,-0.002 -0.650589,0.04528 -0.879575,0.432922 -0.15728,0.266255 -0.252946,0.679228 -0.246473,1.063992 0.0058,0.345861 0.02189,1.277531 0.03572,2.070377 0.04284,2.456588 -0.624803,4.410179 -2.01584,5.898511 -0.708604,0.758167 -0.710655,0.759184 -0.840474,0.416798 -0.07158,-0.188773 -0.201978,-1.764168 -0.289784,-3.500878 -0.08781,-1.73671 -0.1808,-3.577574 -0.206654,-4.09081 -0.05827,-1.156776 -0.245039,-1.381853 -1.721615,-2.074768 -1.391358,-0.652924 -1.903932,-0.738421 -2.334887,-0.389454 -0.702943,0.569209 -0.460282,3.423445 0.809372,9.519953 0.578703,2.778769 0.915369,3.143077 2.905389,3.143941 0.650399,2.74e-4 1.51473,-0.06249 1.920734,-0.139482 z"
   id="path981" /><path
   style="opacity:0.99;fill:#ff2a2a;fill-opacity:0;stroke-width:0.137289"
   d="M 46.472437,97.595582 C 25.723912,96.665204 7.6584552,82.292986 1.914747,62.147109 -0.78434431,52.680132 -0.48524058,42.283477 2.7547543,32.948999 8.5783121,16.171234 23.197624,3.7511015 40.63764,0.76482214 45.837016,-0.12547441 52.284821,-0.09995277 57.468388,0.83144144 75.005957,3.9826287 89.52687,16.546661 95.144202,33.429951 c 2.416543,7.26309 3.112077,14.856915 2.043374,22.309515 -2.27738,15.881311 -12.172891,29.585404 -26.577019,36.805973 -7.453237,3.736193 -15.569893,5.434348 -24.13812,5.050143 z M 81.023178,65.384041 c -0.865869,-4.061399 -1.123518,-6.068613 -0.973892,-7.587091 0.05021,-0.509586 0.130373,-0.987458 0.178133,-1.061938 0.04776,-0.07448 0.439338,-0.237209 0.870174,-0.361618 0.832649,-0.240436 2.173753,-1.209458 4.794438,-3.464245 1.962973,-1.688903 2.790565,-2.964459 3.211092,-4.949211 0.376628,-1.777562 0.179323,-4.664334 -0.394663,-5.7743 -0.410337,-0.793505 -1.011575,-1.210183 -2.595144,-1.798526 -1.329164,-0.493823 -1.69304,-0.573297 -2.624694,-0.573256 -0.961393,4.3e-5 -1.167382,0.04849 -1.853406,0.435937 -1.102105,0.622432 -2.59092,2.17884 -3.204404,3.349887 -0.279876,0.534239 -0.664676,1.522722 -0.855112,2.196629 -0.288125,1.019606 -1.448769,6.827601 -1.448769,7.249804 0,0.07069 -0.288307,0.393219 -0.640684,0.716736 -0.81581,0.748994 -0.845344,1.162216 -0.144219,2.017845 0.613481,0.748675 0.65485,0.922759 1.338193,5.631213 0.304843,2.10047 0.628823,3.938431 0.719956,4.084357 0.149842,0.239936 0.334953,0.265323 1.934595,0.265323 h 1.768897 z m -23.018438,-7.2182 1.02967,-0.169893 v -3.976165 -3.976167 l 2.127985,-0.301363 c 1.170391,-0.16575 2.169789,-0.305127 2.220885,-0.309729 0.0511,-0.0046 0.113591,-0.115802 0.138878,-0.247113 0.04661,-0.242007 -1.751927,-1.995642 -2.79663,-2.726817 -0.620639,-0.434377 -1.048462,-0.350682 -1.164147,0.22774 -0.07361,0.368065 -0.457147,0.862722 -0.459264,0.592326 -0.08757,-11.183267 -0.149054,-13.710359 -0.340687,-14.002827 -0.306524,-0.467814 -1.928427,-1.192246 -2.81603,-1.257797 -0.995207,-0.0735 -1.320416,0.244825 -1.526251,1.493938 -0.234007,1.420079 0.02801,6.076398 0.67714,12.03376 l 0.243093,2.230951 h -1.466543 c -1.73004,0 -2.017602,0.141754 -2.140089,1.054959 -0.06478,0.482961 -0.02408,0.624234 0.262353,0.910666 0.304246,0.304244 0.492575,0.348522 1.83576,0.431586 0.823205,0.05091 1.562679,0.113007 1.643279,0.137995 0.150166,0.04656 0.393561,2.773712 0.56118,6.287841 l 0.09015,1.889937 0.4248,-0.07697 c 0.23364,-0.04233 0.888152,-0.15342 1.45447,-0.24686 z M 27.801088,57.676929 c 1.354305,-0.365932 1.438701,-0.409339 1.394635,-0.717293 -0.08598,-0.600877 -2.49025,-11.129651 -3.255486,-14.256414 -1.093063,-4.466271 -1.259172,-4.677041 -3.768011,-4.781115 -1.905377,-0.07904 -1.955368,-0.0394 -2.864461,2.271457 -0.861511,2.189901 -1.287069,3.656174 -1.831717,6.311224 -0.35544,1.732705 -0.457062,2.050796 -0.592116,1.853406 -0.08967,-0.131057 -0.769628,-1.412109 -1.511017,-2.846782 -1.794763,-3.473066 -2.147576,-4.016283 -2.780408,-4.280925 -0.93961,-0.392931 -3.5529144,0.06309 -3.9065984,0.681698 -0.2501882,0.437592 -0.2430908,9.421462 0.00886,11.218784 0.5296513,3.778283 0.9293271,4.252603 3.0528704,3.623023 1.117137,-0.331205 1.770141,-0.708353 1.923117,-1.110712 0.125039,-0.328877 0.02807,-1.362948 -0.364329,-3.885204 -0.05718,-0.367536 0.25247,0.05209 1.317004,1.784761 0.765469,1.245901 1.495008,2.379714 1.621199,2.519586 0.500233,0.554463 0.968347,0.677026 2.212124,0.579178 1.596882,-0.125628 2.124298,-0.285736 2.530173,-0.768091 0.434534,-0.516414 0.462186,-0.731423 0.703855,-5.472777 0.109254,-2.143457 0.218527,-3.917078 0.24283,-3.941381 0.0243,-0.0243 0.834064,2.501104 1.79947,5.612015 0.965406,3.110912 1.819858,5.734011 1.898784,5.82911 0.206725,0.249088 0.551512,0.213556 2.169219,-0.223548 z m 11.137185,-0.07559 c 0.500022,-0.105987 1.294457,-0.387216 1.765413,-0.624953 l 0.856282,-0.43225 -0.312343,-0.332475 C 40.41703,55.327534 38.771413,55.06609 37.411341,55.60218 c -0.890263,0.350909 -1.857382,0.354841 -2.423158,0.0099 -1.075662,-0.655898 -1.768326,-2.382 -1.665899,-4.151378 0.03425,-0.591715 0.09277,-1.106335 0.130033,-1.143599 0.03726,-0.03726 1.215518,-9.61e-4 2.618345,0.08054 1.787084,0.103901 2.631413,0.105036 2.820585,0.0038 0.635742,-0.340238 0.846645,-2.909491 0.529343,-6.448523 -0.307929,-3.434496 -0.54509,-3.813563 -2.636256,-4.213669 -1.650896,-0.315868 -2.479134,-0.26627 -3.285738,0.196767 -1.078168,0.618928 -2.824884,2.531783 -3.409348,3.733629 -0.775518,1.594715 -0.967902,2.917697 -0.976558,6.715592 l -0.0074,3.226299 0.378204,0.770122 c 0.742201,1.511314 2.518215,2.77269 4.513532,3.20564 1.148446,0.249194 3.796413,0.256746 4.9412,0.01409 z m 11.11968,-0.287187 c 0.445896,-0.115543 1.275248,-0.421771 1.843007,-0.680506 0.988527,-0.450486 1.028511,-0.486687 0.943203,-0.853915 -0.3225,-1.388288 -1.435008,-1.655498 -2.98938,-0.718014 -1.87342,1.129913 -3.152837,1.029569 -4.234516,-0.332114 -1.007291,-1.268037 -1.395532,-2.461942 -1.126467,-3.464067 0.0747,-0.278231 0.105755,-0.281453 1.062117,-0.11019 2.105209,0.376995 4.138374,0.118608 4.273012,-0.543041 0.0331,-0.16267 0.09572,-0.759116 0.139163,-1.325434 0.04344,-0.566318 0.243536,-2.734989 0.444662,-4.819266 0.426137,-4.416072 0.420806,-4.456648 -0.657393,-5.003012 -0.918155,-0.465264 -2.630108,-1.023579 -3.138586,-1.023579 -0.527102,0 -1.2616,0.651055 -2.763621,2.449661 -1.57056,1.880674 -2.527354,4.025113 -3.068349,6.877006 -0.244238,1.287517 -0.280315,3.887105 -0.06681,4.814134 0.532377,2.311561 2.427766,4.148279 4.672712,4.528069 0.481688,0.08149 1.184697,0.201146 1.562242,0.265901 1.093625,0.187573 2.23036,0.165009 3.105004,-0.06163 z M 69.6886,57.246943 c 0.98885,-0.187532 1.421111,-0.561549 3.182538,-2.753712 1.60853,-2.001878 2.574531,-3.702763 2.846219,-5.011479 0.235935,-1.136491 0.130421,-2.693993 -0.215021,-3.173962 -0.404366,-0.56184 -2.174491,-1.409171 -2.949649,-1.411949 -0.554557,-0.002 -0.650589,0.04528 -0.879575,0.432922 -0.15728,0.266255 -0.252946,0.679228 -0.246473,1.063992 0.0058,0.345861 0.02189,1.277531 0.03572,2.070377 0.04284,2.456588 -0.624803,4.410179 -2.01584,5.898511 -0.708604,0.758167 -0.710655,0.759184 -0.840474,0.416798 -0.07158,-0.188773 -0.201978,-1.764168 -0.289784,-3.500878 -0.08781,-1.73671 -0.1808,-3.577574 -0.206654,-4.09081 -0.05827,-1.156776 -0.245039,-1.381853 -1.721615,-2.074768 -1.391358,-0.652924 -1.903932,-0.738421 -2.334887,-0.389454 -0.702943,0.569209 -0.460282,3.423445 0.809372,9.519953 0.578703,2.778769 0.915369,3.143077 2.905389,3.143941 0.650399,2.74e-4 1.51473,-0.06249 1.920734,-0.139482 z"
   id="path983" /><path
   style="opacity:0.99;fill:#ff2a2a;fill-opacity:0;stroke-width:0.137289"
   d="M 46.472437,97.595582 C 25.723912,96.665204 7.6584552,82.292986 1.914747,62.147109 -0.78434431,52.680132 -0.48524058,42.283477 2.7547543,32.948999 8.5783121,16.171234 23.197624,3.7511015 40.63764,0.76482214 45.837016,-0.12547441 52.284821,-0.09995277 57.468388,0.83144144 75.005957,3.9826287 89.52687,16.546661 95.144202,33.429951 c 2.416543,7.26309 3.112077,14.856915 2.043374,22.309515 -2.27738,15.881311 -12.172891,29.585404 -26.577019,36.805973 -7.453237,3.736193 -15.569893,5.434348 -24.13812,5.050143 z M 81.023178,65.384041 c -0.865869,-4.061399 -1.123518,-6.068613 -0.973892,-7.587091 0.05021,-0.509586 0.130373,-0.987458 0.178133,-1.061938 0.04776,-0.07448 0.439338,-0.237209 0.870174,-0.361618 0.832649,-0.240436 2.173753,-1.209458 4.794438,-3.464245 1.962973,-1.688903 2.790565,-2.964459 3.211092,-4.949211 0.376628,-1.777562 0.179323,-4.664334 -0.394663,-5.7743 -0.410337,-0.793505 -1.011575,-1.210183 -2.595144,-1.798526 -1.329164,-0.493823 -1.69304,-0.573297 -2.624694,-0.573256 -0.961393,4.3e-5 -1.167382,0.04849 -1.853406,0.435937 -1.102105,0.622432 -2.59092,2.17884 -3.204404,3.349887 -0.279876,0.534239 -0.664676,1.522722 -0.855112,2.196629 -0.288125,1.019606 -1.448769,6.827601 -1.448769,7.249804 0,0.07069 -0.288307,0.393219 -0.640684,0.716736 -0.81581,0.748994 -0.845344,1.162216 -0.144219,2.017845 0.613481,0.748675 0.65485,0.922759 1.338193,5.631213 0.304843,2.10047 0.628823,3.938431 0.719956,4.084357 0.149842,0.239936 0.334953,0.265323 1.934595,0.265323 h 1.768897 z m -23.018438,-7.2182 1.02967,-0.169893 v -3.976165 -3.976167 l 2.127985,-0.301363 c 1.170391,-0.16575 2.169789,-0.305127 2.220885,-0.309729 0.0511,-0.0046 0.113591,-0.115802 0.138878,-0.247113 0.04661,-0.242007 -1.751927,-1.995642 -2.79663,-2.726817 -0.620639,-0.434377 -1.048462,-0.350682 -1.164147,0.22774 -0.07361,0.368065 -0.457147,0.862722 -0.459264,0.592326 -0.08757,-11.183267 -0.149054,-13.710359 -0.340687,-14.002827 -0.306524,-0.467814 -1.928427,-1.192246 -2.81603,-1.257797 -0.995207,-0.0735 -1.320416,0.244825 -1.526251,1.493938 -0.234007,1.420079 0.02801,6.076398 0.67714,12.03376 l 0.243093,2.230951 h -1.466543 c -1.73004,0 -2.017602,0.141754 -2.140089,1.054959 -0.06478,0.482961 -0.02408,0.624234 0.262353,0.910666 0.304246,0.304244 0.492575,0.348522 1.83576,0.431586 0.823205,0.05091 1.562679,0.113007 1.643279,0.137995 0.150166,0.04656 0.393561,2.773712 0.56118,6.287841 l 0.09015,1.889937 0.4248,-0.07697 c 0.23364,-0.04233 0.888152,-0.15342 1.45447,-0.24686 z M 27.801088,57.676929 c 1.354305,-0.365932 1.438701,-0.409339 1.394635,-0.717293 -0.08598,-0.600877 -2.49025,-11.129651 -3.255486,-14.256414 -1.093063,-4.466271 -1.259172,-4.677041 -3.768011,-4.781115 -1.905377,-0.07904 -1.955368,-0.0394 -2.864461,2.271457 -0.861511,2.189901 -1.287069,3.656174 -1.831717,6.311224 -0.35544,1.732705 -0.457062,2.050796 -0.592116,1.853406 -0.08967,-0.131057 -0.769628,-1.412109 -1.511017,-2.846782 -1.794763,-3.473066 -2.147576,-4.016283 -2.780408,-4.280925 -0.93961,-0.392931 -3.5529144,0.06309 -3.9065984,0.681698 -0.2501882,0.437592 -0.2430908,9.421462 0.00886,11.218784 0.5296513,3.778283 0.9293271,4.252603 3.0528704,3.623023 1.117137,-0.331205 1.770141,-0.708353 1.923117,-1.110712 0.125039,-0.328877 0.02807,-1.362948 -0.364329,-3.885204 -0.05718,-0.367536 0.25247,0.05209 1.317004,1.784761 0.765469,1.245901 1.495008,2.379714 1.621199,2.519586 0.500233,0.554463 0.968347,0.677026 2.212124,0.579178 1.596882,-0.125628 2.124298,-0.285736 2.530173,-0.768091 0.434534,-0.516414 0.462186,-0.731423 0.703855,-5.472777 0.109254,-2.143457 0.218527,-3.917078 0.24283,-3.941381 0.0243,-0.0243 0.834064,2.501104 1.79947,5.612015 0.965406,3.110912 1.819858,5.734011 1.898784,5.82911 0.206725,0.249088 0.551512,0.213556 2.169219,-0.223548 z m 11.137185,-0.07559 c 0.500022,-0.105987 1.294457,-0.387216 1.765413,-0.624953 l 0.856282,-0.43225 -0.312343,-0.332475 C 40.41703,55.327534 38.771413,55.06609 37.411341,55.60218 c -0.890263,0.350909 -1.857382,0.354841 -2.423158,0.0099 -1.075662,-0.655898 -1.768326,-2.382 -1.665899,-4.151378 0.03425,-0.591715 0.09277,-1.106335 0.130033,-1.143599 0.03726,-0.03726 1.215518,-9.61e-4 2.618345,0.08054 1.787084,0.103901 2.631413,0.105036 2.820585,0.0038 0.635742,-0.340238 0.846645,-2.909491 0.529343,-6.448523 -0.307929,-3.434496 -0.54509,-3.813563 -2.636256,-4.213669 -1.650896,-0.315868 -2.479134,-0.26627 -3.285738,0.196767 -1.078168,0.618928 -2.824884,2.531783 -3.409348,3.733629 -0.775518,1.594715 -0.967902,2.917697 -0.976558,6.715592 l -0.0074,3.226299 0.378204,0.770122 c 0.742201,1.511314 2.518215,2.77269 4.513532,3.20564 1.148446,0.249194 3.796413,0.256746 4.9412,0.01409 z m 11.11968,-0.287187 c 0.445896,-0.115543 1.275248,-0.421771 1.843007,-0.680506 0.988527,-0.450486 1.028511,-0.486687 0.943203,-0.853915 -0.3225,-1.388288 -1.435008,-1.655498 -2.98938,-0.718014 -1.87342,1.129913 -3.152837,1.029569 -4.234516,-0.332114 -1.007291,-1.268037 -1.395532,-2.461942 -1.126467,-3.464067 0.0747,-0.278231 0.105755,-0.281453 1.062117,-0.11019 2.105209,0.376995 4.138374,0.118608 4.273012,-0.543041 0.0331,-0.16267 0.09572,-0.759116 0.139163,-1.325434 0.04344,-0.566318 0.243536,-2.734989 0.444662,-4.819266 0.426137,-4.416072 0.420806,-4.456648 -0.657393,-5.003012 -0.918155,-0.465264 -2.630108,-1.023579 -3.138586,-1.023579 -0.527102,0 -1.2616,0.651055 -2.763621,2.449661 -1.57056,1.880674 -2.527354,4.025113 -3.068349,6.877006 -0.244238,1.287517 -0.280315,3.887105 -0.06681,4.814134 0.532377,2.311561 2.427766,4.148279 4.672712,4.528069 0.481688,0.08149 1.184697,0.201146 1.562242,0.265901 1.093625,0.187573 2.23036,0.165009 3.105004,-0.06163 z M 69.6886,57.246943 c 0.98885,-0.187532 1.421111,-0.561549 3.182538,-2.753712 1.60853,-2.001878 2.574531,-3.702763 2.846219,-5.011479 0.235935,-1.136491 0.130421,-2.693993 -0.215021,-3.173962 -0.404366,-0.56184 -2.174491,-1.409171 -2.949649,-1.411949 -0.554557,-0.002 -0.650589,0.04528 -0.879575,0.432922 -0.15728,0.266255 -0.252946,0.679228 -0.246473,1.063992 0.0058,0.345861 0.02189,1.277531 0.03572,2.070377 0.04284,2.456588 -0.624803,4.410179 -2.01584,5.898511 -0.708604,0.758167 -0.710655,0.759184 -0.840474,0.416798 -0.07158,-0.188773 -0.201978,-1.764168 -0.289784,-3.500878 -0.08781,-1.73671 -0.1808,-3.577574 -0.206654,-4.09081 -0.05827,-1.156776 -0.245039,-1.381853 -1.721615,-2.074768 -1.391358,-0.652924 -1.903932,-0.738421 -2.334887,-0.389454 -0.702943,0.569209 -0.460282,3.423445 0.809372,9.519953 0.578703,2.778769 0.915369,3.143077 2.905389,3.143941 0.650399,2.74e-4 1.51473,-0.06249 1.920734,-0.139482 z"
   id="path985" /><path
   style="opacity:0.99;fill:#ff2a2a;fill-opacity:0;stroke-width:0.137289"
   d="M 46.472437,97.595582 C 25.723912,96.665204 7.6584552,82.292986 1.914747,62.147109 -0.78434431,52.680132 -0.48524058,42.283477 2.7547543,32.948999 8.5783121,16.171234 23.197624,3.7511015 40.63764,0.76482214 45.837016,-0.12547441 52.284821,-0.09995277 57.468388,0.83144144 75.005957,3.9826287 89.52687,16.546661 95.144202,33.429951 c 2.416543,7.26309 3.112077,14.856915 2.043374,22.309515 -2.27738,15.881311 -12.172891,29.585404 -26.577019,36.805973 -7.453237,3.736193 -15.569893,5.434348 -24.13812,5.050143 z M 81.023178,65.384041 c -0.865869,-4.061399 -1.123518,-6.068613 -0.973892,-7.587091 0.05021,-0.509586 0.130373,-0.987458 0.178133,-1.061938 0.04776,-0.07448 0.439338,-0.237209 0.870174,-0.361618 0.832649,-0.240436 2.173753,-1.209458 4.794438,-3.464245 1.962973,-1.688903 2.790565,-2.964459 3.211092,-4.949211 0.376628,-1.777562 0.179323,-4.664334 -0.394663,-5.7743 -0.410337,-0.793505 -1.011575,-1.210183 -2.595144,-1.798526 -1.329164,-0.493823 -1.69304,-0.573297 -2.624694,-0.573256 -0.961393,4.3e-5 -1.167382,0.04849 -1.853406,0.435937 -1.102105,0.622432 -2.59092,2.17884 -3.204404,3.349887 -0.279876,0.534239 -0.664676,1.522722 -0.855112,2.196629 -0.288125,1.019606 -1.448769,6.827601 -1.448769,7.249804 0,0.07069 -0.288307,0.393219 -0.640684,0.716736 -0.81581,0.748994 -0.845344,1.162216 -0.144219,2.017845 0.613481,0.748675 0.65485,0.922759 1.338193,5.631213 0.304843,2.10047 0.628823,3.938431 0.719956,4.084357 0.149842,0.239936 0.334953,0.265323 1.934595,0.265323 h 1.768897 z m -23.018438,-7.2182 1.02967,-0.169893 v -3.976165 -3.976167 l 2.127985,-0.301363 c 1.170391,-0.16575 2.169789,-0.305127 2.220885,-0.309729 0.0511,-0.0046 0.113591,-0.115802 0.138878,-0.247113 0.04661,-0.242007 -1.751927,-1.995642 -2.79663,-2.726817 -0.620639,-0.434377 -1.048462,-0.350682 -1.164147,0.22774 -0.07361,0.368065 -0.457147,0.862722 -0.459264,0.592326 -0.08757,-11.183267 -0.149054,-13.710359 -0.340687,-14.002827 -0.306524,-0.467814 -1.928427,-1.192246 -2.81603,-1.257797 -0.995207,-0.0735 -1.320416,0.244825 -1.526251,1.493938 -0.234007,1.420079 0.02801,6.076398 0.67714,12.03376 l 0.243093,2.230951 h -1.466543 c -1.73004,0 -2.017602,0.141754 -2.140089,1.054959 -0.06478,0.482961 -0.02408,0.624234 0.262353,0.910666 0.304246,0.304244 0.492575,0.348522 1.83576,0.431586 0.823205,0.05091 1.562679,0.113007 1.643279,0.137995 0.150166,0.04656 0.393561,2.773712 0.56118,6.287841 l 0.09015,1.889937 0.4248,-0.07697 c 0.23364,-0.04233 0.888152,-0.15342 1.45447,-0.24686 z M 27.801088,57.676929 c 1.354305,-0.365932 1.438701,-0.409339 1.394635,-0.717293 -0.08598,-0.600877 -2.49025,-11.129651 -3.255486,-14.256414 -1.093063,-4.466271 -1.259172,-4.677041 -3.768011,-4.781115 -1.905377,-0.07904 -1.955368,-0.0394 -2.864461,2.271457 -0.861511,2.189901 -1.287069,3.656174 -1.831717,6.311224 -0.35544,1.732705 -0.457062,2.050796 -0.592116,1.853406 -0.08967,-0.131057 -0.769628,-1.412109 -1.511017,-2.846782 -1.794763,-3.473066 -2.147576,-4.016283 -2.780408,-4.280925 -0.93961,-0.392931 -3.5529144,0.06309 -3.9065984,0.681698 -0.2501882,0.437592 -0.2430908,9.421462 0.00886,11.218784 0.5296513,3.778283 0.9293271,4.252603 3.0528704,3.623023 1.117137,-0.331205 1.770141,-0.708353 1.923117,-1.110712 0.125039,-0.328877 0.02807,-1.362948 -0.364329,-3.885204 -0.05718,-0.367536 0.25247,0.05209 1.317004,1.784761 0.765469,1.245901 1.495008,2.379714 1.621199,2.519586 0.500233,0.554463 0.968347,0.677026 2.212124,0.579178 1.596882,-0.125628 2.124298,-0.285736 2.530173,-0.768091 0.434534,-0.516414 0.462186,-0.731423 0.703855,-5.472777 0.109254,-2.143457 0.218527,-3.917078 0.24283,-3.941381 0.0243,-0.0243 0.834064,2.501104 1.79947,5.612015 0.965406,3.110912 1.819858,5.734011 1.898784,5.82911 0.206725,0.249088 0.551512,0.213556 2.169219,-0.223548 z m 11.137185,-0.07559 c 0.500022,-0.105987 1.294457,-0.387216 1.765413,-0.624953 l 0.856282,-0.43225 -0.312343,-0.332475 C 40.41703,55.327534 38.771413,55.06609 37.411341,55.60218 c -0.890263,0.350909 -1.857382,0.354841 -2.423158,0.0099 -1.075662,-0.655898 -1.768326,-2.382 -1.665899,-4.151378 0.03425,-0.591715 0.09277,-1.106335 0.130033,-1.143599 0.03726,-0.03726 1.215518,-9.61e-4 2.618345,0.08054 1.787084,0.103901 2.631413,0.105036 2.820585,0.0038 0.635742,-0.340238 0.846645,-2.909491 0.529343,-6.448523 -0.307929,-3.434496 -0.54509,-3.813563 -2.636256,-4.213669 -1.650896,-0.315868 -2.479134,-0.26627 -3.285738,0.196767 -1.078168,0.618928 -2.824884,2.531783 -3.409348,3.733629 -0.775518,1.594715 -0.967902,2.917697 -0.976558,6.715592 l -0.0074,3.226299 0.378204,0.770122 c 0.742201,1.511314 2.518215,2.77269 4.513532,3.20564 1.148446,0.249194 3.796413,0.256746 4.9412,0.01409 z m 11.11968,-0.287187 c 0.445896,-0.115543 1.275248,-0.421771 1.843007,-0.680506 0.988527,-0.450486 1.028511,-0.486687 0.943203,-0.853915 -0.3225,-1.388288 -1.435008,-1.655498 -2.98938,-0.718014 -1.87342,1.129913 -3.152837,1.029569 -4.234516,-0.332114 -1.007291,-1.268037 -1.395532,-2.461942 -1.126467,-3.464067 0.0747,-0.278231 0.105755,-0.281453 1.062117,-0.11019 2.105209,0.376995 4.138374,0.118608 4.273012,-0.543041 0.0331,-0.16267 0.09572,-0.759116 0.139163,-1.325434 0.04344,-0.566318 0.243536,-2.734989 0.444662,-4.819266 0.426137,-4.416072 0.420806,-4.456648 -0.657393,-5.003012 -0.918155,-0.465264 -2.630108,-1.023579 -3.138586,-1.023579 -0.527102,0 -1.2616,0.651055 -2.763621,2.449661 -1.57056,1.880674 -2.527354,4.025113 -3.068349,6.877006 -0.244238,1.287517 -0.280315,3.887105 -0.06681,4.814134 0.532377,2.311561 2.427766,4.148279 4.672712,4.528069 0.481688,0.08149 1.184697,0.201146 1.562242,0.265901 1.093625,0.187573 2.23036,0.165009 3.105004,-0.06163 z M 69.6886,57.246943 c 0.98885,-0.187532 1.421111,-0.561549 3.182538,-2.753712 1.60853,-2.001878 2.574531,-3.702763 2.846219,-5.011479 0.235935,-1.136491 0.130421,-2.693993 -0.215021,-3.173962 -0.404366,-0.56184 -2.174491,-1.409171 -2.949649,-1.411949 -0.554557,-0.002 -0.650589,0.04528 -0.879575,0.432922 -0.15728,0.266255 -0.252946,0.679228 -0.246473,1.063992 0.0058,0.345861 0.02189,1.277531 0.03572,2.070377 0.04284,2.456588 -0.624803,4.410179 -2.01584,5.898511 -0.708604,0.758167 -0.710655,0.759184 -0.840474,0.416798 -0.07158,-0.188773 -0.201978,-1.764168 -0.289784,-3.500878 -0.08781,-1.73671 -0.1808,-3.577574 -0.206654,-4.09081 -0.05827,-1.156776 -0.245039,-1.381853 -1.721615,-2.074768 -1.391358,-0.652924 -1.903932,-0.738421 -2.334887,-0.389454 -0.702943,0.569209 -0.460282,3.423445 0.809372,9.519953 0.578703,2.778769 0.915369,3.143077 2.905389,3.143941 0.650399,2.74e-4 1.51473,-0.06249 1.920734,-0.139482 z"
   id="path987" /><path
   style="opacity:0.99;fill:#ff2a2a;fill-opacity:0;stroke-width:0.137289"
   d="M 46.472437,97.595582 C 25.723912,96.665204 7.6584552,82.292986 1.914747,62.147109 -0.78434431,52.680132 -0.48524058,42.283477 2.7547543,32.948999 8.5783121,16.171234 23.197624,3.7511015 40.63764,0.76482214 45.837016,-0.12547441 52.284821,-0.09995277 57.468388,0.83144144 75.005957,3.9826287 89.52687,16.546661 95.144202,33.429951 c 2.416543,7.26309 3.112077,14.856915 2.043374,22.309515 -2.27738,15.881311 -12.172891,29.585404 -26.577019,36.805973 -7.453237,3.736193 -15.569893,5.434348 -24.13812,5.050143 z M 81.023178,65.384041 c -0.865869,-4.061399 -1.123518,-6.068613 -0.973892,-7.587091 0.05021,-0.509586 0.130373,-0.987458 0.178133,-1.061938 0.04776,-0.07448 0.439338,-0.237209 0.870174,-0.361618 0.832649,-0.240436 2.173753,-1.209458 4.794438,-3.464245 1.962973,-1.688903 2.790565,-2.964459 3.211092,-4.949211 0.376628,-1.777562 0.179323,-4.664334 -0.394663,-5.7743 -0.410337,-0.793505 -1.011575,-1.210183 -2.595144,-1.798526 -1.329164,-0.493823 -1.69304,-0.573297 -2.624694,-0.573256 -0.961393,4.3e-5 -1.167382,0.04849 -1.853406,0.435937 -1.102105,0.622432 -2.59092,2.17884 -3.204404,3.349887 -0.279876,0.534239 -0.664676,1.522722 -0.855112,2.196629 -0.288125,1.019606 -1.448769,6.827601 -1.448769,7.249804 0,0.07069 -0.288307,0.393219 -0.640684,0.716736 -0.81581,0.748994 -0.845344,1.162216 -0.144219,2.017845 0.613481,0.748675 0.65485,0.922759 1.338193,5.631213 0.304843,2.10047 0.628823,3.938431 0.719956,4.084357 0.149842,0.239936 0.334953,0.265323 1.934595,0.265323 h 1.768897 z m -23.018438,-7.2182 1.02967,-0.169893 v -3.976165 -3.976167 l 2.127985,-0.301363 c 1.170391,-0.16575 2.169789,-0.305127 2.220885,-0.309729 0.0511,-0.0046 0.113591,-0.115802 0.138878,-0.247113 0.04661,-0.242007 -1.751927,-1.995642 -2.79663,-2.726817 -0.620639,-0.434377 -1.048462,-0.350682 -1.164147,0.22774 -0.07361,0.368065 -0.457147,0.862722 -0.459264,0.592326 -0.08757,-11.183267 -0.149054,-13.710359 -0.340687,-14.002827 -0.306524,-0.467814 -1.928427,-1.192246 -2.81603,-1.257797 -0.995207,-0.0735 -1.320416,0.244825 -1.526251,1.493938 -0.234007,1.420079 0.02801,6.076398 0.67714,12.03376 l 0.243093,2.230951 h -1.466543 c -1.73004,0 -2.017602,0.141754 -2.140089,1.054959 -0.06478,0.482961 -0.02408,0.624234 0.262353,0.910666 0.304246,0.304244 0.492575,0.348522 1.83576,0.431586 0.823205,0.05091 1.562679,0.113007 1.643279,0.137995 0.150166,0.04656 0.393561,2.773712 0.56118,6.287841 l 0.09015,1.889937 0.4248,-0.07697 c 0.23364,-0.04233 0.888152,-0.15342 1.45447,-0.24686 z M 27.801088,57.676929 c 1.354305,-0.365932 1.438701,-0.409339 1.394635,-0.717293 -0.08598,-0.600877 -2.49025,-11.129651 -3.255486,-14.256414 -1.093063,-4.466271 -1.259172,-4.677041 -3.768011,-4.781115 -1.905377,-0.07904 -1.955368,-0.0394 -2.864461,2.271457 -0.861511,2.189901 -1.287069,3.656174 -1.831717,6.311224 -0.35544,1.732705 -0.457062,2.050796 -0.592116,1.853406 -0.08967,-0.131057 -0.769628,-1.412109 -1.511017,-2.846782 -1.794763,-3.473066 -2.147576,-4.016283 -2.780408,-4.280925 -0.93961,-0.392931 -3.5529144,0.06309 -3.9065984,0.681698 -0.2501882,0.437592 -0.2430908,9.421462 0.00886,11.218784 0.5296513,3.778283 0.9293271,4.252603 3.0528704,3.623023 1.117137,-0.331205 1.770141,-0.708353 1.923117,-1.110712 0.125039,-0.328877 0.02807,-1.362948 -0.364329,-3.885204 -0.05718,-0.367536 0.25247,0.05209 1.317004,1.784761 0.765469,1.245901 1.495008,2.379714 1.621199,2.519586 0.500233,0.554463 0.968347,0.677026 2.212124,0.579178 1.596882,-0.125628 2.124298,-0.285736 2.530173,-0.768091 0.434534,-0.516414 0.462186,-0.731423 0.703855,-5.472777 0.109254,-2.143457 0.218527,-3.917078 0.24283,-3.941381 0.0243,-0.0243 0.834064,2.501104 1.79947,5.612015 0.965406,3.110912 1.819858,5.734011 1.898784,5.82911 0.206725,0.249088 0.551512,0.213556 2.169219,-0.223548 z m 11.137185,-0.07559 c 0.500022,-0.105987 1.294457,-0.387216 1.765413,-0.624953 l 0.856282,-0.43225 -0.312343,-0.332475 C 40.41703,55.327534 38.771413,55.06609 37.411341,55.60218 c -0.890263,0.350909 -1.857382,0.354841 -2.423158,0.0099 -1.075662,-0.655898 -1.768326,-2.382 -1.665899,-4.151378 0.03425,-0.591715 0.09277,-1.106335 0.130033,-1.143599 0.03726,-0.03726 1.215518,-9.61e-4 2.618345,0.08054 1.787084,0.103901 2.631413,0.105036 2.820585,0.0038 0.635742,-0.340238 0.846645,-2.909491 0.529343,-6.448523 -0.307929,-3.434496 -0.54509,-3.813563 -2.636256,-4.213669 -1.650896,-0.315868 -2.479134,-0.26627 -3.285738,0.196767 -1.078168,0.618928 -2.824884,2.531783 -3.409348,3.733629 -0.775518,1.594715 -0.967902,2.917697 -0.976558,6.715592 l -0.0074,3.226299 0.378204,0.770122 c 0.742201,1.511314 2.518215,2.77269 4.513532,3.20564 1.148446,0.249194 3.796413,0.256746 4.9412,0.01409 z m 11.11968,-0.287187 c 0.445896,-0.115543 1.275248,-0.421771 1.843007,-0.680506 0.988527,-0.450486 1.028511,-0.486687 0.943203,-0.853915 -0.3225,-1.388288 -1.435008,-1.655498 -2.98938,-0.718014 -1.87342,1.129913 -3.152837,1.029569 -4.234516,-0.332114 -1.007291,-1.268037 -1.395532,-2.461942 -1.126467,-3.464067 0.0747,-0.278231 0.105755,-0.281453 1.062117,-0.11019 2.105209,0.376995 4.138374,0.118608 4.273012,-0.543041 0.0331,-0.16267 0.09572,-0.759116 0.139163,-1.325434 0.04344,-0.566318 0.243536,-2.734989 0.444662,-4.819266 0.426137,-4.416072 0.420806,-4.456648 -0.657393,-5.003012 -0.918155,-0.465264 -2.630108,-1.023579 -3.138586,-1.023579 -0.527102,0 -1.2616,0.651055 -2.763621,2.449661 -1.57056,1.880674 -2.527354,4.025113 -3.068349,6.877006 -0.244238,1.287517 -0.280315,3.887105 -0.06681,4.814134 0.532377,2.311561 2.427766,4.148279 4.672712,4.528069 0.481688,0.08149 1.184697,0.201146 1.562242,0.265901 1.093625,0.187573 2.23036,0.165009 3.105004,-0.06163 z M 69.6886,57.246943 c 0.98885,-0.187532 1.421111,-0.561549 3.182538,-2.753712 1.60853,-2.001878 2.574531,-3.702763 2.846219,-5.011479 0.235935,-1.136491 0.130421,-2.693993 -0.215021,-3.173962 -0.404366,-0.56184 -2.174491,-1.409171 -2.949649,-1.411949 -0.554557,-0.002 -0.650589,0.04528 -0.879575,0.432922 -0.15728,0.266255 -0.252946,0.679228 -0.246473,1.063992 0.0058,0.345861 0.02189,1.277531 0.03572,2.070377 0.04284,2.456588 -0.624803,4.410179 -2.01584,5.898511 -0.708604,0.758167 -0.710655,0.759184 -0.840474,0.416798 -0.07158,-0.188773 -0.201978,-1.764168 -0.289784,-3.500878 -0.08781,-1.73671 -0.1808,-3.577574 -0.206654,-4.09081 -0.05827,-1.156776 -0.245039,-1.381853 -1.721615,-2.074768 -1.391358,-0.652924 -1.903932,-0.738421 -2.334887,-0.389454 -0.702943,0.569209 -0.460282,3.423445 0.809372,9.519953 0.578703,2.778769 0.915369,3.143077 2.905389,3.143941 0.650399,2.74e-4 1.51473,-0.06249 1.920734,-0.139482 z"
   id="path989" /><path
   style="opacity:0.99;fill:#ff2a2a;fill-opacity:0;stroke-width:0.137289"
   d="M 46.472437,97.595582 C 25.723912,96.665204 7.6584552,82.292986 1.914747,62.147109 -0.78434431,52.680132 -0.48524058,42.283477 2.7547543,32.948999 8.5783121,16.171234 23.197624,3.7511015 40.63764,0.76482214 45.837016,-0.12547441 52.284821,-0.09995277 57.468388,0.83144144 75.005957,3.9826287 89.52687,16.546661 95.144202,33.429951 c 2.416543,7.26309 3.112077,14.856915 2.043374,22.309515 -2.27738,15.881311 -12.172891,29.585404 -26.577019,36.805973 -7.453237,3.736193 -15.569893,5.434348 -24.13812,5.050143 z M 81.023178,65.384041 c -0.865869,-4.061399 -1.123518,-6.068613 -0.973892,-7.587091 0.05021,-0.509586 0.130373,-0.987458 0.178133,-1.061938 0.04776,-0.07448 0.439338,-0.237209 0.870174,-0.361618 0.832649,-0.240436 2.173753,-1.209458 4.794438,-3.464245 1.962973,-1.688903 2.790565,-2.964459 3.211092,-4.949211 0.376628,-1.777562 0.179323,-4.664334 -0.394663,-5.7743 -0.410337,-0.793505 -1.011575,-1.210183 -2.595144,-1.798526 -1.329164,-0.493823 -1.69304,-0.573297 -2.624694,-0.573256 -0.961393,4.3e-5 -1.167382,0.04849 -1.853406,0.435937 -1.102105,0.622432 -2.59092,2.17884 -3.204404,3.349887 -0.279876,0.534239 -0.664676,1.522722 -0.855112,2.196629 -0.288125,1.019606 -1.448769,6.827601 -1.448769,7.249804 0,0.07069 -0.288307,0.393219 -0.640684,0.716736 -0.81581,0.748994 -0.845344,1.162216 -0.144219,2.017845 0.613481,0.748675 0.65485,0.922759 1.338193,5.631213 0.304843,2.10047 0.628823,3.938431 0.719956,4.084357 0.149842,0.239936 0.334953,0.265323 1.934595,0.265323 h 1.768897 z m -23.018438,-7.2182 1.02967,-0.169893 v -3.976165 -3.976167 l 2.127985,-0.301363 c 1.170391,-0.16575 2.169789,-0.305127 2.220885,-0.309729 0.0511,-0.0046 0.113591,-0.115802 0.138878,-0.247113 0.04661,-0.242007 -1.751927,-1.995642 -2.79663,-2.726817 -0.620639,-0.434377 -1.048462,-0.350682 -1.164147,0.22774 -0.07361,0.368065 -0.457147,0.862722 -0.459264,0.592326 -0.08757,-11.183267 -0.149054,-13.710359 -0.340687,-14.002827 -0.306524,-0.467814 -1.928427,-1.192246 -2.81603,-1.257797 -0.995207,-0.0735 -1.320416,0.244825 -1.526251,1.493938 -0.234007,1.420079 0.02801,6.076398 0.67714,12.03376 l 0.243093,2.230951 h -1.466543 c -1.73004,0 -2.017602,0.141754 -2.140089,1.054959 -0.06478,0.482961 -0.02408,0.624234 0.262353,0.910666 0.304246,0.304244 0.492575,0.348522 1.83576,0.431586 0.823205,0.05091 1.562679,0.113007 1.643279,0.137995 0.150166,0.04656 0.393561,2.773712 0.56118,6.287841 l 0.09015,1.889937 0.4248,-0.07697 c 0.23364,-0.04233 0.888152,-0.15342 1.45447,-0.24686 z M 27.801088,57.676929 c 1.354305,-0.365932 1.438701,-0.409339 1.394635,-0.717293 -0.08598,-0.600877 -2.49025,-11.129651 -3.255486,-14.256414 -1.093063,-4.466271 -1.259172,-4.677041 -3.768011,-4.781115 -1.905377,-0.07904 -1.955368,-0.0394 -2.864461,2.271457 -0.861511,2.189901 -1.287069,3.656174 -1.831717,6.311224 -0.35544,1.732705 -0.457062,2.050796 -0.592116,1.853406 -0.08967,-0.131057 -0.769628,-1.412109 -1.511017,-2.846782 -1.794763,-3.473066 -2.147576,-4.016283 -2.780408,-4.280925 -0.93961,-0.392931 -3.5529144,0.06309 -3.9065984,0.681698 -0.2501882,0.437592 -0.2430908,9.421462 0.00886,11.218784 0.5296513,3.778283 0.9293271,4.252603 3.0528704,3.623023 1.117137,-0.331205 1.770141,-0.708353 1.923117,-1.110712 0.125039,-0.328877 0.02807,-1.362948 -0.364329,-3.885204 -0.05718,-0.367536 0.25247,0.05209 1.317004,1.784761 0.765469,1.245901 1.495008,2.379714 1.621199,2.519586 0.500233,0.554463 0.968347,0.677026 2.212124,0.579178 1.596882,-0.125628 2.124298,-0.285736 2.530173,-0.768091 0.434534,-0.516414 0.462186,-0.731423 0.703855,-5.472777 0.109254,-2.143457 0.218527,-3.917078 0.24283,-3.941381 0.0243,-0.0243 0.834064,2.501104 1.79947,5.612015 0.965406,3.110912 1.819858,5.734011 1.898784,5.82911 0.206725,0.249088 0.551512,0.213556 2.169219,-0.223548 z m 11.137185,-0.07559 c 0.500022,-0.105987 1.294457,-0.387216 1.765413,-0.624953 l 0.856282,-0.43225 -0.312343,-0.332475 C 40.41703,55.327534 38.771413,55.06609 37.411341,55.60218 c -0.890263,0.350909 -1.857382,0.354841 -2.423158,0.0099 -1.075662,-0.655898 -1.768326,-2.382 -1.665899,-4.151378 0.03425,-0.591715 0.09277,-1.106335 0.130033,-1.143599 0.03726,-0.03726 1.215518,-9.61e-4 2.618345,0.08054 1.787084,0.103901 2.631413,0.105036 2.820585,0.0038 0.635742,-0.340238 0.846645,-2.909491 0.529343,-6.448523 -0.307929,-3.434496 -0.54509,-3.813563 -2.636256,-4.213669 -1.650896,-0.315868 -2.479134,-0.26627 -3.285738,0.196767 -1.078168,0.618928 -2.824884,2.531783 -3.409348,3.733629 -0.775518,1.594715 -0.967902,2.917697 -0.976558,6.715592 l -0.0074,3.226299 0.378204,0.770122 c 0.742201,1.511314 2.518215,2.77269 4.513532,3.20564 1.148446,0.249194 3.796413,0.256746 4.9412,0.01409 z m 11.11968,-0.287187 c 0.445896,-0.115543 1.275248,-0.421771 1.843007,-0.680506 0.988527,-0.450486 1.028511,-0.486687 0.943203,-0.853915 -0.3225,-1.388288 -1.435008,-1.655498 -2.98938,-0.718014 -1.87342,1.129913 -3.152837,1.029569 -4.234516,-0.332114 -1.007291,-1.268037 -1.395532,-2.461942 -1.126467,-3.464067 0.0747,-0.278231 0.105755,-0.281453 1.062117,-0.11019 2.105209,0.376995 4.138374,0.118608 4.273012,-0.543041 0.0331,-0.16267 0.09572,-0.759116 0.139163,-1.325434 0.04344,-0.566318 0.243536,-2.734989 0.444662,-4.819266 0.426137,-4.416072 0.420806,-4.456648 -0.657393,-5.003012 -0.918155,-0.465264 -2.630108,-1.023579 -3.138586,-1.023579 -0.527102,0 -1.2616,0.651055 -2.763621,2.449661 -1.57056,1.880674 -2.527354,4.025113 -3.068349,6.877006 -0.244238,1.287517 -0.280315,3.887105 -0.06681,4.814134 0.532377,2.311561 2.427766,4.148279 4.672712,4.528069 0.481688,0.08149 1.184697,0.201146 1.562242,0.265901 1.093625,0.187573 2.23036,0.165009 3.105004,-0.06163 z M 69.6886,57.246943 c 0.98885,-0.187532 1.421111,-0.561549 3.182538,-2.753712 1.60853,-2.001878 2.574531,-3.702763 2.846219,-5.011479 0.235935,-1.136491 0.130421,-2.693993 -0.215021,-3.173962 -0.404366,-0.56184 -2.174491,-1.409171 -2.949649,-1.411949 -0.554557,-0.002 -0.650589,0.04528 -0.879575,0.432922 -0.15728,0.266255 -0.252946,0.679228 -0.246473,1.063992 0.0058,0.345861 0.02189,1.277531 0.03572,2.070377 0.04284,2.456588 -0.624803,4.410179 -2.01584,5.898511 -0.708604,0.758167 -0.710655,0.759184 -0.840474,0.416798 -0.07158,-0.188773 -0.201978,-1.764168 -0.289784,-3.500878 -0.08781,-1.73671 -0.1808,-3.577574 -0.206654,-4.09081 -0.05827,-1.156776 -0.245039,-1.381853 -1.721615,-2.074768 -1.391358,-0.652924 -1.903932,-0.738421 -2.334887,-0.389454 -0.702943,0.569209 -0.460282,3.423445 0.809372,9.519953 0.578703,2.778769 0.915369,3.143077 2.905389,3.143941 0.650399,2.74e-4 1.51473,-0.06249 1.920734,-0.139482 z"
   id="path991" /><path
   style="opacity:0.99;fill:#ff2a2a;fill-opacity:0;stroke-width:0.137289"
   d="M 46.472437,97.595582 C 25.723912,96.665204 7.6584552,82.292986 1.914747,62.147109 -0.78434431,52.680132 -0.48524058,42.283477 2.7547543,32.948999 8.5783121,16.171234 23.197624,3.7511015 40.63764,0.76482214 45.837016,-0.12547441 52.284821,-0.09995277 57.468388,0.83144144 75.005957,3.9826287 89.52687,16.546661 95.144202,33.429951 c 2.416543,7.26309 3.112077,14.856915 2.043374,22.309515 -2.27738,15.881311 -12.172891,29.585404 -26.577019,36.805973 -7.453237,3.736193 -15.569893,5.434348 -24.13812,5.050143 z M 81.023178,65.384041 c -0.865869,-4.061399 -1.123518,-6.068613 -0.973892,-7.587091 0.05021,-0.509586 0.130373,-0.987458 0.178133,-1.061938 0.04776,-0.07448 0.439338,-0.237209 0.870174,-0.361618 0.832649,-0.240436 2.173753,-1.209458 4.794438,-3.464245 1.962973,-1.688903 2.790565,-2.964459 3.211092,-4.949211 0.376628,-1.777562 0.179323,-4.664334 -0.394663,-5.7743 -0.410337,-0.793505 -1.011575,-1.210183 -2.595144,-1.798526 -1.329164,-0.493823 -1.69304,-0.573297 -2.624694,-0.573256 -0.961393,4.3e-5 -1.167382,0.04849 -1.853406,0.435937 -1.102105,0.622432 -2.59092,2.17884 -3.204404,3.349887 -0.279876,0.534239 -0.664676,1.522722 -0.855112,2.196629 -0.288125,1.019606 -1.448769,6.827601 -1.448769,7.249804 0,0.07069 -0.288307,0.393219 -0.640684,0.716736 -0.81581,0.748994 -0.845344,1.162216 -0.144219,2.017845 0.613481,0.748675 0.65485,0.922759 1.338193,5.631213 0.304843,2.10047 0.628823,3.938431 0.719956,4.084357 0.149842,0.239936 0.334953,0.265323 1.934595,0.265323 h 1.768897 z m -23.018438,-7.2182 1.02967,-0.169893 v -3.976165 -3.976167 l 2.127985,-0.301363 c 1.170391,-0.16575 2.169789,-0.305127 2.220885,-0.309729 0.0511,-0.0046 0.113591,-0.115802 0.138878,-0.247113 0.04661,-0.242007 -1.751927,-1.995642 -2.79663,-2.726817 -0.620639,-0.434377 -1.048462,-0.350682 -1.164147,0.22774 -0.07361,0.368065 -0.457147,0.862722 -0.459264,0.592326 -0.08757,-11.183267 -0.149054,-13.710359 -0.340687,-14.002827 -0.306524,-0.467814 -1.928427,-1.192246 -2.81603,-1.257797 -0.995207,-0.0735 -1.320416,0.244825 -1.526251,1.493938 -0.234007,1.420079 0.02801,6.076398 0.67714,12.03376 l 0.243093,2.230951 h -1.466543 c -1.73004,0 -2.017602,0.141754 -2.140089,1.054959 -0.06478,0.482961 -0.02408,0.624234 0.262353,0.910666 0.304246,0.304244 0.492575,0.348522 1.83576,0.431586 0.823205,0.05091 1.562679,0.113007 1.643279,0.137995 0.150166,0.04656 0.393561,2.773712 0.56118,6.287841 l 0.09015,1.889937 0.4248,-0.07697 c 0.23364,-0.04233 0.888152,-0.15342 1.45447,-0.24686 z M 27.801088,57.676929 c 1.354305,-0.365932 1.438701,-0.409339 1.394635,-0.717293 -0.08598,-0.600877 -2.49025,-11.129651 -3.255486,-14.256414 -1.093063,-4.466271 -1.259172,-4.677041 -3.768011,-4.781115 -1.905377,-0.07904 -1.955368,-0.0394 -2.864461,2.271457 -0.861511,2.189901 -1.287069,3.656174 -1.831717,6.311224 -0.35544,1.732705 -0.457062,2.050796 -0.592116,1.853406 -0.08967,-0.131057 -0.769628,-1.412109 -1.511017,-2.846782 -1.794763,-3.473066 -2.147576,-4.016283 -2.780408,-4.280925 -0.93961,-0.392931 -3.5529144,0.06309 -3.9065984,0.681698 -0.2501882,0.437592 -0.2430908,9.421462 0.00886,11.218784 0.5296513,3.778283 0.9293271,4.252603 3.0528704,3.623023 1.117137,-0.331205 1.770141,-0.708353 1.923117,-1.110712 0.125039,-0.328877 0.02807,-1.362948 -0.364329,-3.885204 -0.05718,-0.367536 0.25247,0.05209 1.317004,1.784761 0.765469,1.245901 1.495008,2.379714 1.621199,2.519586 0.500233,0.554463 0.968347,0.677026 2.212124,0.579178 1.596882,-0.125628 2.124298,-0.285736 2.530173,-0.768091 0.434534,-0.516414 0.462186,-0.731423 0.703855,-5.472777 0.109254,-2.143457 0.218527,-3.917078 0.24283,-3.941381 0.0243,-0.0243 0.834064,2.501104 1.79947,5.612015 0.965406,3.110912 1.819858,5.734011 1.898784,5.82911 0.206725,0.249088 0.551512,0.213556 2.169219,-0.223548 z m 11.137185,-0.07559 c 0.500022,-0.105987 1.294457,-0.387216 1.765413,-0.624953 l 0.856282,-0.43225 -0.312343,-0.332475 C 40.41703,55.327534 38.771413,55.06609 37.411341,55.60218 c -0.890263,0.350909 -1.857382,0.354841 -2.423158,0.0099 -1.075662,-0.655898 -1.768326,-2.382 -1.665899,-4.151378 0.03425,-0.591715 0.09277,-1.106335 0.130033,-1.143599 0.03726,-0.03726 1.215518,-9.61e-4 2.618345,0.08054 1.787084,0.103901 2.631413,0.105036 2.820585,0.0038 0.635742,-0.340238 0.846645,-2.909491 0.529343,-6.448523 -0.307929,-3.434496 -0.54509,-3.813563 -2.636256,-4.213669 -1.650896,-0.315868 -2.479134,-0.26627 -3.285738,0.196767 -1.078168,0.618928 -2.824884,2.531783 -3.409348,3.733629 -0.775518,1.594715 -0.967902,2.917697 -0.976558,6.715592 l -0.0074,3.226299 0.378204,0.770122 c 0.742201,1.511314 2.518215,2.77269 4.513532,3.20564 1.148446,0.249194 3.796413,0.256746 4.9412,0.01409 z m 11.11968,-0.287187 c 0.445896,-0.115543 1.275248,-0.421771 1.843007,-0.680506 0.988527,-0.450486 1.028511,-0.486687 0.943203,-0.853915 -0.3225,-1.388288 -1.435008,-1.655498 -2.98938,-0.718014 -1.87342,1.129913 -3.152837,1.029569 -4.234516,-0.332114 -1.007291,-1.268037 -1.395532,-2.461942 -1.126467,-3.464067 0.0747,-0.278231 0.105755,-0.281453 1.062117,-0.11019 2.105209,0.376995 4.138374,0.118608 4.273012,-0.543041 0.0331,-0.16267 0.09572,-0.759116 0.139163,-1.325434 0.04344,-0.566318 0.243536,-2.734989 0.444662,-4.819266 0.426137,-4.416072 0.420806,-4.456648 -0.657393,-5.003012 -0.918155,-0.465264 -2.630108,-1.023579 -3.138586,-1.023579 -0.527102,0 -1.2616,0.651055 -2.763621,2.449661 -1.57056,1.880674 -2.527354,4.025113 -3.068349,6.877006 -0.244238,1.287517 -0.280315,3.887105 -0.06681,4.814134 0.532377,2.311561 2.427766,4.148279 4.672712,4.528069 0.481688,0.08149 1.184697,0.201146 1.562242,0.265901 1.093625,0.187573 2.23036,0.165009 3.105004,-0.06163 z M 69.6886,57.246943 c 0.98885,-0.187532 1.421111,-0.561549 3.182538,-2.753712 1.60853,-2.001878 2.574531,-3.702763 2.846219,-5.011479 0.235935,-1.136491 0.130421,-2.693993 -0.215021,-3.173962 -0.404366,-0.56184 -2.174491,-1.409171 -2.949649,-1.411949 -0.554557,-0.002 -0.650589,0.04528 -0.879575,0.432922 -0.15728,0.266255 -0.252946,0.679228 -0.246473,1.063992 0.0058,0.345861 0.02189,1.277531 0.03572,2.070377 0.04284,2.456588 -0.624803,4.410179 -2.01584,5.898511 -0.708604,0.758167 -0.710655,0.759184 -0.840474,0.416798 -0.07158,-0.188773 -0.201978,-1.764168 -0.289784,-3.500878 -0.08781,-1.73671 -0.1808,-3.577574 -0.206654,-4.09081 -0.05827,-1.156776 -0.245039,-1.381853 -1.721615,-2.074768 -1.391358,-0.652924 -1.903932,-0.738421 -2.334887,-0.389454 -0.702943,0.569209 -0.460282,3.423445 0.809372,9.519953 0.578703,2.778769 0.915369,3.143077 2.905389,3.143941 0.650399,2.74e-4 1.51473,-0.06249 1.920734,-0.139482 z"
   id="path993" /></svg>
