<?xml version="1.0" encoding="UTF-8" standalone="no"?>
<svg
   xmlns:dc="http://purl.org/dc/elements/1.1/"
   xmlns:cc="http://creativecommons.org/ns#"
   xmlns:rdf="http://www.w3.org/1999/02/22-rdf-syntax-ns#"
   xmlns:svg="http://www.w3.org/2000/svg"
   xmlns="http://www.w3.org/2000/svg"
   xmlns:xlink="http://www.w3.org/1999/xlink"
   xmlns:sodipodi="http://sodipodi.sourceforge.net/DTD/sodipodi-0.dtd"
   xmlns:inkscape="http://www.inkscape.org/namespaces/inkscape"
   width="20mm"
   height="20mm"
   viewBox="0 0 210 210"
   version="1.1"
   id="svg1714"
   inkscape:version="1.0.2 (e86c8708, 2021-01-15)"
   sodipodi:docname="crypteriat_logo.svg">
  <defs
     id="defs1708" />
  <sodipodi:namedview
     id="base"
     pagecolor="#ffffff"
     bordercolor="#666666"
     borderopacity="1.0"
     inkscape:pageopacity="0.0"
     inkscape:pageshadow="2"
     inkscape:zoom="0.35"
     inkscape:cx="400"
     inkscape:cy="560"
     inkscape:document-units="mm"
     inkscape:current-layer="layer1"
     inkscape:document-rotation="0"
     showgrid="false"
     inkscape:window-width="1559"
     inkscape:window-height="1046"
     inkscape:window-x="0"
     inkscape:window-y="25"
     inkscape:window-maximized="0" />
  <metadata
     id="metadata1711">
    <rdf:RDF>
      <cc:Work
         rdf:about="">
        <dc:format>image/svg+xml</dc:format>
        <dc:type
           rdf:resource="http://purl.org/dc/dcmitype/StillImage" />
        <dc:title></dc:title>
      </cc:Work>
    </rdf:RDF>
  </metadata>
  <g
     inkscape:label="Layer 1"
     inkscape:groupmode="layer"
     id="layer1">
    <image
       width="205.67923"
       height="205.67923"
       preserveAspectRatio="none"
       style="image-rendering:optimizeQuality"
       xlink:href="data:image/png;base64,iVBORw0KGgoAAAANSUhEUgAAAQsAAAELCAYAAADOVaNSAAAACXBIWXMAAAsSAAALEgHS3X78AAAg AElEQVR4nOy9B5wlRbn//esTZuacyXlmc142L0Fw2V1yliCCAVRQMSFiuveavb5Xxav+Rcx4VRAV RREUyQsLCyyw5LBL2oVNbE6T8wn9frrP6a7near6hJlZ4pYuc7q7ctXzraeqnuq2bNvGAff2ct+9 6KiL0rY1wSt0PJo6OG1brSHLToUsezBXZaRtq3wwGQqlbOsW714kZN//jd8/cK/m+YB7S7kDsHiL uR98YunkwVToI2WR9JSUjfklYXtMSdiOAKhI23D+YmpdL6pjQ27BN7dVIJm2UF8+iJrsPZPb0VWO ze1ldm08Yc1s7GI+tnSUY09vifs7ZNl9gDXUNRgeikXSryTT1oaBZGhDaTh9zVd/t3KjIeoD7k3i DsDiTez+52NH/4+jFURC9rhwCJNtG9XxaMoqi6RdAIyt7kdZNGksoAeJXH4c98q+KnT2h+2K0pQG CZNbu6cKpeE0JtX1sKdrd1ehLxG2LQudqTQ2JtPW1r5E+OlvX33/tw3RHHBvQHcAFm8Sd9nHjzoO sC8pDdtzSiLp8Wnbih8ytp1lvhAAFAuJpooha3xNr/ZcuiBIBLk9PTG09UXRmwi72kgqba0dSoWe T6atPxyY0rwx3QFYvEGdM51I2dYXK0pSpwwkQ1NKI+nwlLpe41TBEdSIZecEQCF+UCQkBhIRbGyL IxYtDhId/RE0VpinPc6UZl9fSdK2sXEgGXr0ADzeOO4ALN5Azll4jEdTF0TD9mGxSDruTCcSaQsN AesJhYzmhY74z+6oRTKFgiGxqT2OmlgCLZX92nOT29RWgUTKCoREkHtmew16h8Kpskh6dV8i/OA3 fv/A5wK8HnD72R2AxevsHEBUlKQuCYcwb3Jtb8RZeMw3VQgCwMbEPPRn5bB3yMJQ0kJtPK2Fp66n px+79nVjRkM/ZjblXpMYDiQKnfYUGu7pbbVOh32lZyh8Z9iyrziwaPrauQOweB3cZR9fekpJ2P5x acSe6QECOQTEgcBAMtwfb5yctBFONo+fiGjITlfFEuXhkFVWMfgibCsK9L6aDWHBTifhtqzbvjbs 7F9km9u209ln7lM8+3LC/Z0KVSAxNGgPJVJDlhVKJwZ6w7Zt2229VglsWIsmthck9EFlGc1w2UXT lx1wHNA49r87AIvXyGXWIPBjCzhzYu1AhKr6L+2ucoQfkcpmOxkb11dZ19TfOrYlGse+eLW9Pmqn MoLstpVtu8IN0m7efR8GxE9hwCD+nDCZi6xffr16fdq97k1V9CcGukPpVDKcTqcj3mLrawEJ6RyN 56FNtXZNLPlqz1D4u9+66oGrNE8H3IjdAVjsZ+dMM0rD9n9blj1+ZmOP5c3XO9PN2IGDBiobxw+O HVOHprJd1WWJVzkM7AwIbCm0xQLDu+/5g4obsHMDw48HPjC0ZwDWbIyga6gk1dc3mCyxBsOxcCKS b1oDMqVqqRwYFiTktKizvwQb2+N9g8nQPam09fkD05TRcwdgsZ/cDz+59M9p23pPXWwo3lo1AKu0 NrUvOru3ceJBg2Mao1V19rpSJLNrDsbRnAs1F3wYgJGNwwAMBpIRAUPEkX3uAcMP56yZDADrd5ag P1XWn+jvCpdagyUUHkHrLoU4EyRMbu2eSrtvKPJK12D4hwe0jZG7A7AYRedMNcIh+2dDqdC7xlQO htIVkxPVkxb2TJrYFG0Jr62wEz1qOiCFnYJACniBwKD3GTDsNJuOYBSAoe5DA4YCicpj3wCwoa0G Xb3Jwe17+ktmN/cWZL9B3XAWWOFrG+Ud3YPhPx9Y2xi+OwCLUXBZSPwJwOKSummJCbMO7pk+ubqq LvlMJJ1O+4LnCRkVzkKBYRPBhwCDPs1wfqS9aHIAI03WL0SeMExg2DTvIm4/v8De3jg2dVQnBjt3 WnUxvoYjnWebUVWWRHMRkDDF8/yucrs0Yv/lK79d+WHNwwGX0x2AxQicA4loOH1NqnL6O6fOWdg/ a3JpRa39cjhNBdrmgkeFLLeGYYs4MsKX9iEghFgKpJ9m2t0dMQODaimjDwweDkL7gJ+HPZ0hvNrV kBzo3gcKjnwGXIU6UzzPbK9N9idCfzsAjcLdAVgMwzmm12XlVX8YN+/oioXTyyqrQ69G02kigGmT sOcBhjb6GuLIQsBmwMgRBlkNw/1tBgZPdzSAkfZZwYFh1jDkoumejhC2dtcmt+/pDk+r67fG1RS/ puE5EySkOwCNwt0BWBThHEhUjl/4x0PfMbdues3GeNpT47NCYAYGXXjUgaGEM02ERwo/iSMQGGL9 QUwtVPooDBj++gXNd9qPxpg/bd0DfEriaTyg+YUhjsz9zbvD2N1bNhRJ90RnNnZZhbbUcDSSA9DI 7w7AogD3y299/Pyyugk/XHLE2NY6a32Yj75qXSBNpwwFAsMPJ9V2BAikBAZd3GQLnSMFRloJO81P 2s6dv2KA4ecXhjjU/b5BC6/sq7N7uzsxqabHqg4AQKHH7XO5Z7bX9PUnQt/+ym8f/HEOb29LdwAW OdwVX/7gl6cevPSSQ6Z0TSixu4lAKwHh6wOOdgH1bBSAQcObhG5YwCACbASGFHCQaUchQDMBg9pr FAUMWl/AxrZK7OpIDdaW9JR6axsjMegyOWf35PldlftSNs77xu9X3m3w8rZ0B2BhcH/9/c/OGze2 /pczGrfUhdPZ1Xem7pvsIqAEvxBgiLUGCxIYql0YMAxC5wGDQksJv5cMBQYVXrl2UCww5PQnCBhk kXNEwMiE29tdgo1tsaEdbUMlSycVZoJeiKNTmO7BKHZ2lzyQSIU+csC46wAsmLv1tjuOb6m1fz4p 9txsK9WvRl/TiC0ERAOGr0VIo6j9Cww/j0HAkNDIq2HQcHTqYsiTUdjpNAakPoKA4eWXa2I6MDLX zhTlpb2NydDQvnAx6xrS5VrnWLenKtE9GL78i1c+9DUt4NvIHYBFBhKHjKkd+suk2JqDWGekwqQB A2JRko/CcLc57dcFGHk1DAqDgjQML1yaawo0TzYp12sADOrH+X/voIW1e+uSoURHUdBwpjBDBRyd d6YmG9rKd/QMhT/0dn2/xtsaFjfdfNuk5hr8akb1C6eF7AQTHAkMX/A1DcNkSAUFjHRmRIYU1EKA YRL2XMAwHSDTzMKDgcHyrgFDGInR+OW0oxBgaJao1B9IPUHVE8s7NGA4131DFtbua0xW2HtyGnoN d51jW0d5emtX6W3/9X8Pnqk9fIu7tyUsbrr5tpqq8ug3Z9Vv+I9YqJ11RtWJuTDaAiQIVPclMOiW akAYAzCocOpGWzAAQ8/n8IEh8mvQQkYDGNSCVAMGLWNeYEg/NvZ1R7CxvWKoOtJVQqExWouhz2yv dczHz3k7aRlvO1jcfsedn5ja1P3jltKNVZrg0o5r0BzYdqPWcYW9A4YLDL4eEgwMOqpSwARMLaTh F1PxCwcGWyjNAYxgoy2xFSvrnT3DMIDBNbs9fXFs3B1KpJLJaFVpctR2TJDVMnb2lPzo7bKW8baB hTPlGN+I26ZXvTQ704HF1IBNO8DsDDRgsPvgwmMChmaD4Uwn0mLkJcAQQlYUMIhGYYu8S2DQtZdM vFYAMEy7E1JT0OujULPw4oAh11EMQGOgzjzb2Fmf7unqxozGrpDWOUbgvLWM/kRo8Vt9x+RtAYv7 77v7inlNr3whavURYYIODDHa8pF3hBpG9p7ZyhNMoIsDBohA69pJPmCwcBQY2jmSYA1jNIDB24Xk TysjVFpBwGBaCFnPSFh4ua0xVW7vC+dazyjWOadhH99ak46XpN7/xV8/dMOoRfwGc29pWDi7HAeN 6VnWEt/WoE0toIChawcUGKJDB2gYGC1gaNOSQqYk2XwgbRSSwk6q0jg9PyZgqNOsuYFB0ioGGF7a fkZGFxjIrmdsaIsn5zfviWidpgjnbLfu64v6R+adN5Nv7yq95a26+PmWhcV9K5b95ODW9V8MWwnR 6SQwvK1RCGDweXwwMAwdWgOGgpM+JSn84JkmnEbh19ci0tIGQwsjgOFrGOmsdgK9TH5RzcDQzMKN wMhee3Wj1Tt4HBowDFMSD84MGIaj+M7bvXY12fZQJ4q1z8hlk4HMS4XfktOStxwsbr719oOntqRu m1i1qVX1QvKGa23xEn4nZZ3YODqChBsuMDwBDgIGty2gwPBBI8uhXfNtWdvTCOToK1R+HRgEpl5e tC1VoVG9TsDg0zgCDF+zE/nNXvQNhvDC7urkvMadebWMYg6ouYZcQ+Hz30rTkrcULJYtW/bVwyZu +9+ycL+2au/3FBQODDnKcxsMEOErAhikg4/2wTP9HEkeYEjBNQGD1o1fZhMw3ggHz4YHDOf3c7ub 7XK0YWx1r6ZlDPe9Gs5uyd6+6O8u/dXDn9YevgndWwIWjt1EU23k5gUtG5Zm7pAOzWBhq8fiuQ6M tOqAeYHhhZNzZ5OAUA0FbP0iEBgiroKtPNnipSd7BQKDwoCWUZRZAUOUnwr3cMzCqTZXCDAM9Z4f GErjdMK1dUexob08Ob95t6tlODYZuT7yVIhzdkvW7S1/4D9+89DRw4rgDeTe9LBwFjFnjx+6vzm+ s0KBAbqwFA0M0smE4BiNs4zAQLCG4XkQ50gKAYZZwwgAhkHozGbh+mhL0/LStllaQRpGPmBAAFTU k9Y+I9EwaDgODDa1JGV+ds+YZF93V2ROc/eo2WQ8va325c//+qEZ2oM3kXtTw+Lee+/67GHjt/0i bCWZcBQDDC74wwAGuBDpIIGfLzWSySlJ8SdV9w8wcmkY6h7TjjRgFKphBAODaRh5gUHBBRH38IHx alsMnf2wR3I4TTrnXRl9Q+G5b9aFzzctLJ5Ydedds5u2ncgW+YKA4W4B8g5OhkKjwPDtRtIBKSAI GLw4zMCQ2gWUYAQAQwLOBAybxVkkMKgNhlZ+EocERlbAhgUMaWQ1ClMSP+++sIPXu4SHAf5BwOgf CuH5XVUj3mKlbt3uyt5dvaVnvhnNxN90sHDWJ6a0hp6bWrdzrBkOnh0A/cZnWuvMuYChBL9IYNDR t0Bg8DWMEQJDi//NcvBMCLsGDCHUxQLDoIXkAobM3+pdjenWsn2hoDd0FetcM/HekjedAdeomr7u b3fTzbctnDfZ3jKtftdYy1UOrcw/K/sXMPzN3LM8PzSc58ey2G1nATETbSj7WPnlSTnhsulbXhoZ //S+H0c2sOfP/U3zZFkIkRbxvYm8+g8slTcaPwkIWU8WLBKlyqdF4rZoeiLvNFzmvsyvKg8LR+Mn 5ZXtR59ZLBxJyrIMv2UbyXoHqXdVfi9iiyQg8ze/eU+oB/XpbZ3lozKyjq3pDbWUD/39is8sPld7 +AZ2bxpYOAuZh0xLPN5a0Vahw4EKiN4BvXv5gUGFyvtJgOEJJu25MhwDBljejMCg2fGBofJmhQhY LNKbmYBxYFi0PnzhJHnxy2EAhh8mCBjIjLoMGCS/AhhmwefAUPnVlwdkOL3ewePT6WUAhgQ/AYYB Ws7fydV7QpWVMWvdnqrcn6Uv0HnA+OEnl/znaMT3Wrg3xTTkttvv/PiSg7p+F7UGxVqEmOtm1yf8 52yaou7lnZLQNQA/qVznSJDn4BlRp7U4zKowbGEWbquplVy8k2q1F7++CAtWJ3J6ZYu8Mz/etZ8u +R6JNmUyTN1oe5G8a9MOGYc3NQAvs2pSYdfh13MhUxLpR+TXTyK77mUD/UNhPL+zIrWgdV9Y66jD cM7W6qb2+P+9GWwx3vCaxfLld39m6UEdv4uGErq2YInRzKRhGO7l1TCIepxTw2DqbohpB56K7tyn 8elxmFRhqR1ZYkQ0aBgWHTWL0zC8sBbNu6wLgMXlj/KehuE/FyM4zVeeKYmuYZApjWz3IA2DtX2+ KYn0I+sRzK/zJ1aSxmETOsPP72sdlT1VZx0kHLI/9dOLl1ytPXyDuTe0ZrHy/mU/P2Ri26UO5TNN Z1rQlBpG2qhNaGGK1TD82yYNgy/8BWsYYHnT4mAaRuZ3XitPEA2D1APXjkyLouAHz+jCbh4Ng2kK 7u9cJ1UN5zK0xUuRltamQsPwFyINi5J+fmGsJ2MbSE0m8JkXn+X+Xb2zwR4Tbwv8NEE+R1/EM5gM veE1jDcsLB59ePkdc8fuO4UKej5g0H37/QcMauVJdkKgOlpuYBg6tAYMqqqPxCzcVDdS+Pkui+0L uASDQXgYMLzLgE8k5gVGIR8wgvbFM6MNhqxfzQaDtp03MdJBzfIbAIyN7TV2ZbirKGC8tLsK0ZCt vYjnjT4leUPC4qGVy285eELb6X5nYsCgnZ6uNdnaC3SHB4w0eV4kMEyjI5tHFwkM0sELAgaFhgYM kq4sVyHACBptNWB4W7IwlAkkvqyGRoV7NI22JBj2CzAycWzqbLArrPa8wFi7pwql4TQm1QV/kvGN vK36hoPFihX33HDE1PZztI6RvVawkMDQG7FgYPjpcIH0H9P7GjDEaD2KwOA2GCMBBs27am/dBqMQ YBisPCkwaN2QfOjAEGbhXl3sFytPGOIAawMejgODliOoLl7tbkJ6sMs2HUQrBBLUvVGB8YaCxX0r lt94xLSu97DphAaMNJmOqHvq9zCBoa3oc2AEjfpSw2BCEWScZQSNzL8U4oy/Yg+emYGh6k8/eFYI MAyjbdEahsHK0ws3nHMk2lSQ+ssHDJskR9ItUsPYN1CL7p5+HxjFQoK6NyIw3jCweOD+u/942JSe C0xCzIGRzmoYEH7yACMg3uECwxcqBow8J1W96wKAoQNTCfHofPHML5QBGFzogoHBT20yYJhgGgiM 7G8SnrddIcCgAj4cYIg4DMCg4ON1oeLb01OOl3dH7MbyIWs4kKDOeSfG3t7ozDfKWZI3xNbp8uV3 feawKX0XaNtrJqMeJ8uW5Yu4coVsqerx8vC6kZHa6gPbwqRbhZbFjZGYAZPcwhThjFub/m2xhesb bYHlz6JGXN42oNj+dHARolvCNDshXl5/C9ffHQ3p26Z0C5dtRQrDL0ttf5q2relzbg1Ly8/jlwZT flvQ7WejUZxqaxW/3IoGCQeSJ1IMGk70tcaKXsxoSVnR8MhH4RmNXdGG+NCaH3xi6WTt4evgXndY 3Lnsrk8dMWPoV0w4TYJt2Gu36XNtf75AYBAdRaVDO4UODNV5bAEMy9CRBDAsHr8EiS4UPM0gYGhW lCx9+MBgNiQ03RCPS1mlcmAowdSBazILLw4YYPGztvOF3QwM34MRGIoUzNTeMtwn9/y6Y21ObDwC gNEQ60F5LGKNhnn4jKbu8lg0/ZD24HVwryssbrv9znMXz0r+JuznQnZ+ct8k6KMBDGGAw+4FAIN1 aAIMCEgYgUGFURhD6eHEOZIcwGBg0YDBR2dNC/BCCmCwsB5GxYhthJ0Ahn6OJAgYUvANUGCCKvLh h5PAsGgAkV8JDP23Hx8s/ttQZi++xngPKuLRUQHGwWPbW3/2mcXrtAevsXvdYOGc9Xjn7PDfw6Fs XVpeVizxjzg2HVH+9gcwijtHkj0roVl5yqT4iGyRjmmxvAQBg45sFBjZJyFZN3mAYRL2kAorBZ9b eUKUQ28rDRj+feJF1rEm+Ia0mFDTmjEAg7WX95vXkQYMAzxo3bHfpGV4mzsaRjdC0Zjl2E+M1E2p 653+i0uO/M2IIxqBe10WOJ1j5ovmle+tKu0P85VyiLMd5uPm2g4JvG1Vfs0WL42LnqZzJPw6r9EW XZTz7mmLgdwwie+aCKMt8AVKLQ6IhTx4i56GRU7YYvFOXzC0/bzri6K07pRVJ/RrbVEWWj7ojgVf ROY7EmyhFHxhl6UFQxx0oVQLR/Ltl5G2KUh+8+z8aIujXpxeu6RZfBs76+zKUOewLT0953xqYHdv yXtfrx2S11yzcEAxb0rs5arSgTAf1T2CSw0DRoKPjoZh0GYsHm9BGoY/SiMbxnCOhKrQ8vyJPyKF 1OirjXQ5zpHIk6ra6GjSMMD86udIeN152oMlys1GfVHnfGoRdFI1YMS2eHpaWsY2hkHDEPVO2461 aWEaBq93Xfug/cqLb3J1m9Wdrk6PVMNwPoxUUZK8/vVa8HzNYTG+JXbDmLpkgwQBr3QvWyGz4JuA YRUODJquhAN7VgwwmPBAB4alA4NNSSQwJLiMwADPk6ae098iTQLOgoFBoagBQ0CQJKnSzQUMqHJZ ennyAUNOaWjfYOsl+YBBm5/URzCoBUxEfF4ck6vbQtt6a1MYoZvZ2G3FS1LPjTSe4bjXFBb33rv8 W7PHp48P0ibMwDB0nBECQ81zQ6xDBIYpBBhM8L3bIZ43AQyejAAGu8/LZzoV62oXEgZyS9VL1DII mSaAZmAwLaqQk6pylKfAYJUgtnMtkScSR2HA4ELNgcHzxetAxcHrvUhg+Hmy/XQWtOwdldOqC8d0 xK+4ePFT2oP97F4zWNx62x3HHz4j9J3MlRTIIGBQoTQLcfHAgOiYFusQ5jAjAYYuqKwTBwinOtpu BgYvv7osCBgkL979kBRArVyqJiQwVJS+lJp3FiQw6LSL1rEFLZwODCWEFmQZiYCT/3CbDogywhCH ARgEKkxTZOWAvkOSfb6weXfk2R31I9YwptX3HnzFxYv/V3uwH91rAgvnC+aHHRS7M+y+LkQXbN9J ggcIR6HAkH7kb64y5gqj7unAoM4EDGqDYQBGjtFchmMjqgVRfvj5ygsMPoT7cdDNFAkWXZtRv6nR lhESQcDw4qb5IMIo+wIHRsgANBMwFMAYMCwJDLA6DQSGnzUKDHI/LzCAOS3d4ZG+cctZLG2pGPry ZR8/6jjt4X5yrwkspoyvfLC6HBHeIUB+h0gnoRoGdEEPEGITMGyjhsHjlEJXvIZBOy0KAAafBmQL qwFD5S8XMMxpFQwMS+TFklaeIo8yrVzA8AQoFzCywmYJYPD6FUJHAE23eXMBQ015SPtowLD8qtfj oN1CaF8GYGhlFn3NeYFOS200NFIbDOfVfJWlyVu0B/vJ7XdYPHD/vT+d0WqPVTQWwJDC6f4cPWBA A0ZIe65pGEUDQ4xgJsHyBR/kvtAoSNpceHJPSbgQws9XwRpGTmCAlI23QV5gaAJoAgaBIitzHmB4 6RQIDBQCDEvmVwKD1hcCgaGXX9cw6mOdsEOlGOkOibN+cfmnF9+vPdgPbr/C4vY7lp1wyPTo5/2K d+8GCT6IQMpOkyuchI0ZGNzpzzVgGEAUCAwtDLTnZmAgGBhiTYBpGBAdl6RF5+U+MGjdBAGDxGUG RtaLdo6EVJEJGEJIVN5ZIA4MWX8MGP5TMzAChZ1CxYth/wIDssyiLibXdlrb+upHvOA5o6H3qNfi xb/7zSjLsad457yaHTVxu4wbScnTgPppUbMxlX5PN8AixjjUOIedVC3GaEv4Md0r4gNGNs2beP+F dlKVGm2RcP47LZjBkBdG1SU3HhrhSVWtDQzvwmAGY8jxxTMShzAU08pIy2I02gI3iiPllW2pGXT5 +SIGboEnVbmRlax3HifNkzDaEmX24ntyW21yfvPeEX3I6LU4obrfNIuJY6rvqomjLHMl1GH/Hoyj vOke0zD8v3LUF6Ot7zezrqCvX5jSyeGHjHJanjXNhIxYvpfCz5HQUV5VE19c9MP5WVF55RoGNwsP rDM21SEHz7Q2GN45Ejpy8zLrGgZkWdjIbpiuGadn4GX082TQDpiGAVK/qs9RTYzWhdRa2BqG0Gw1 DcOyMLupK7J2T9WIRm3nhGppJH2j9mAU3X6BxbJld79v1oTwO7QpgAkYhsYMuqcEI5/lpWhAcl08 MGjJZN6gdWbNjza1yHWOxPSbd/BAK0+IOpLAgGflCVJG8DAMGCpemRdWpTD5yU6bvLwTIbZMcQhg cBsMvY45MMTujBEYYOU1AwMsfYj0A4GhtQEBhsyvX2Y+3XEWPKvjkRGfIXG2U/fndGTUpyHO9GPJ wfV7K0oRDlbd6ZSEqKG5phamKYk822GL92f6Kqj0V+zbwiHyw1VhlU5AWQClqvpqq3ojNgA+7Sjo HEnAW7g0dT9oSpIm0xHwMGx6wN8KZj5HwutSquGjc44Eeh3TuMHzrk072PkO8cwPJ6Z1pukkjUOr d8NZETY9o/UGli/nz+rdzalZtdtG9D2S/TkdGXXNYkJr5bKKUitbYNMILjUMk5/cGoYieC4rT4g0 uL/CNQxpci7/kXRGqmGwUVrVFd9ZUSOZUcPQpgx8GgN5tD3vF8/k4qm+zStHbaqVBWoYos6ZZoLC zMJNmpdJw7AQEAcMGgatd9Z2YHGQiHJqGCD55cZuel+b37QrPFKDLWc6Eg2nr9EejIIbVVjcevud x8+ZHDtcEz5N2JheyPbOTUIr7/EGyQcM0fBEiAsBhh53jjCFAsPvxIZvqvqqNQcGEwy/YwZMSbRp mwkYBAa5gCGEIBgYAYJvcVAyYQxoq4wnCQxax/Dj5sZiRQLDl1tZZkO/ETYZtBy83jkwVDvqUxI+ Zcr8mVzXHx6p/UVL5dBR++M7qqMGC2f6MXdqzU1aZ3Gd7BQUGLRSzXDQ7mkEzwUMQ2cifvIBg42a owUM1sG926LTWRwYPBkDMHxPvHxaWjRPVHvwgQEi+BJEKBAYEnwSGIa6oOmagMEqoVhgQORX1hNY 39A0O9Z2EHnIAwxPozDl1wCM+ooh9NjVGIlzTqeGLfxuRJEY3KjBoqYq/u3WhpIKJhzGhpEACfKT 456muoOY/wakPSxggHcKU361MLmA4XkJNtryfOvACBbOYoy2VHZyHTzzbkvhtdjAawIGLSsHH4UZ 8gCDajW5zpHAGE7TFKiwg5dFAwYDImnSvMAgfSQnMDwvBmBk45vbuNtavatxRPYXC8e01/zwk0v/ rD0YgRsVWLhnP2bXfoHWhlyx9u4HXxu22SBbwgQMkhEWzpBWUcDgzxkwAuIdNWAYhNQTcE04CwQG L7+6DAZGIVaeJE9e6zGjLQKdQCtPWuW64CtggK/TsL4ALRzTBqSVJ0QZGTDUf6PnfsYAACAASURB VOj0x6IJGQTch4LFPPBdEeaBloNqJZn4JtX0RkY6HamLD31wNN99MSqwmDqhblnUW8MlUwLf6pDh 1yBYAhjGKYnfyXjDZ9LRTbgD0yoIGNDNwukHjllHzlEuDRjkHAlyA0MuavojkxwdidDlAoYWp1+2 0TQL96rOYnWVHxiirozAAKkL2va0fosAhklDYVqIagtV79RfLmDQvAcAw4/WDIyGyiH0pqs0WSvG Oe++GM3FzhHDYtmyu0+aMaF8hibYmR9aJ1CCFeL3TNpE3nt8ZM3tRxfsooAhBFqmnystMzAMHVcD Bnw/Wucn8FBx5AYGzwvReEZ8UpXCFHq56JpDEDA0eAQAA0UAA8MDhgqj0iseGMSfnzUdGKw+BTDm Nu+xVu9sGNF0xFnsHK2TqSOGxdzpdTcx4ckhaFyIoN+TnUsTfJj/so5mCmdKPwgYCCgH/GfDAoax DCpOKoC6hqEEjY2yLG2QeuDf+dBHTiJkxQKD5ocBgwqgvKbTn0KAoepIAwYBRG5gkCYk9c2BESTs owkMGMJxYFgiwxQYk+r6Is67N4frMq/iS43Ki35HBIsVK1Z8rqGmNJYtoQEYpJEssxBp9woBBmsF 7qdoYEAHBlu/CEyHx6HFy9Ly+oghT/4zLoC6wHiPAoAhFhElSKiWwju3BIaomwKBoU8nwP0wYCjh Ma/BiGmN1IYkgFi6qjwMQAHCrdcHSNwCGLBY3hkR/PwGTEkgwxUGjIaKBHrTlSN694XzZvDRsOwc NizcrdLpdT/RhThIQHNsqRYNDANACroXnFZOYASFsaQfKD/GtJVc6sAwLN5ZMBhtFQIMkHUOs+al siuBoZ8jkYuWRmCI9uXbqLxOlNDxfFosbgk7Xi+03FpZ8gHDMJ0sCBi0/QQwVNvJMpvaCzIy0TfA wk2v6wiN5GU5zotyYlH7G9qDIt2wYVFfW/Gd6vKSsGkEHT1gIAAY8prf09ZINKGVeTbkx7hDoseZ HxjyWut1ZmAw+TWdI4HogEIYkQMYmkCbgCHrAzwMEwAlzMb4pXCy/BqAIf34zSTqz1A+EzC0tpHA YP6pk8Awa0da2/n1D0O983DKD9E2RJljpWlUVFWN6N0Xk2t7a0aqXQwLFo5WMXtq3WdAaY2gBUb9 3uhoGLofeo/N9w0gMAHEgniz9rA0jJA5Pf86xHc3goBBhce3M5DCKIBBRmRP+EcOjKw/YeWpoMaF nrWvlRsYMizXFGg58gND7rpZMm5f0MXaCU2LhFPRBQFDAIu2XT5gWLofmV8JjElVu0Obu6qHvdg5 GtrFsGDRVF/1vYp4Sdg7jqUDg1aGLlwjAwZyxivvqc6a66QqzbO+MDv8cyQyf6TaTaMf7XRU8L2j 7UHCro32vEP7gogccXgtqQFD5c8yvaTTIPRMWIVfvgaihzUCI7CtCgeGbL8gYMj20vLhh8PwgQH9 N4NEADAmNyRGtNg5Uu2iaFg4WsXMKXWfVoJEgQEuFEwQoAl2fmCQxvGBYXie515OYLC0vbayNH/D n5KYwiC4M+cBRr4pCRdAMSVhQpEDGDRPOYChT0kMwDAIu2ZaroX1yg9eDiZwAcAAWN0bBdDi9Ryc Fm8vwAQMqPxKYEDEodW7Dgy9LlT4+ng/OpOVCQzTjVS7KBoWVZXl33K0Ctr4DBhFCHF+YIA3akAc Rd1jwDDEK0cREsfrcvBMAoMIiz4lgXZfxQHyPZI8wGDczzwLnpKQzmEYNQOBIf0yIQmR8qu46Xxe AwY5lMeBQbUDiPosDBhaVxThoOVRwA68HLzMsi5kt+LPZjV2Rof7opyBRMQ5Cu9oF1/THhbgiobF jEkNl+pC4gFDqJ/MjxQUkIo0C5LmP1v5Vq54A+7x7bz998Uzlcx+AoZXB1qno3HQZIKAAZ43S+aF L+TJutWAoWkZREg1AYTWTgxakMAw1IUEBgWd4RyJavt8wLBVWqQtNMiClj8IGLwOgutdQAGyPOpZ vDSNdLiiKFg4kHhpdxU6BqLOF9kd7eLLmqcCXFGwWHbX8k811sejWo/kw0thwDBNCQzCpwmxV/Ga H1M4DhszMALSLggYMIbTgGGIVw8jgUGrtDBgaNuGEJ2YAYMKIC9fEDCGYxZu+bYbUgBN50gsPywD hmi74QDDtAagtbEbR6HfI6FNJYEBUS5D32DjiACGlRsYMxraQ4VoFxQSBzV1oaWy373vrF1896Kj LtIC5HFFwWLG5OYfq8KJCibrF8MBBl2xNofR4/D/W3Ba3pyf38slxEVrGERI2POiNYyQtmCcCxjU j7bwpo3MwwXGaJ0j4cDgoypI3qGsPMXOiA4MUc/+DhIHBhVqBgIKiJCY/gj4sXqicLbIb9pfjBqG Pi1SIQ3AIOWIl6SBcCwQFnt6Ynh5TyU6BSQ856xdVJWmvqIFzOMKhsWyZXe/f0xzZYUmTFTwRggM XZC869znSIoDBu9oelq6EAcDwxTO0LHYfWj+6D1dw+B5DQKGHGFHAxi8/PA7/vCBAS0PxnIRwfeB 4XstFBjBR9tV/YKDgPYJqWFAlJEJuPqPDwy5yJkTGCQ+P2sCGH6XyISf1tilaRceJKLhFKY3dqNZ QIK6hvKh6cWeGSkYFmPH1H/PJBBQ1eXfHz4wdNLqQh0QR9A99heio5nCmcoWDAzpRz7XgGEMkwsY prMpRQAD+YAh1wTgpy21I9qJR360HRowtLQkMGjbFQwM8Pi0+oXQCAx1werMBAxVppzAAK9Tva55 mXMBIx61He3C9SUhURMbQj7nnBkpi6S+nccbcwV9q+CWW++YfPLRc6e5Lxa11ItK3QL4L2vNliT7 03bbSdwH8cuczeJyKtsJf93Pf4aOtn0knHIyBvk87zM78MLg7OCgRYbVnZ3HW+AD/jynN/HQ/+aG pZ5r4W0kU2lEwiF2z3vRcLAzPNNu8RupVBrhsICin8fcYfXbdkDT2qzbmgLbthUcv9GZ6k1GbfZA 7zqcPXxuDBVxS70w2AGG92Jny4ZlZ6e+7m/Athztott6aH29Pae525reGKxFBLlICEsDHhldQbCo r6v6XrYELgBYJ2PAIAAhwHBDSWD44Yjz/di454a/46Vnn9XycsAdcG9Ft/rlEI5cUJYZKJGFjABG RqgUMOIlNuqrSuya2JCGv0LcwWPbLedtWl/57coPjxospk5ofh9VGyw2uEjBt0cFGAsWLcGqe5Yj MTiEsngMNfX1Kpzwzp2Z5Kaw+i3D8wDP1Ofg4BDa97QjWhJFfVOtFkoPYXK5NITMzX17OpEYSqK2 oQqlpVHdjzGsHo+6DNYw2tq6kRhKobauHCUlES2O0dIw2tr7kEykUVMTQ0mJ4S34Rg1Di0g8MoSx gb37MqNvQ32ZFozG+1ppGKk00NGVsbGqrYzAEywJDC9sRlw4MKY3dobW7qyyZzZ26aJQgItF06cX 6jcvLJzt0mOPnBPJVIg6+Da6wBBTEwtoHDcex55+Ju668QakUilc8KX/RHlVlQoH/i0Ifr2/P5Go vsPh/O+lp1/A9Vf9wwXFp77ySUMYmU6OMmQ/tahc2v/2xO9+cj12btuHE9+1CDPnTcwGoZ8ITCsh 1r67Qb/NAf17JKRMzucD//zbu7FrZweOPn4+ps5oVf7YtzPk90hUOdinCXN8IvH6vz+B3bu7ceSR UzB5cp34HCOvJ/kZQ+P3SGCz+qP5uOpPz7n3zjp1ShGfSKTfDCGfbTS0ZdA3RxDwicSHnup1YVFf E8XsadHsXR0YVlaWXB0ju87hxVFeYiNhxZNAlxw9CnL18aEaZ6HzG79/4N58/vMucI5pqf+kvkAn Foq0RUhxrZmFB/gTi4xLTj8LLePHudrFndf9VVsI1BYH6QIUu1fYITe26EnT0cLJrTPl3y4gf3Lh UDmLnBuBH07aCMi644uBIztHospkSt/wmyz0haQpuKmdDYusqsrFYqv4RCKzQyjwHIm+HS/zJ8ro L7zSNlYLHXJhky2CQtSnX2ZVTV577didxJYdA66Xdy4o9+Ogi8Nae5GFVLrFOrm2NzrcMyPOQmc8 mvqx9sDgcsLCeRHv1InNh6gc6kJdMDCIuqvb3tPOCVbpx5xxlntn9WOPYc+2bcaG4VqJBAZIS5nK EXAvcEsXxrLRvBcHDLDOzetXXRcPDAScIzH95h2cCbFfrWaoMmBon0iUuxYSGCwBlhfWnLQuCwWG bBcGJkvtexQLDMMWs3etkjABg/ZHC8+93Of+nDI+hspy/qrFIGDwLX/V/+ork2gfKh/UGq1AF7Kw sBCfOWFRU11xYSQsOuhwgWGZgAHlRxOszL3Zhy/CzPnz3asbfvcbXfi0PAl2QObXVA51jzeIBAb0 vz7lvcfWMIBh0DBM5cw6FjcDBhV876cJGDSYAIbnh3YEreMKYHhtaUlgUGE3AYP4I3DRt3lVeXl+ wfwzYJD4Nfh54QLPkXjRGNovABi8TUl+tf4FvLxxEPs6EohELCw4KKaVUbVRbmAoPxaaKpOlw33f hbPQednHj/q59kC4nLCY0Fp3CZ/fm4TTdM8ADNIBij14dtJ7P4BoaQl2btmKF5943CxIlumagkmP 13hPNIgGDFPazCk/hQBDr8McYXzHR3MGDKYpeLcNwu7HwTsjBQZrR0vPuxJ+mh0KjKw/+T0S74em wQhgsHLRLBlGfOkvHzBgOngm6xOiPoOBoRttsWj8/wwlgGfWdrv3F86sQGmJPDQn+pShjXRgAJPq +7Gxo7gzI9RVlKRO0W4KFwgLx7ZiXGtto74gaIKDZRZIei06nW2MB8Z7jeMn4uB3Hun+vvXaPxkE yBCHSdgKAQaz8gS7F3zwzPCrQGDwDpIPGN4j75mh7DmsPFneWBxeVLTdvJ9SAHn5aFobd1nYsDvj 76/39eO6BwbcZ5v2hPGLmzt1YWLVJzUtrpXowk+EFtCtPA1hWP1R0BnMwosDhkzLUE/Zy+df7kcy aaOqMoLpk8u80uj1K4y2eL8Cg6kne/FY2bBhEY+mpuf7xkggLKqrKz7CVv9HDAyvgkOssSzwSuaV ou4d+573oqKqEj1d3a4NhhUK8bg1wbL0xjLEu21XD7t3y73rCDDkORI9XlVG76meH6fWnnyxUw8n OwWDUUBa3pNhAsPyOn8B50hUWmaz8K9c+Qq+cuV6PLLWxt1PJ3HkOT/E4nN+hM/+5AX8x3//Cr/6 wx1YviaND335n9i5tzvYytP/mbmvPi+gL8pqi60SGGz0DQIGBabnRweGrpkUCAyLlJG0X29vGi+u 73G9HjKrktQ7wNvO0DcoPC3vmoDVMQFv6Aqt3T28b43MbOpyov2O9oC4wK3TSWPrPqvt/VPC0SGJ 8My9ZPe87dGQAo7TqNltPs/K05JbsV4nzt4rr67BkSedgrtu+Idrf7HopFMRd7ZSfT8yjK3l0TMo +9utT7uJveu4OfjMf/0a48ePwS8v+xB+97dH8fkv/TdW3nUNDp3T7OYxY02azUQ237ywrGIyje1t lWXz8/c7NuCii7/pe5k8eQqOOXoRq+8/XPMX9/6y6/4LYxq8XTBRBuZInWVM+kgY1QltPxu2az+Q CWNn2ynbTd3g2XagURGhy4Azu41rWbji+h245s/Xu8+uyX4k75yzT8dTz7yAG/91q3s9dfIEXHjp Fe7va390jmNZwKrQPw4OJXhekd3UvLx7ebL1LXrLItNaO9O37Oz2s992FoU4fAth/5bvJ9svSRpO Hr3uRMP5bWxlIe9p4BapQzsb3s70gwef7HTjbGksw5iWEn/rPVPvnrGjrbqxbak82JlEVZuSLdZs HygvtTFkObbeXcNavCiLpI/XbhJnhIUzBTnpqFl11FZTd0UCgz/1BYmahecDxpLT343Vj65y1y7u +Ou1OPfiS1Sjm5KgwpZ13/vZLfj+Dy53BfOZNSfh7uXL3QcV5XHccttd7u8/XHcPDv3e+T4cODAs PS3mLN6ZYKGnd4D52Lhxg/tPOufejr1DGNNQYi6DAdYcGKIxKDBIp/OL4Amfn4wCBi+S1zEzwNjR ZuMHP/m9++imP3wVf775ORcS3/rEfFSUzsMV129Fc305PnFaFf596gI015VgUpOikGSuXyaWFw8Y mTxu2leC519N4tE1u7By1TN+/V1w/ntw7KFNOGxSCuXRRAAwZB/MBYxMWT1g9CaieGhjOZ58qd31 Fo+VYGJzDPUVwOIJbT4wVJkIMPy0bGzdMYR97UPuouYRCyp9IckkI4EBBUIJDFAIZtsFyhS8qXyg xFnorC7gfIh08Wiq1ZmKfPV3KzdqD4NgEYuVnu8bHlFh8K+JwAcCwzM+kc+F0BUJjNPOvwBX//D7 WP3YozjsmGMwadYcAgxdm6BxPLFmqw+KQw5ZiJ//MvPtlcu++3V841vfd+87/67+w5/x0fOOz2gX 2Xx6I7LMD3e8Pjxg9PRlGu7EE47HuHEtfohpk8egIl6Cg2e3YOUTm/GNb/8YO/f2Aqg0l4HULv3L 64zWHQEG+EjnyyURElt50kplk5GsMg589tMX4IQjxuLIWWEsOsjZeZvvG0h964KxvuHSWe8szf62 kKbZMgLDS9DCxr1RPLd5CJu29+Gp5zZj/cZXceoJ70R3b78Pis98/Dw01cXwnV/ehamTx+MLH5iN 2S39ZmDoJSIgEf3HymgpPckSfO+GTtx0yz9cL+8+42Q01sZw16qNWHH/g+7118+OIx4ZzJbJ4sAg oH70mQ737/SJFagoD2chkwMYlmeQJYABS2hN2bLYGQ1rUlMSq9ZVpBfG2gKXGIKcMxW5b32DowIb 33VhhEVzQ9U5ykpP9B23TGmx3GEChkUETHUCfXqiA4PHwwVl0qy5mDF/PtatXo3br/sLPvOd75OR 3+L+hbB5Qnve+8/GFz5xEsaOacbPf3ElvnjR8WhtqsMhc8eju3cA/7h5FQ6d06LBKhgYUr2w2K9X Nmx3f59+yiJcdM6s7FObWQI+/UJGc3xlcxuspS1+BzECQwM2VIezZWOBhyHA6OlLo7s/jZa6UFbF JWbGtM28MwrZ9qqMAf/9sUm+RabWobO/17xqIV5qY0oTsLMTaKkGA4Yqh/cz8/ubf9iOP/7lRpx9 1qn417/vcAH+3jOW4uiFVfj78gH3eumihaiIRXHhUSEcPfcUXHbN8zj9k1fi1t9ebASGXB9hozSr 3uyhLQu46r40brrlTrz7jFPw6dMaMKHK2cXow0WL69D70XNw2Y09+PvjpfjYoiF/mkTj9rrJE6u7 0D+QQqwsjLkzy/lUddSAoWBXUloqBTSvW7unCqXhNCrLUscE+TXCYsKYyoNpZ+N1rWzTSYsLARWd 2AQIeV3EOZKzL/o0fvLlL7jTkSdX3INDjz2eN3oAMI45YhpeefYWjG2qcq9/+PX34dKLTkF3XwLl 5WXYsacbRx8+EYfOfQ8zBQ4EhtSuWIImDSQjeHZWdeT5y1y/snEHgDlM6PR4KHgzaV162YNaOy6c M9597mgv08ZXwOuO08dG8MCz3fj69/6C0089Gt+9+CB/KuMDw8+xxUZb2+vczlGApwaw/OFN+NIH Z2B3h40TPvB9fPcbF+P8E2qxYYeNE8//AU44/lhccv478O/7NuJ/PzlJrUXIXRG/SBYuPWc8vnb+ 51BeksLPL7kEj24I4/mNfbji2jVYfu99rl9Pu/jRL1T4s888lSt3NnxgWLYolUVPoUpgZMJeefU/ XDB989wqlEd7M/qytz4QSeCIOU14YVOXaiJ/0V613eBQGi9v6nV/HzynGqWlIcO6h6pTtXZkAgav JwYMf2pl+588dKwzcznnTVob2+LO+RDMbMyUo31bbeCOiAaLW2+/85wTF08lhJDAyEKLDfgSGKH9 eI7EWeysxcGLluCx++7FPTf9E4ceewKpxNzAGNtcA3+KBeD2e9fgp7+42u98n/vsp/GDr59j1m4k MKyQLsVCiL1gjlu/aSeA2e6N7t4krrphDS46dy4q4yFjHBowlAcBIxvvfdcCvLy53a3Az3/5Rzjx BP5ek7/dtAt3L8+Y/zsC4JT30s98FF/96Cyuklu2AgQ8vimAeIt3y57ow4cu/pF7b+v2Y7F+w2YX DFf/dRnuf2Sie+0teJ590Qpc8qkP+3l2NrLSaZsXyt+1stFcndUGsguDR0xJ4fDJJfjYcbPQ9fk5 2LQ3U+9en2qqTKOxfChbGYNuOL/aspLJFC5taimBofK29J3zUVGSzKbFF5X3diZQHnPeMpnKKhK2 BoxHn+5AMplGfV0ppkyIZ+taLXoyYHiQoL8JMGjfUgu7XCN0ytFQmcK6nWXJ8TW9mnwjC4lN7XHU xBKY1dzFnk2p67WcV+5966oHrpLhNFWlpjKesa/2VWSvBukhIqpCp4XAeB2Zv7JO2x4Nui7wHMnp H/mE+5UmZyv11j9ezdMxbE9q95wV/d/fjc9/6Zv4wqUfQ9+OFdj1yp3uOsb9j20WYXg48z0Y/ID8 BXp6+v2wf79jHb7x7f+H+5/YmTMOuo2m1TEJd9TCKlx01gRc9O4J+OiF5+H0kw7Dz7+2COeeNhct TTUMFB+/8Ayc854z8Ytf/wG/vH6D/olEbVZFtlWzc/Hlqza7cf37mq9j3JhG19t3Lz0Sf73iPFRX lWPqlIn40efm4y+Xv88FxQdPGqumHRa38tTbCYatzUy/qCxLY+7YBOaOSWDe2CHs7Urj8Pf/GpNP /z3+30196B2KkPwq2GlWtlo7QrMO/c/PnI8/XXcTXtzr7Lqp9nT8PbipFpdf+TecvDBuNhKzLOxt S2Dztszofvj8moAtUYtrmcT6FnRbVbzAx//p/+b1VRaPQ7qgd3JS5yyMxqOpC7QHJs2iuSF+cuaX rf5oGgaBQ3ZLR5XW9Fe10cg0DFtFb1s4/uxz8O8//gFPr3oIx559DsqrqlU6oGF0DWPbri58/VuX 4WMfvQCfPG+Je6+yvNS9Xrdhhzsd0acSXFswrbKb0tKdhYPnjHXv7tzTLdUGFY+vyRANw5RW1mN3 P7Du1X50dffi1ruewE+vvMHXmByAnHz0DBcqlTEL9vsn4uufPhLrtvRmk3LU4zRf9GPlsdiGy8Xn HoSLz52Jqa0hHDl7Fro/cRAqSjMDyJVfWeif9qxosbILnvDGW19jCLFlLyqM0OfiZBGWtu+9Lmzh rm/8+vfXoSJ2AS4+OUpGbaot0e5jqd+knTwN48XdFThoQsb/2Zdeg7PPPAWV5epo+5+u+6MLy3+t 6nTHXGfh82NH9qiMWRYefzbz4qZpkyrRUF+aLYcttgqlhpHNl6ZheG1g2DGhU5JsfU2o6vKnIlST cCCRz0XD9mEmLwwWzgeETlw8tUlOQTRgyC3VoCmJ3GYEdOErCBjw58pKYG0ceuxJePTe5di5ZQv+ ddVv8aEvfVnxJA8wduzJmNwuWbTQz5iT1pYt27Fk0XyS0QBgsNV0OerTcDYWzJviPtmydQcssk/k uGee2wj7nFkBlcSB4T/VBmULFdMv9i9dO46jjsAxSxZg4axGHDyj3F2UVFphpjNOHxfF9HHV2a1C DgwZv9xmnTY27B8bd3dIykivyN57dpONKS0hVJSmlbrvwp9so9Jk3N0EJbTPbQnhuU0DbnyNNVEc Ph2oiKbY9m9LQ2bnqLs7czDr5Vf3OC+BBIvcn1qo8jABJMD459MxfPWyP0A6CgrPOSCeNGEMxrfW I14WZoL/4rou7G0bRCQSwqHzajgUsuVX6yb6djssCQwFE7omooDh9ZMMMBqq0lizNZYaSITCVWXJ giDhuVgkHTdtoTJYlJVGT4yEoOb0RmCAdC7iAoHBB1cm817ERmB4YFIzaBWNqtDMVupl7u7Iphef d7dSCwHGzClNOPGEE3H7sgdRUV6G1qZqrHzkBbyyfgPeddxc2dN0YBAbDF0zCJF3aFhobcxoPHcv vweX/n+t7u/O7h7i38L0SQ3uL8c465ffPkVb99Chy98Dcv+tl7t+WuujGNMQ0aeOLLzY2iMd0wMG zRvvjJnfzozqSz9+wvVx+X8ciu4+C5f/+UWccOQknHRIKVZvTOHE877vrlv85wXzcO2d2zIahveK OMs21JuyV3hsvYX3fOIKXPjBc7Btxz53YdPRHn5+yRS2/Xvh8c7C7YV46rlNbgzTJzSK3QNdwfO0 1Uz5eV0snWnj37/+uHu/oTyJxnif6gYuHNPuz6+dcTapY8dDd2atxM4saq5Zm7HLmDuzBqVlHliJ hsa0RpozBRO/XSAExwAMqkp5wIiVldjTG/eiWOdsoa7c2PBFZwmPBmWwqKqMvdvyCu8PbhIYKn8a METD6yo5udSETwIjJF4EY7bBmDR7HmbMX4B1q5/F7X+9Fp/57g9YRoOAURkvxZWXfwFXX3cvvvLN zHH+M04/GXff9FN3OsIFzCS0BBis2F4ms/m3gHcdPQlX/eb7uOjTX8fV11zLaqmluc4Nc9ShTbjq yu9lDbgMlqg8Eaa5OD8OnVlB1pFE+b2RVW6rBgLD4kmJTuz8vvKfW3Djv27xvbW21LkWnY41p2OD cduyB10Nx7HmdP595MPv44uoMjsqMbdaf33d0274Bx5+2p9KOduoXzrvC5hUl/CB4WgtRy+sxj9u 2eL6P3epY/A0BAt0twNcFyYdiW4/Oj4a44NojGeM6PxdL2qdCW60lYmD76ysfqED/f0pVFeVYP6c alblfjzCaMuz0IRN5cNrd6/eqZUnB4YWh2WhtXIgMgIDrSXyHoNFc23ZUfBmlsMBhjZY5AYGpPAH ACOf0dbZH78YP/mvz7nTkSfvvRuHHndidjcmBzCsEMa2VONbX3i3+89X0bMdQ61Ci8KZgEHm22r6 lWbA+MCpM/GBzTeQuMibnbJB33/KFL2SmNUQTUfFndMYbTjAkILlz6MzwLjh/i784PLf4nvf+ixO PLwBH/jcn1yBvvbKr6BvIIlPfvFyd2fku5cudtP4vxtfxiffM03kxTPPppu4QgAAIABJREFU9pLh 09YL3r0Au9vV9GzupDKUl1mYVJ/IlMEGfnl7L370s2sy/j94Di49qxWNlUN+n6XVR2dWmb5nMgvn UxIFt2ylOm3qA0OahWd6TVdnAi+sy2gVhy1oUNPOrJVnRsOweFcSZuEKGN50RU1PrKzQmaYkPA4b k5pSWPliuX3I2OLf0RkO2TPlPQaLcc3xcXZW8c8JDCox/uu+Qv61ahHwTm5Up/NoGMhvFq5tpTqw 8LdvcwDDny7owmYVAwyT89OnQg0tLTlP9evT90POHWiO5lkvw7CBIdJiFpA2sHheJa743y/iwlPq XSG779qPYOe+FKaNCbnXi+76NirKnLMKmQA/umSGWkQMeJMisp8J8Iy2jp/vrAGUqdfYIUWUpkzA YxdW4/DffA4TG4CmCmf0TKptU4Pw07SMVp6GMNzwye+IxnMkjnvkqd3u3zEtcYwbk90qFedIlGwF aRhQZtwSGL72kEvDUHVbUlrmVEyp1nXyuLRtadsp/nr0HXfedYIc7Syq1tJtVLGlCngdnvxj26xe D5ZbVgWeVAXfUtXjAU7/6KeyW6lduPWa7Bax9vIaua0p0oLMmzkt/Z5FoqNx5zipSu4FnVQ155Hc 0sqVOy39pCqPkL3shY74ZOR31dv6MC48tcFvv4qYlVnw9J7XWqiM8W+q0q1ClhfRFsV8j2TuuJRr g9FSlSTfI9HfhWFKx4OC8aQqq19yn21PQjupunV7H7bvzKxxvPOQJn5CFjwO2lzBR9tpU/G3kpGn xLuMA4iVhIZ1qOyQse34n48d/T/0ng+LWFl0sUk9NgMjrQND2mAwUPhNYBQ0Jix8uFEVLIBhgszx Z5/r/n161YPo7ezMhuWfSNTyYhIs1sj6PZY31gkN6UioGIQ4CBg6QHneNWAY4tWAYfJH4jUt2PLy gEPH8N5LJXwhswBqdclvFQwMGlD7gJFqG/ryHdJMwcCwSFoMGLReBTBg4aHHM9u4s2fWoqo6SuLz a1flmdoh5QQGsbugwGBH2y0/WhnH9KZea7jH1itKksz024dFVXkk+8GRQoGhaxjFGW3xTstezmLq UAUA49DjTkbL+PHuC37/ddX/kbDmz9+Z04OWfiAwWDwg92R5SDqmtIzAgF/7Unh5OjnKYLrnLWAa gUTbQnVF7x57f4LQ/qTRliZ8/rWqS159tJ7JOy1yAYOO+NlNdv5NVRI7NQLT3uPBgaHiNgCDal9+ Fi08s2Yf+vuSiMUjWDi33i8HD8eBwV9InBsYWvtIYLD6hR9HrAzoT0WTWv8pwEVCmE59+VJUGY9M V0KdCxjQ/NBrMzCklmHuyJqAGYUzNzBO++BH3PvO7oizlaqFLdLKMzcwJHi4H6W+FvDFeD8dnn4w MEwdOiBerVx+vwsABk9HExjauYmAmYHB7/u3tcTo9CerKYRE3YRkXkX62X7BX/yjFUg9k8CAyDur Xy8ZHRiDg2mseSmzRblgVgNKSyPalM8IDApPv07VNQOrBIbIOwcYlSkgWhpLaVWQxzkHy/oSoSbq y4dFTVXJBL6QJoXdA0bQFAQBwEAeYEizcCpYxQNj0qx5mH9E5sUyt//1Tyzu/QYMTcICgGEEjUiL zbm9j01DpKHnr3BgqHiDNQwmHX78ulm44U1WGjBA3shFnmkaHki7qLJpwCD1atIwvOchS4YR7aMB g+dTBwYVcF6Whx7d4X4oqaE+htkH1Wp5DQSGXxciTwSmgcAwwA4k7zS/sVKr4AVOBxKb2ircg2UN 8USYvmrPcgT7pptvW3jq4jFP6x0LesEz67vBW4bGMCFSafSL6CDAodOVdH7gkGmR+uRK5rq3swM/ +a9L3OlIfXMToiWlJK18TuwEaL71OAYHBtG2Zx+ipVE0NDXk8K6HDfKs+7Sxb3c7EkMJ1DY4hj5y 3UoPYXxu9Kbf1L9+lit8cDxUGzVtIOX88pkNPWyu9Iye1M3duzOGcE1NFeKxbQhhjExrz0TSRkdH xi7jjJMno7Expgyw5OCZvcc+/IRsHRk/lkTjEM/8cFB+5TNkbEX6BoAXN6dcY6sg5x1Rn1TXw3ys WN/4nW9ffb/7AWW3dWKl0SZWE/7Wi6Wqzrf29XaOc1l5yjDeSVWLvAuDggVkq9H2iZrbBiPILNxy X8G36PiT8cDtt2Dfrt0B1TP6LjGYwI4tO/Z7Ou17O7R7+y+t4A42qum05T5OPZrOg8ZoukkTqtHU VE6sm8UReLev0m1QAipf2xCnUalZPDkfZHmYycoatYhl27RZAYyX2ehPRrR3XDhnRja0lTsGWP4R denoIqcLi7LSyKkZg5NQ4cBw95hDGiDMwKDPrf148Az+MeET3n8Bnnrwfncr1bHwPGTpUSpiNm3y fgWtyahreqrDElrO3p07UVnjjPilYvhRfmwWr8wD+Wub89Xd2Y2h/gHUt9ST6OX0Ti8DHeWUFxEu G4/XAoODjrbUgdZxjdnHKt9+Tm1VNj5C2yRKm1zbWrjBwQT6evpQW19JqkoP49ehaYGd5Inl0RvJ PY2zZwiJRAo1NWXmPNp6HLbsE7byt2NnD1Y/vxuRaAhLFo1R0w3tlai2BgwACgoFAcP2w/jvvmDA yPqwxDmSrLVpOFqa8Owt6MGy2c2dyOUiIbR6j11YVFVEMl/xKQgYZE7lSWg+YLwWB8+IGGeAAZz+ 4Y/hb7/6KTaufREnv+98NI6bIISEL8Dy73N6z8l3Upmgq7JpUyTTvWw8VBBU3Ong9KhqSeK1hB9T 2pl+njbAyRDGoC7z/Mtvo3o/SblouhQMNJx/P81ho8Wh8kLV7LQt2sz/vmqapUsBYGt5F6AhdcPz 6xgnpYk/Vb8DA0k8sOpV99H82Y0oLYsoeYD3HlNqFq6/M8Q3gtOAkeZGW+zgmaU0FPBwftsZgFFa GokUe/oUmagavd+ZaUiJNdmX4LzAsH1tIaeVJ71+LQ6eeceXsxE7d2YfvhgtN9/omoEvu/6v+NB/ fI2HUxn3KoaNSJmb3BJUZYrEIfNnusde/svvyYNnrHKsQqw8zfnJdK7CzMJXPbYVif4OtLX3oyQK TBwbQVlJGDv2pLC3PYlYWQS19dWYPrUB1VVR/4ATe6Whly5samCYTUbtwtjk5b/sxbPkBTQWsTil arZfU6x5sm1OXjkHJqSZdNNsxIbvz8sTvPKQPuDk0/bNvJXl5dPP7vK3Sg85uMV/l6kPGte/tPIk b7yykAMYhbwtXADDm7obgQGUWoPhXT1lRZ0+ReatZjV+t3cKuWntQ72t9SVxf6HSawW/V8lFT7Ka 7o1zYjtJDydX+gNW4rWRLwso7R4M12m24Onc371lE37xjf90rz5wyefdzyFq4QrRMLT095eGEZx2 fg2DnhY1jNJkRO3s6seKFavRVDWI2iobpeFexMoybd5YE0HvQBrlZWqKu6cjiYmtJS48uvpieGFT Go3NTTj04FahMXiqOl+k4+p+Lg2D+zVpM96zdFqVy6a//WpSeVH3VfvyNjB9IZ6mq/pge0c//nXz S+4OyMnHT8H48ZWkTcF3DLPal03Kp8rlPTe0sZ1pT/99njZvR6XleL1PLqCqOvCsq+9fbbuWmcU4 x6BrX190inNc3dUsWmojcS8j6sM6dOSlg50/tPknFEd08AzkOYMVHZkL1DCyQ5fXDo73pvGT3K1U 5xMC9938T8w+/Eh91M+rYdA8mUdny/QawOFqGFJTQKEaBj1HYun5BfDq1k4888QzmD05jaPnJVAZ t5BIWnhibQ069lqYWFuFzev4a7fjZSHs6ujG2m3laKnahfkzhlBXlUTfwCasuGcHEqjCScdN9d9t 4TerbTgM5Y16CNIwaIODj8Tk/Q7Os8zr+UjRyfdIbL8f0u7CP4WgzlQEnAnxy5GZTngj/MOrtrig GDOmEhMmVEPJjuEFuhYMGoZXLv5SH5OGwdYwQPp2jpOqrK6JgIXDVtL0wqtcztlBWbG+0TFe+nbk 1tvvnHLCYTV+I2ZefkLfsRkwtQAV/hEAQz4fCTAY49TN0z70Mbz4zJPudOTBW/6JJWe8J1CIec50 kGjXAVMAFp75gQAGvxcYL4Y5JYGa6954w0ocPK0X5x4bRme3jQeeqkNDdw8quvagdfsLaB1IuFFo J4icF+p4JWqsxpNrxqGjvhXxunbMn5bEtr3teOShZ1HTOBYzpwvrRR8YIEC1cwKDCkg+YND6NgID BBoaMKw8wAD7gJEj7Js3tWPb9syLkxYvGm8IE/Q9Eh0YKlO5gAGyhkH8MWB40dg6MKDerhUKR1PF wgKZjw+5b28KRcKhqX6mC1gE066NVp6GuIxhgv4hcKqiGxKJEYRMh7yGLq+uw6LjM999ffiuO7Ln Rkzx0HMkNF7y12CDovIm/QSFU2mN1jkS1v8sXjedXYP405/vxmEzejGh2cI/7yjD5jv7MXXl/ah+ 5kmEN7zqLJFrncTkrD2diL34PFofXI6q+17E1mcrkU5GMXfKICbXbcN9D6xnhkSqPaDyrhlRgZiT e/d5+ZghmF8dRRw8I/Xi23158fkR6m3gx5FN99HHt7re5s1pRm1NjDSDqnN+IM9ifiyWD94ngg+e jc45kmgkFDY0aV4XCaXdFwyGQiFPjYBxbqQBwwSQ4ZxUzTH/LwgYmpPw4MA48QMX+qdSV/zz7zz+ QGDINRiI/MjrXMCAfs06jSmcIa0cwNDrAOjsHMA9y1bilCPSGEyU4fEVlTjo+ScRWbtOq8FindXV h6pHH0T5w6/gsUcrUVORwozWfQQYFAgEBBQYoh7yHzyTwBj+ORJuiaramJuVKwF/4qntrgGWs1V6 yMGt2egoJGiRZBuqPmUEhkXC+XwhdVHEORIGDALqWFmoaK3CcSnbcu2wnJcsn6CN/sMEBooEhvkc ifxMVQAwNK0g4JoA44wLPu7+fXrVSuzZ8qohnB6XbpYcIMR5gWECiBw584XLlb6qfXp/5YpH8P4T 0ujoLkHiiQ40PvVQwVpEoS6ytxOTn3sCq+6twrQJURcYjz6+mWgK4PUYYBbO6tvXOKDC+M1AwmV/ a2bheYBhsXq3RPxSOC13q/SZ1ZmPRR1+6HiUlUVJHk0L/Ib7UjuSfdmS4cDAqoCWHxisq2T9l0cG 4bw5q1C3ua0C6/dWOjB2X2oaKomGo9qKfSAwYISDLvwCGFo4UxgJDKpYm4SteGA4W6mtEya4ZuDL rv8L9xcooF4HllanJoEtBhghLVyxwLCYhiHPkVhYfvdTOP6QAby63cbgswMoffnlgjtK0W4ggeqH H8DK++tRXWmhpXIftm7vLeLgmSqjP7Wgwmhqc38UHhkw+ElVIuwk/KpVm91FzabGcsyf35LVgvSj 7ZaYXnBgKOFlZ1s0YIi4aT0VCAw+jclcTxljY31bed6WdT4X4ECiuXIAUxu6URK23YNoodKSUEyf FiAAGNJgKK3BwAgMI2hMYfY/MN77qS+4t9etfgYvPLZKE0CzgO6vk6p5gCHzZUofZmA404+xNW3u 3fVrqhB7YY3WKfaHq3/8Adz3eA0aalJ4Ze1G89H2QGAQ4WGjMYRgQbSLqsOQnELkBAb8k6r04BnT DkIWdu7sxtp1e9zrQw8ZR2WVH21n7ajaMJeGQduyIA3DCAzwMmrAUHUdCoUCj6t7h8gcWwwHEmXZ k+2erUWkNJo+OuPV29byq8m/Z4OUixltETtrz79a7M4WsdhzJF46VrBZuAX2ajirCLPwhvGTcPix J+CxFctx1z+uzWylGsPxagC40RCrLEvcI8X0TcQty+DHJoFVOIt+8axAg7DMH9vffr337kfxvmOH cNt9YUx++UmtYwS50rG1qH/XmYjWNSDRttf92//yWuy74y6k+gp48etAAjM7d6O/P4ZxjT3Ysq0H 48aU69aLpNHp90jYS4Nt9YUv3WhLvUbfEq+cU1uqsn2gDLf8KlTWlA5X0hBGWwAeejjzRvwpk+sw aXKdb2SIrJk1/LeFy12coE8kZtrOe8G52uYkZ6KEWXjGfsj8icTMDeU/+Itnbj60HRHvEFnQ+RDP hbSpQl4NAwYNQ59uMA3DzmVybAoj4zVoGOJfMRrGce85D9HSErTt3oMHb71R+JNVNBoaBo3b7Cfw XuC7MGgWLZ5xy8KCaZlXGFT0lQEdfVrDm5wDipYPfwxt99yFbb/9jft3689/gUR7O8Z84iKE44XN d53F0+fXNaAkYuOVdZv1o+1MU6CjPR8R2WvrhLrPtTBv5FX1qr54JtvMlKbSMOh0wvn70ku73INn zqLmUUdPE3lUYf2j7SQPvG1NUxIybbFEfqkmRjUWkndNi2DaDK0ZVeZIifr+CT2OLk+bmlz4C5d8 5Es15VYt78hSwyC3/UqQqoAUBlpwEZUWTqZRQF40odai0W9kr6NlMTgfvV//wnN4df06HHbU8Sgp i/HRWhbM0qLhz11HVTMvjDcl0wJp8dJ77LavgVkCnCRtEubF57egp2MTtuyIoPaFdbB6B7SUTW7c JZdg55+vRuXcBag/7XTEp0xF3Ykno+2u22Cn0igdNxYDG7cYQuouVFqChUtiaO9Oo7m11T9MyAWc yi5vW9VVTH2Nqur0li4wamSn2oUMTMKLJG697TkkEmnMmdOKaVPr+UNREIs9MrSjLCeUbYf0yBaH TQOZr2GItHjH4XlzPnS1N5Ru67bCPYNRTGvoRk0BnwlorRrANddcHwpFw3aJUTvQRnXDvYI1DATv kBiu82sYcjSXo64YQQzXS854L+qaGt3FzhX/+huJF+Z4pLZg0jDki3tY+vBHn1zx0vB8y9GLOyTC 8Ppw/rfx5Vfcb0V0tNfB2l2Yea+jNTjTDqusDCVjx2LzDy7Hlp9diZ7VT7naRtcjjyM2bZoWLshV 7noVq1aHcfhsG8+vbcuWh2gYbAQHv++P0pYfTgmFPnqzkdivjsw9uoZB38Vptm/J/PS2YleuXI++ 3gTi5VEsXTqF5Un2AcuPByKPoh395Lyw6nskliEvqti8jX0P7OW/fKGY5sHTMKIlJSXOmkQhmoR0 oXAYtbpQIkBITW/BygWMdHYmXSwwoBttaXkxwSGX0Za4tkI4+X2Z778+tuIe7N36qi6AJiEuBBgS YsMBhkF116YklgRU5l51eRITWkrQmC58izTaWo/+V15BbOIU9D6vFkN333gr0v19sMqiKBs7UQsX 5KyufmzdGcOe9iR272ojDDAAw5LAUHXCgEGFwgIXVilMhQJD/svG0dHRjxdezLyb5JijZwgQGPoA eZenPiWRwODTCR8Y4m3hGghHARixkP4x5EJdKBpB3BNPXdgNQpo9+GPTnZB8wLCHoWGYrDxHGRiz jliCSTMy31K5+Y+/VfPQXEJcCDB8P6Y8jhQY3m/DC4SyYbv7BhGPhWDv3VVwRyhtaSW/x6D2uMUo m9rq/nNcpLYKobK4u65RqBtbHkPfQBo9zheb2Wv2AnaBvCISbUMHBq2HIGBAAwZrMwYMUhgS16qH 12e2SpsqMXlK5mNBuuYAngeyo6OAQQTc1I5+WC9eEzCgyhUIjBCLOwgYzrdcirG1oC4Uz34Ipjhg CCFHEDA8V6yGYQcDA6MJjBDO/Min3Z+b1q3FC489rC+UmuIRwhkIDCNA8sRryCMYMDJ+du3bh/++ cwW+eMVf8d//uBW/Xv4IXtmyx32+cFqmM5R2F/ady4pDZ6HqsCPQv3mD+89Z0HSco2U4/3rWrEay vQv7lt3iTkkidfn36h2X7OhwD6GNaaId3GsKw3SCCLgunLmAASIYFBjw4yvmeyQbN+7Fhg2Zujvp pFlCOGWeRB7YFrAqqzmMHFhsHwhmYEALR4HBPnkgTnh7dT1lrFWQrYV0kZBdGymLqi1TsqlF1uqs rODq1zarE0tfhPO3WaHCWF63yHHwjMVhOKlKRwPWgHz9z73075GVLltF1jB+sr+Vuuz6P7uGW5bh E4k8bn1b0/K2O6lH8apAmsfCvnjG47HIuyPKS6I4obIbJQssNJa344Xdnfjr3Ztw2LSDUDfYiy3b 06iNFGbdW3/iae6uh7c1OrDe/GrA9nsfwtCu7Wg87TTsuPYf2nPpkp17UV5WiUSCH7Dytv0yfYds N4KUm73HQR48y3gu7qRq5gyn/i4Mr1uod2E8+OAr7r0FC8a57waF+9IdK7vNCnbwjPU3si1b3BfP SJ/OXlhZT9rBM/rxY7+MarjPfIme1CEZ2+mr+Ypxe3piCFv24pAc0ZmGIdYruDm2yWhL+IfJkKuQ cyRBYQzaR1Eaht+qjMDHnfNBfyt15S03GOKB+Z5xqgFyT6QFmbeAeLW/UsMAKqpqcNSSs1E19hj8 6q5JmDe+Bb17p6N7ZweqyotTM52FTWlDMeaTF6LpnNNdrYO61MAArLjpXKrZdfY4b5VKiVFfjXRS wwg02vLrwSLh6IitP+dtkgFSPg3jmac2o6O9z90qfccRU/w4QiyPqo20cyT+T7WGwaZMNJv+b5JX Ma2yjGXSw9F64hoGSH7pIbr8zoHEy3sqEQ2nEA2ne8gHSg3A0NYIDEAwAoM6E0ACgOG7PNMTYxhV IUZgMGHkQhyvqcOxZ2a+Zrbi5hvdt4MbpzHaPd4ZA6cjOaYfgcDQ0padJhNuy8YNGIiMQ9vAGPSn SrB2RyWSaXm+ZniubcUKRKvrRhRHa2MYlRVRpZVasu4oMLzbAcAwnCPhAmiqO2nlqQPD++28+eqR VZkvti9aNBWxWFT5s/J9wEgOUDmAoYFMTjMFFL2KCQSGX3UGYBCIeb/D4UGtoYhzbC88SExvVNur obZuz5NJCAOAYQCIbhZuujanw8zCh3XwjOlpeqfUjLaEMANYctb7UdfU5G6l3vvP67JPDUIMGY8F 80nVkQKDXgcsCAJoqEpga0cCe/dFUIpeOO83qSqPYu60sP9+zOE4Z+ejcuFCpAeHv3pe0jzB3Q3Z ubtbZZ8ZPqlRrzizcFoPIW4WzQSat7/SYKB9V8QRrgcfeCnzQt/aOBYeOomlD+MXz4igioNnhQDD Yv1SgkRCUfVvHRhqB47VU0jlR66XmJx3cKylcoBBwnMhTfDJyB+oYZgAogFDPteBYWsahnyt3H4G hgDBye+/0P3rrF/s2bLZaxrNnybUmd4iRrLRBAaM4Zx0drUBZ1SvxtidT2F8aDfGp7aisyfhHubq KydvAS/SDWzbjHAshsGd5vWLQlzSSrm7IZlFdK+eoNXR8IABTfjUtaonKmSQwCAHz9r29uHFFzJl Xbp0hmpnNtUxHW0fGTD4qG/QPEhZWH/RgEHKT4BANQqvTqWBoAcJ7+BYWcDXDjNDlnGtQYeB+bqI KUmedPQpSSHA8P7IaYlJ2IRFqV+bmX+ZrdSD3NvOVqrpi2e5gSEac9Q1DD1cy9gJOLRkPSq7NuPc hX1YMj+Ntu7MmkWyrPC1Bem6nnwMsWnTkdixT3tWqOuPhdzdkNOWRrHmxX0CGF6R9HopHhj8vn/b az1L1BsRQA8Yy+54xvUxdVoTJk9r5lMaAQyMBBjg8TFNwovDAAylkam+xIHB+zurJwEMT04KhYTn tAXOjNPXFox+hnVSVU+Hfpuh+JOqBm2ExJapIPmJxGAhP/MjF7u3Nq17CS8+9nAAMEj0DBgG+o8Y GLofem/69IkYiJdgKJFy627fQBn6hzLGUB2VhdlEhGNx7dxHz5MvuhaccuHTscew+/KfNUmNbcKc iZ0YGMyMRwP9g1qdc0FShknQgAEusEwYvZ/S0EmO3qrepOGXYx6/e1cXotEwjlxyEPcn4qR5k9vZ 6jl0YLB8krwzqIg0GDAsAQzwPFhgAPNyYALGQDJsFQMJz0WSSbsPsDNDkE0FQI3a/ilAQD9l6ofh 92xK94K+R6K2xIo/qSrjBfkh/6oGNZ1UbZjgbKWeiMdW3I1l1/8Js45YnC2y91Jem+zHWvx0oH9P ZcnK+fJfCI92FhjeSVWItCgLM/eqqsvRM3UcHuxIojtUj3fXhjG+6iBUV3Zh/LgOpBtrENqT+wtm u2/4G5o/dJ5rwZnLOdOSaG0tdv/z3zl8ZVzXmBmYWtuFVWtsjG8Btm/dDTjHu31HT5zSD+LAfV+l zV5qDP01/xBN4L1s2nvPZbaDWNrnBbw6Vi8TfmjlS673OfPGoa6hIvM+0Oz3SCz5El4aLz3QrG3z km1K1j2y70v15UqeEFV9wmKnnNN+fcHvUzSPYCdoWf+icmVbKK+oHJpas6toy6xIIon2zDtagwVZ FQxmP5qQUmB4DVf490jcu3m/eOa1m+12JGh5o61EpVbcMgDj2HM+hBeeehRtu3fjnr/9Ecd/4EIO DJkYPWNtEOzcwCAtSzLE04ExXh8YJVV4rDaC2VZGi5s3fzIeuPURHP+OBB7ZMA9Ve1ZqDU/d4LZ2 7L7hBtdKM58LssFgrjSKjtJ+93MCG3aWYWkyjfpqL+8U2sIWwAL5HgkBhu/VJr8tcizdq0oCDHWT 1ZsPjGyz3bt8jfulsvKKEhx7wtzs5wUsYoNheGs3igFGtjXZGwpMwACvC9r6nsZg2wZgeHmE/7Zv Cgz95b9CCIpwkTTCSdhDeQTZA0YhRlv8nmOU4n9eICcw0v6JeV9l8rQYIzBol8v3xTM5mvN2kMAo r6nDkSedgbv+8Rc8vPx2LDr1LMSra5jBjCb8BiEuCBgUMCyPhX9eoC9ViZbBdlT1DmHmFBvrnrgV 4aiFvv407OY+pMa1ILx1Z85ekWzrdf+Nhus4aCHedUwCT74UwbvPPATPvvQMGqrTBk1M1TktkqdZ MQ1DefVHVTbySmAgTaaQthITwuT+/gSeX5M5Rbt46Sx/DcP8eQGo6bJSmZVgQhRPGJJp/UYDhuCa DwH9vR4+MGAbPi+gaxgSGLoUFOZCPQN2pocUsLYA72MpQX60dQMRPm86afIFdQQbbcm03HzRtE15 ofM58c+whrHkrA+gdcJEdyv1jmt/D0+v8OLS1zAM8Yh7xjUMsZ7l2tmGAAAgAElEQVQCEa9xcVXc a50wA5+q6cLXjkuitjKFOeM7cczCFDbtDGHB9AQ2tswAnHdGvgYuMaYJVbOBzTuGsL29GtVVZdjZ Xoa6ypR5QY7UubYWkdUw4Gmo/lqBGmTk3J6ZhbO60tcw7rr9afcL7s0t1ZizYIKh/r3tR5kWGe2z t5jRFrg/zRaE1gPzB1EOUTdeWMvzL8+RkIFWrGFQs3A+1BbmeoYiDzvottiXlIwCCSaIRQHD/+JU ocDw0igUGN4twzmSAoFhFEjLwjFnvd/9+ewjD2Hvlk3uPQ0YOYRYpanS1oEBYqdhymOOeLP3Zs+a iBe2N6GbHBB6cl0Ia16txKadwJmndOGVuYv2OzDSjbXYOWMamuv6sWVPJU4+5WA3f7PmTEGsNI01 z+8xAAOsznUrTzI1pcLux0GrygAMRR1Wb+vX7cT6lzPa1ilnHMoWW81WnjQtmbCVDUfyYASGqRwK iLTMTNhpWkSrMQOD9iszMCwrzb6mnst5L8hxLN5DiVRoTVGCbKeHAQzTdqcpHbA4RuXg2QiAMeud R2Hm/EPc3//4zU/8cAwYWiPp8chj5GyEYn44WFTeAuIl9z5w/pnYOLgYD297Jx7eegQmLzwb73nf WdjcMQnt3RlgbJq//4CRHNuMnfPnY86MXuzYV4KZCw718zdhXDVe3GRhyDXwksZBhQDDtP3JoUPh oQNDH71XPZhZ1Jw9bzzqGyo1hccMDK/9BDBIfjVgQOZJAMMyAUP4k7/9NL2DZxwY0vhKBwbJl8E5 H1B+YVc1e4uWZSEZStvuAid/bZ42/RBTHGkWnhMY6loDhpaO/q1OIzCon0KAgeEAI+NOOu+j7rmR Ha++ihcfe8gIjFxCzEcGlbZRYCQwaGc13JP+Zs+agMMPm4nD3zETVVVxN40TTlmKR16Z4ALjmKUd 2PCORRgo4iU2eV1pFPvmHYbQURMwpqUDfQMlSJcf5E4/aD13D5RiS/ZUrK5hGcARAAyqKTAtJXA0 BzH2ytx/8pF12LWzA9GSMI45YZ4QJvhxDucDRhwYIJCDVl4FJwEMzy/VqAKBAT8dIzD8Ysu61p0D CefN3h0DUcxu7tRekOOYlKW1j/Vq4DCtX/z/7Z0HnBXluf9/c7b3XWDpsDQFREWsSGwICEuzxcQW Y4yJ5uYmJtckptzkfm7+yU1ubpoaK2rsPYLSmyBIU2EBqVKWXdgCbN89206Z/2fmnJl5y/POmXN2 KSqPH9wz77x15n2+87ydAIboz/wZa+EZhHhli0MCBhWODEOVx34bgvKBBEbh4KEYN+Ea8/f8F5/i KgU9B4O2Dpy01GnzFQqCH2/A4K9hA2NL+dnYsi8VF4xuxPAZWaiaeF0EGglaGnpuJmrPuxCll5yP sZOCZtOj/GgqCoaMxzmj+0vPoaCwN3r0yOfcbGURK7H9lVcBg1cS9tnRwHDg1NbaiXVrd5m3jU7N jEwGarYSOpngdv1WAUNslrDAECYCep3laZfffo/M46GAYT0biOnKzTVd17h1ACwkjF20+ubwU/yN /S98ml6e9PVb78gZ3Cv4VasNxGXMeZt8aqxYLxFsmNjh2MJ7Tcc27CRaw3l4qjS4dEQF5fMsBhsw 7GxsW/c+WhqbEO5ox7DzxknBOTOYzQDlZoJLk/Mn5ccuuOCDiFdy4Cta0dD+yOk5BB9uLEev/CCG D/JjyIWp2J46GE09hiCcm4NQWjJS8rOgZaQC7L6dg/uiIyMdHQOK0DR4GCqKhiPv4kyce2EYY84C KmrSsGlvPopnfgVpaSlEdjT075ePoqKeUv7498m/V419RppTdr7uCJOXucVmfCUwfq5ZsQ0Vh2tR 0DMLM28cb0csRMk9Z4058xTsK7SjJ+pjNA5dyDssZWeMXBaabFXUbDBIReGAyT5TTSi3qMtGuIPl zeE+Wf5kAxL7a7PNe0N6+JGdRk/O2nUsFw89/eH1ycGQXmNVXmtoMzL8ZNdp2MW2hz6Zp2UFtWYG 6GIBAO7JgJq0JQBDkY69F4Y9jq4xERn7Bvi4N8kORTnphPmFWbaC+jiLxRrnNyQrvwATps7Csjdf NodSxxffiKz8fKfs3KQt1oihHga/F4bGDaly7525oXGPQrkXBlsJ2docvZWXn43rv34TysuO4v2P N+Dyc0OYdHE79pS2m9vwZWb0MQ9M3rHfWFI+wM5KTpYP4872mUOx/vZWtLa3oNEP7CzLRXVDJi7/ yvmYfW56dDhTmIzEloFyY/etgM5PcDP9Rp+RUIWsusPtEWG9dGEvjGg0qD3WjC0fHzDDXX3tWOfx 6A5kuGFQZsKUz7KRrcdK7YXBpM/WcaceMkcD2PtORO/p/M7/YPMvDBHLk7H46hWJzxlW1ZghVeO6 rSOcZKwqzUkPmpaEV0nu6AzWcMrc7cBgzxZh41EBQwwjpwNrlqPO3NaceDn0kw+TBQYgV+SIR3YG oTGU+unGtagqL8OSl+fg5n//KQOrGMDglFh205i5A3R+vAJDLgMbTovOFRhc1AeDi64301u3cSdq qspR1RhAYW4HMtJSUNTfj4F9nOfz4TagtDIdBys6gaQstHamYvR5IzF6cAHfxLPTiQcYkZawplPT hQRgwJqs5ygBbGBYtYIARlRPFs7dYP4ePKQQZ40eEAnHbUzD6qL1lbG+UnoEGNxZHSyTZWBoYNjB vgpL2SVg6AwwnDkYLDDEM03YOsqeR6Jb8dnWjAMMn6brxqpSr2JVz+QbZs/Y2lz2LpJ8XoGBmIrs XDOvX4SBEhiqOB1rwW6/ssCQ8kKFgVN0GxicncbUFuEhGxu3Xn8rXnv0f7Ft44e4avbXUDi4qAvA ECsba2GoFCsWMGQ/KmBYDktXlaKxOYSqmjbUNXWioSOMxlCOVI16Jkc6u7JS69EnH+i7qRnXXXsW Jl0zhEzbHRi6kMeIMprAICdtgTl0SuO+mjzUdafJwAIDwL49R1BdFenUnDL9YudrDUYZ2XfBTaRy Zk75fDrCYaZugHjPdqWDPTmKBYZ9nwRGNDph0hZLGxIY9uPlgWErGRwLLSVZqomuYhzED+tkonq/ L9grJ8jsweYQQgYGXwdFJeWnhTsv2CGDkIYEDLdZnqzyR1+YpTA2EWIBIwoJ1xPPfNzIjPWQzaHU D5Zj7/YtePvJv+B7//MoDwIOGOAqNPgiEDDwCgxw4HGAIa5ZUQNjwcJtmLf4U1Qe68Sxjiy0hlMj M/6hXqVaG8yO/gXKjXVklcDHe7bgpbe344LRvfCjf7tcSscdGFJFAvNJJIFhWx+MmU3P8pTXkSxd +LH59/wLhqJn79xolCxsVetIwK8JsoFhvQoijA0McDDTNOc7yys74lhHAqmZxVdUHhi2WcCAJVEx AeFvTzrcKzswlH6HIjDcv/yQpoXHAwzrIce38Mx9WrhTKLscUrzsWxL/Mu9BN4ZS78HBvTvM5sju TR+ay9ppYERfrlMzBCVmQOUFGKx/8J8qTZrwTgPj8Wc3Ycun5agqr8fojFRcVhjEuXnl2NJQgOyU MHbUpWNtUyaawkmeqlN1oAeqK4D9R+uxqeQtTL5yOL5917gYwFBBUDaXZWAQ60jMpNyBsWLhx/A3 tyMrJx0TrjnfeWLWtHDdDRigrR4m76z1eeLXkTD9NGIzRUwA1LRwHeFQyPMissb2VLQFfOYKQ7Nh 2hFAbSQ3ejSH0X9Me9QZVpWHNp0a6YTV3fwo5lt4P14gmka808LZciju22KPyDj/jBdSOHgYP5Rq 3+fBZNUoz7M8NT4dfkRIk+dgCOkph2+NOQ5N7bj3P/6FZRsqkKynYGifAmQWFWBJfQ/8ZPcQvHcs FyuO5aCi3YcfD96NGfne27OG1AWzsK22N15fVIof/HQeUSYqz5rCj2KfBia8PC+CsTSZZ2f8aW3t wPaSSKfmVdeORWZWOhMHmFmewtC2Jucl9ixPTSgiP7ypaXy56WFeSOWw0uTuWWHApis+Y3rSlmDa kWINp7YFkpDsC5t7EpiwaGpLWm9HrlQmxyyT4CDBILFZnhGJ4zySRI4XAHvmCXWfqsi8Ik/86jeR nZeHlsZGrHztOaEyWyeZOxWPVn5aseMDBu+HAsZHm4/gGz9eAF9SGsaOGoQfFnfiocnHcEm/Rsya UI+WsA8tIQ3bW1OxszMD8+uGIjmpFt8ecIyqQ65S0dkLHx3KwP0/Wc6VyZlMxZ6mRpchLmBo8hwM CIq2eO4Gc/1H3/4FGHvxCEYBCWAI8XkBBn2AkbDJkgAwjck/DQy5DmjRfDp5FMvhlD1y6RPiZYGh FmrORXswaZv19tAZwCa1IisU3VWRo/fFBV6SHzlMpIP6RB1gxFo+qjLGBkZWQQ9MuukO09f6FQvN DX5jAqPbLQyNyKMMjDfe3YkRA/vhiq9MQFFOHbJa6/HAO4X41bIM5CcHMHZgigkMSz5tycC6lgGo 8uu4Ns/bgcqsNIcysOZgGh747S6iTOheYLBfaRsYzsKz8tJjZsemIdcWXyI/U5eFZ+7AsLIScaOB wUJLBoY3C0OAogUM2x+EMGw4Nk1nHcn+snYM7yGvLjZ28t57PIecmBUMa/XWm0NbR6hKVlxameI9 TR26FwuDmVAmxmn/donjFCw8u2jKLHtV6ryn/iZUfgUwYsCBcpOBAc8Lz155ZyfKGzW0BlsxsGgY vj6pBfMOJCMjOxlTh3bCH+6Ev0Pe1LcxkITlTYU4r8B1E2hXWb61hgcG91Fj8+xSBhIY7DOm1pE4 5vjKRR+Zf8+9YCiKhvZhgjG98JSFYbvz70Nq/jDAcG2SKIAhryOhgMHEQQKD9Sc/PxEY/nbdPAfX Ena7/5GFzdLszS0VBfiv5z74L1iwmDVz+ipSCUlgIH5guDZJrJ8sMKhp4SrFZ6EUp4VBAYP7Jzx0 ARjT74ycZmaMjpTt2CpX5mi4mOtIKKtDvEfBiPLHTAtfsqECO9MvxX59NJYtWoi3V+fi3LP64LZr GnDdhAa06CNR2aRh9lXn4e+//S4e/PZMZKY5g2K1PYdjRP/EjwIwgPGr//ssmkXiqyqVq7uAoWHT mh2orqwzh0onTb+Ub/9bT4n4mmuS+U69NxkY6j4MLwvP2EdBlEuwFDhg2PDTnN8QfjPACIUiesZC gtrJ246bUVS7ZhxtSm3tk9uZyXkDMXohzsGw/Nl/rUsrkG4PD9AnnlneNGbuAzWkCqay6IKjE2fs E8/YCNkwqnRY4lvBIu5Dzh1nrq7cu20zFr0yB9/7w2PcfTaKxCZt6fZLj5SFPQWN2wmGTw/Aa+9+ hlHDByPr+GFoSelo9BVhT30VFpU0Y3e5MY8iB8P6pmLlu79Hr8I8O+VBRf3xo988bf4eeOF4jNpV hv2VdVIl8ipzN1Sj/z91fP9bI5lsUydj6crnDHCPg39/VgDmWbf627Hpwx3mnUsnjEFmdroTrRWv OPzIbFTjvCNhizwN0nZ5/Iln/KQtcpanOLRqzQ61X6Ezy1OsF/boWnSuCXvimROnOO+En+VZ16IH GuvzUgbkteGswtjHPFhzLMBOY2wPJJfqkjVhvRehORDXwjPwzRjSjxUP4jjxDHS6jJtypSphbch9 K6J5Tn/5brzvweiq1DJsXrGQaDI44VwXnhF9I5C+EuDSpvJjXTc3t2Dk4BT8/mez8Pyj/4bnH74X k68eiyLmYONv3V7MgcKQGTPGY1jfiNvYC0ZizMgB6KqsWL8Lz75SwuVPbLfHLJfdJIPwnFijI+K2 dvkWtDS3o6BXDq6ZdpG88Iy1HAQLw/qiy5aHUw/kPgfn2bPHC7haGEx+u+M8Eo3JP6RknPCpyb7w mL6NSktClFAYpZaTDYuG1mRzo0YZGNQ/D8AgzgmRgKFUdi8rVRXpCv0q8gFGut0xSscj5kP4goHv ZMzK74lxEyaad1e+8ypXCSQQCMCQ+jA0ESIeOjwpxTJ2+rq4L26ZMRK90itQXVlu3pl5w2z0yHdg cesdU6TKsXtXGQ5WN+LcIb1x+YQxKNlRLvmJV/bW9sTSD0tRdqS1G4Dhk58RHMWvPdaITzbsNp0m F19qPzeug9IFGFaWtGjTghumtMJpYpwaGzACDE31DnmlZuPtDmDwQ8dMHFG3zna/541vEOncPGL9 dmDRgndgqzFhYegsALoTGGFGKVXxxDpeQE6HPsCIFRkY9ByM2MCY9Z3/sIdSFzzziF0JJBAIwBAr Eu3Gt+u9AmPM6IH2vR0ln9i5nzb9SqlCWFJzvBH/84d/mv0WP3vwG6br9n1HJH+JyI6jvfDnJ1ZK ZUwIGNZPCRjA4ncimxMXDeuLkecOseP3DAxWGblwllcZAJLVI/Rh8O+MBgYXrgvAsOPj8unkPRyW 2n+u0hpIKrHu27Do6Ax9HDLnvFPAgKSM3oARu6ngRE00FzwDQ50OBwzOMoFw7QYMMW/yi5h8853m 35L1q+FvaHReWgxgkE0SaIq0qMpH+QF3nZXmmJyGtWAI25GJqEVxx93/je0Hq/Dknx8w/T3z5FxU 1/MboHRFPjuiY/U6Cz5egQHZjVF6VmH3fnoIhw5GtsorvulKQWE03pqLExi8ia/xWQHrD3b8Pule bGBwJ56J1oHHA4w0QCiHE0c4HPZ0tL5xANHK/YX2SAhYWNwwe0ZDbXNqKzcJy+5H4JXWOzAoOKj6 CaAIQwHDuvY2dCsBhWyCONdxASP676LJs5mh1L8SFT1OYEhKkzgwxp3bH3t22B8IDOubj+H9epiW xOuvLMd99/0R9/7gzxh/4UisnPcnExSvv7wUv3tqoVSJuiKHm/PxxoLdUv5oYLDPWX4e8giJhkVR q+Liy89BobHazfaiE8quMdEKwBCVETxI+DioeRFO2Xzc/p2K9yw2SYj5IHYcSmCA62uxahYLjKqj 7SjMcu+rYE8p65kZ4CbacJSp9aet753bNtnUCfslWPtEWNfiCAnjntA6EiYqL+tIzDSs4wX0uBae qUdI5Gudm95P5cV5GVYUM75xP575/S+wd/tmlO3chqIxYyNhNbZXm1pHQi0805gisIk7vzXVOhIx nAbs27UNo86NbNpz921Tzb+PPvIm+vXribu/Ocu2OA58Voaf/fwJvL/F/cChROXI8Q6UVbSiaECm VE5nlIRcpsmUiym/6UXH6kUfoaW5Ddk5Gbhq6iURJdGZpRwx15GwdYDJmo7oOpLolvx2fql1JJYV y68jcY4XEMM4C8OcSmdFzy7LpxaewX527EpVgFmiLiw8O1KXhEH58oQsRCERDGswRkmsE8p0Xatg /XCwaPQnrdaAyc6RhSD2qKAUmVdSe5GXB0WOACOOhWdRLXaAAW/AiJbEGzCsd2ctVhPjBfPDqexF Yy5yhlJffgrf+8MTTEWngGHlzfqeWQt+HDDyig9h+NQrMIDLxvVD6f59GDriLNx251S7jAf2lWPZ 0k2Y8+x87Cqt7tZmByUH6nLxwhub8ZsHr5KABnFY1VYQTYiJB6YBiY1rt0fKefVYZJlDpfwS9YhS uRxgBOuEMkTdnS+ZZtcFeeEZn3cHXvbCMzgfBisxe9GXaUGIwIgWPfocSGAww7yOdWWVI7oaV5cX nvlb/AHkgNtHkYKEJZ0hbQ97zfWMNrcGF8IyjsXmiN0hyDcLaHPdoay3SVvxnEfCTg4TOzbd42D7 LzTuxHYqHFt2qoxWON78v/G+n9pDqVtWLpRNTu7ameuvWyYt5w9c3FI41gx2bZJo+NUfN+C/f/sP NDbYw+amNDW24H+fXWpaEicaFJaUVweF/FHl9D4tfOEb7yPQGUTfAT0x4Zpx0jOXJm1pkM8j0dgm BKRmgDTLU3Pic5oy6mnh/DoS0OtIuL4RYc0LOZxL1AE7T0yTJBom0Bmwe/mtLf5V550a+262B33c OZUcLIyNcGpa0oM0MBAnMHTvwIiOtMQHDGtdSJiLQ50Ov44EbPncgEHN8nQBRmQo9VrTdcW/XqaH R0XFhwgMwY+kSLKbGzC+9aPFWL7lCFZ/6se7c/lzSsddfA7GDu+HkykHK1tRdsRPKz83pyE2MMoO VGHvrjLz93XXX8VqqBoYdlLUAUZsxyZjobqsIxHzRaVl3XNdR2LVDzE/rsAAHwcLKwEYwc6OJAsS 1hb/qkORD9Zl6b9+ds2zrJs05lrnT99uKUIEGM7X+4QCw/Lv5oeaYMWF95aOp4VnQhwSMLh/4CrM rO88aA+lzp/zd1nRldew45Ig4wEYlPI9+9J2bNhz1I75o8213Pte894bOCfXvX/igmF5mHZdES6/ IBO9MkJI0UKSn3ikujUbL79dosizVX7rtzswls77wHQdeU4RhozobyuKJ2CwSsoqOxMH+1sChhOJ o7QegMFBngIGGGhYwdhyuAIDHDDYZnWd35dsQcKDSOddSsModS0p/0Rv/UI7b3D2JwR/aiTz8lR9 C5D92X+ZSzsOt2nhbDrMHpqmRcK8OKj6SjQONDE7Pe0eTicOelo4Wz77oWHyzd/AvOf+gZL1q3Dt Ld9EpjEZSmcCU30Y1hZs0cg1boqz7lQAhRvXJ6gDy5duwgv/MuZYOHudLFi3E31+fB+yOxqgNdYh tb0dVwQDWJUyDNUBeqcsrcdIjLogA0MHXYkDq47g6uyteGjbWbjz/GNorNqHDTuC2Hw0DQHd26Y5 htTUW18055lx3GU7ADk/zoMv2bgD1RU1SElNxsxbJ/PPjNs5zIpX46Kwpm5H6o4zpRtwOjbtfg+r 84OdFm73YcjTwsX3wU8L1xSb/8rbAjrVI6IVYV3oi5HqEpip5dG6pPnwyae1uHbEcek9qKQzpH0i 3pJg4W8LGf0WjzqaICutmRURDtB5ZQPbGUnt5SnHy0JHPK+cq1gSMHQnaa7msekIALF9uAEDCQPj oik3YNOKBagqP4S5T/0Fdz70e3lNCBfOUXwWGCQcOIm4bSvZjd0ffIhQkh9XnWv0Y7WhqvEbONa2 XaoOB3bW4JYMrqMbRWmtSlgM65uLXeEdGK6PxrmDk5DtK0R9Sm98/bIPEepoxXdn+PDI6w1IqW5F a6gX3j+aiYMB982YjD0/ndIQMOCAIZfZ39yGVUsi27BcduU4ZGU7eZeBwTxvFhgA15EoAiMSjFhH wiQSCxhOppgNdM3Nf1XAgHIdieHVMETCYlqGb3YvTzYORNL1t+shZMATzan+ClDNkFkzi0vr2jLb 2OaHZufWMdHJWZ6Uea6cg8H4V/QZ6FK6bFMHcawjUeST8SM3Sdzzpry2n5iGW77/C/PKGB3ZvXEN UwcV5jdjpnqZg7F24Qq89IvfYtGPforj/3gUvT4twWWDmlCY2YrM7GT0zaW3eV99vADN6fyakBEF Ipgd6d+rEWP6DMXby2vRL+kY6ny9MeOsNGjJEess0OlDdks7RurtGOc7ggf7fYbfnlWFc9Papbgs qajTUVHVKH0OuKMehY4+1m3Nko1oaWpDdm4Grp05gXmOQjNAbI5YT1XRkci3SgRz30qfnfgEwR/7 0bKdmbxb1+wSdalJQq9U1TR2HQmE/h1hDgY701UD2lvb6c4JQrZW5Ur9FaBgYUh1Y/Yi8wczvVsT FUoFDO46qszdceKZpJREPLGAIY2eKNaR2KLHMS1ctoIKB4/A2PFXmVer5r0arQQ+HhIKELgBo7G+ Cc/95D/R8a+30e9oFVKbnDbo8SNBpKQnQQ92IK9hrfRuLVnRYzrG/WEO+l19JfLOHoGCHPXJZHvq dmB0zkUYm3oc6S1VWHaoAPdevtccUQo1dyDo86FvM7+CsWdHLb7XZz/+a1gl+ibL9bSpMxWLV5Ry Hbu8wkMJjJqjddj6yU7TR/HNkwnwMsCQoMFYssIIggMM6x0wINBoYFh+7XUkjGJbabBxakL/hriO RAkMwIk37mnhGgId7eoXHBWr8zM7LVQq3VTB4nij9gZvGaiVwwaGqKR2OI/AIBQ5NjBAxOMBGITy S+tIOGjQYeRnIq8jKf7mv0eHUg9hrQUMsXLHAYyG+mYs+eWvMbiO3vaufUctgnoa2hsCaG4VzfeI 9CloRdH5+bjzsUP4IO/rKJ/wc/Sa/B3JnyU99LPx4qv7UNz3IOrzR2N/UxL6ZGxFuD2A5Ow0bPu0 A+kSLCPSO1iHXw0+gGEp/MzBQDgJh6uao+eGsDYsofgCMBa+tdwcKi0aPgCjzx+hDhfHSlW5o1AA BmhgcGBwTAkJGFz6IjC8WBislYH4gFFZ5UfPzA5S18FAwur87Az61kueVLAonjb1rZbO1JAMDOtR EsCQrAPRyvACjBNpYbBCp+O+jsQLMCDEbZxm1guXT5lt/l6/9F34G+ocYFCAiAGM5f/3f+jZrt7u LhTQUV3ehrT8FHxykN5499xxI5E7sBk3T6tAbq/d2Fe3BR9X7pb8WdJR3YRfX3QAndl9cd/ybPzt a/uBkI5QWweCWjL2r6PBZYkvGMA3ispwXgE/EnO83iqHVU6oFT96vWf7PpQdiPS3zLhligQHKZwd nvHDPGMOGLDmKDBDqiIw7HB808PyI7rzi9A4z5yFIy5tF/NEAcPrOpKyqk5y5qYICdPtWK5RzX8j eVbBwpCK+pw1kV+yhaEEhqTsJwoYbE4Ja4MERlfXkUC4VgFDzAsw5Y5/s4dS33/rhagrMTyquo4C Y+7jc1BQVSm9K+ndbW+GLzkZh2vo/qxgQzo+Wt8XzccK0NQeRCizDnn56jUD56eUoj21B+5e3hMv 3gXk6lsQbGhCUmYaPv0siP4BuZkhSu/ODlxYUI98Zly/vslKky0nCIWBfb3ivdXm1SVfuQC9+vaS /QC8EivWkZDAsJXRBRjKPgzHIiHXkWiiQlPrSJz8SQvPpDzKczAkYETjbmpqt/dHtDbkLavnIWFJ W9DX+vM5a703Qww52pj8hnplJw0M8tr+qwKGCBQiTspNed01YFj+5Q5PMZwYhorXAcbsu39g/i1Z /z6OH7behbrzUrrWNHQc+Ex6T5S0lvpR05aENoUBMqPXfuerOeUAACAASURBVPx69EFcpjehoCIZ TZt7oerQWZI/S1Y0F+GelYV44zuZGJW3AR3HWmD0bh6pK8SBFdJwvFIuDbbjpsGO/4o6n3lMgf0s YgDj/ffWoK6mwRwqvbr4K7Lpb4cT/3oFBv9bAgYgsElYeMbAwTMwQAEDTloAX0YJajIweKAAnW0t KeKu3UUF9FyLjqBvpeQYFSUs2jtCb7QGU4R9IHQaGJbSmNceJm3Z4URggFA43k3e0UqVjuMW70pV e3QsHmCIFo6Ql9Hjr0W/wUPNValLX32G+WJ4A0bZwcMoaGqQ3pNK9r1ViZZ2nby7yT8cB4ODkO9r xOX5pfj+Rcfwi37KOoIBmbVY8585KMKraK/ch7CxfVLLcKxcXoGenZ472U25AM0oTHWsmD0Hjtpf ZVaJRWD4m1uxcU3kVLFrpl6BrJwsro8BmhCHZHF4AQaj+CCAobHvDE446WtvAQNglZcEBpsdGxiM RcFs0qkxabLls54DNcvzcGULWgPwUbt2i3K4IQudId/fpRtRUcLCWLJeUZf7QaTOhyUF5IDBXHsG BhvGVsju2i2cgpLLDuJSOmGu/8J9HYnlFBsYzlDqJ9i9aQ0HjFhNkvJdO+HzYO5bEmgNIyUQkNwN uWB4B4JZGXhi33BMWz0a1y0ehKlbr5b8WZLeWY2UY8+is77JzM7xzOuwb1cLBlV4tyosSQqEcEkv oS+FMeNZRWeBsWzuysj6j4G9MWHKeEbpwMzyFE7HZ7/CXoHBdhra2VGtIxG/9uw9SLM8uTikWZ6i haEChpAm9xxkYBw43KFPKKpzhYQlta0prb96Zs370o2oKGFhSFVDyhP2l9ZFKbsfGJQfEFaMwg/V T8KuI7HcYsSR0DoSZf716FBqRClXzX1FqKzuwNi/faf0fhKVjFAppgx5E3+9eQu2/agU6799FMvv UHdSdgR0dBxvha6loC1tJDYv3YTUjzdL/rxKUTaxv6kLMMr2lWF7dKj0quuukPzwwJCtlLgtDC/A EIY2xf4Hpw/DJ4yKqIABHhiCxUlOC5eAwTdJjP9aGurVnVHie3ZpgiAWLKZNK36joT3dXAhgHU+v UkoeGMz/XcKI9z03SRI58cyWOE880x0LwxMw7JxRZdSZodRSrJ33slSp1cDoPsnQOgF/AEnNe5Dc vA0ph+cj89A8Zfw5eRloTr0YNW0j8fHDa5C911vfiUr6+9ivnMYpBwWMJe8sM13OHjMCo8eN4pWf aG5IwCD8xA0MRkllYMC2EDlg2P7lIxId0CiA4Xq8AFtEsW+EL3cg0Ok+lTYqsZogiAULmKMi2Sut uRIkMOy/FDAoJZSViwQG0fyg4uCAITY/CDBFohesDrd0vB5gJMQhASP6Lyu/By6fcr3pe/3SefA3 1knAoPosRgwbJL2bRKWpOWwcdgt/QIOepCG9MAMZfbOUsZUeaEDJowux+3nXD49n0chqRwOjZH0J qo8cMzs1Z98+i1Z+biZjV4FheSGWtgudk1IfBtGcgAQM3mKkgeHcVgODn70pNkkMb+s+qsKFA+pj fmmMPS0O1Wd0ujVBQK0NEaWmOeWX6IfrIsBwzvSwSySsuZAXnvHne0dusHFEf+jCwjM2DVuxWaQ6 ccgb9FDpONdcNHb8VDrOdczzSHTvC8+m3HE/tqxdFh1Kfd5cpcoaQJqNQaesvn5DpXeTqAR3N2BD SaSzNHdEDoJJyagLRVaTUovBUjTROutu0fgHpDkLuVYtXGU6XXDJWGTmZjnPV+N2/YkqibCORLM+ RBpzzb8MTVpHonFpsFG4LTyz4xUWnpnhNW/rSDRx4Vn0QXheR8I+Fw3GkGnngHwoLQt245vK5rQ3 JQ+CxITF9OLizYd3vN7WI8OfAfthxQIG+45cFp6xLwYeF56Rih0DGOJfERhUOsTKVXdgWNsPynmz hUnHGEp99eHfoWTdSoyfegMKBw/ngcHsppSo/MeNnQi0HZeaYvV1ycDByO+m/ZHORi3Xhyduqkcy 0xHclBSxNhqbdWBXwtmQJDcrgHsvakSj9ZXkFN8p7+LXF6ClyY/s3CwU3zZDnvPCaZfllAAwLCdq 4RkTNw0MBiqAXYflLf0IYNiwooHhVLooMNj6QQGDSd8I2tHWkox86fGbk7GSNd3eHcttIhYrnnb6 PVSb9+ceA1p+7eQnFjDkrzoJDDuM9XJ88olnkmUQZrbhZ5oxrJuUjs5fewWGAkyIAxi6zloxlt8w Ro+/Bv3mvmL2XSx9dQ7u/Pn/8knDWjgUyWh7mx9H+mbClxL58msdAaQ382eRJod15ESd2jUNebof +VmOH8OE9aUlYSt6IHyQf8cpmRrGDWvl91RAJOz6SuXHybO0pWhoj9a2sws7cXbwIJJzU3AEl/EK GX3INdXHsPUj8/BuTP/aDNvciLxKFgbMNoOJAkNjvHAS3RMzqsy0hQHGUrDfeuT9CcBwPoSa7QuA ZGHY2baAFL0R2cvTKZcSGAB27j6OofktXHvPgERaUticjMVKayBpn2oiFiueYFHbGP5rqL/v10kI 2codCxhRdfIADN1Bqm0mxAuM6GaqjCKzHwb+zejej0hkmlOs8iNOC4P9+LHp3PL9n+ORh+6LDKVu XIXR4yeynzk7+0a5Sg50YHH4O+ijB5CR6oMvBUjPD6Fflh+hQJvZRm04fgxTateZQ6y1SUnobOlE R4AHii/FB/jkw5ANCXcE5eNVjDyE5KaJm2wfOAjnj0lHWpq1dklHmtnejtSdmmO1yG88DF8GO9TJ K/HyecuMbeDQb2AfjL7gnGizzGeC1jpi0MmgB2DwL1gGBgQDhw0TfQmaV2BITRImq/zH37FEbGBE 0SAekRgtm8+nxwaGruPQ4Ybg6LxOU79VkIC9HF17WrpBiCdYGHMuPl43f8U5faons19pd2DAIzCs cHpUkfl44rMwhCYJ/4qifrT4zlSlLA7SwhDMB9tN3SQpHDwMl15bjI/eX4wlr80xJ2452XUKbfwq zKjHvWOazHNLDSmtSUNbIAlHmtIApKHcn4rMpH5oz9qKzIZGZIfDqNQKoBfkSO+z9kgABYKb7tdx vDkFaXoYYbONHDbP7Qz5ktDmN7ZC8Ca1PXrA3/Ma/PvG3hH/4QDQVs+FvaNfBc4bVQc9NwPZ2Rn8 g9GAPSU78dmOyIjLTXff4igdYwlEgCHUIea+BAwCDrw5wQJD0HAGGNzXn2k6wAYGnNonNkmEfgXn NYv7U8h5Z60PL8Do8Lf49naqIWFJaX1W8KGnP/yzdIMQT7Aw5GhD8h/P6YPJYvu368BgSSAoeExg yF9+CRg6+N3CAXIHcRkYcpyihWH3kFsjJmQ4KoyTzrW33G32W9QdO4q1c1/ElTfe5ZSfSXz9ob5o DachJzWElCQdeSmdGN3XD03zm9ZMuLMJjf4gUJUFNDQiz9h7vqRW3hsNkEBhSFJzGKUrGyV3Q7yC Qk9NRv+rJ+DYgX24JeczpKU6hS3M0XG8PgyfYV34gF43/sx8r72sMjKvfvm8JebfS664BL369bGf n9BK4y0MomkRGxhivdOcv6JJYDdJoh2WZrUKc8c3aOKBxCCAAfZYgkhYfpt/4qgA2yx1es1FYLAQ XP1hOfLTO31ets/rCGqLJUeFeIbFzBnFK3d98q/qovy6vuLIhQ0M3pEBuGYPP1ouDjCoPg7HX2xg yIosuVFQYdMggSF3cLoCw6w4PgkQ7sDQkJXXAxOvvw3L3nwBq959FRdOnGFu+uvYqZFI+qdXw5da gEP+HsaWZ2joSMX+vdnY0uyo8qz+zeib1j3HDSYih7PzcffUCXjt5++i0TcYiK5N2dyUzsXWI1CP nwswtKG47APUHa9HSmoKrplxrfOOJEXvJmBw1xEPttKTwNCYLfI0u/NSPo9E3iKPP5YAzHkkbL+q x/NIOGBYO2VFytTc0NwxpmdLWqxXuPd4jh4Kaw9INxSicbMUY8iSpUvuu3J4+ZPOy9KiT1+zH7I0 ns340YUwEV8+1zD8NYTZcLQf1k1z8yPOZ7DC2M0b0FOIhXSsPOnsfXKcXw5jzTz824/uNK0LY/3I oBGjmPqpw+9vRc22j+FLjXSHBJJTkJykITMtCe1h89B95GQmobEtE2gPIaO+xv1FngDRfT7kjBmF rNxM7NtzEKnJkYlX7Z1J6Azw8yqMOj127HAhEzqCgSC2fVxirj2ZcsM0TJhyBaPEug1+nXDThGsu nDUnR2f9eF9UCDac/RFg7zuHFFnLCtg5SZHfkNzZWcJGOF1n80vEYX/UmDzpBjCcvDU2tGHdqhKc 7dL0sKSkomDfA4+vO1u6oZC4YGFI6dbXWnpnN2edHsCIrciJACMy8eXkAmP3xg/w6iO/l573l1GS U5Lwq4d/56rYJwQYjKJ6BoYVJg5gyKDR7XBdBcbK1Yf0ouTdnH1OiTFj81B9xqRYE7FY8dwMseRQ bf6femc3/XfkUp5MpTM7CstNBTiTtqzg0vwIOYz97qL3nSaJ1xPPmKhc09GiL0Uz+wFsC8PTiWcW kqgRklhNEh2jx1+Nwrefx/HKCuT17IWRYy/hH7w0sxUJXOuCE/WhcBRBcpOu1fHpYpgY+e9oa8f2 T7aav6+eNol5KXwzxRTGjGcriY54miTSpAYmnOMmT9pi8q3si3A/8Uya7GU3SeQTz+QmCfgTz+wm SeSIxIbjx0JF/dz12piMVd6YVhUPKJAILBr94Uf8nWm/yUrtiI6nyfMYIpdhd2AwbUR7hNhVkUVg wDswbGVW+BGBYY+JxwEMptMqLmAw+brtgV/jkYfuR2NtDUacd5EzOiJ9LaNfGskNxLWzw5e1A5gu +iHj4b+65FR/5ZfZKpvspkrrqd/9xfx59rmjcMX0ycwRjer+CnGExPriegNGRDFFOBCVzRsw7Dwp jki0gwsd4V06ItHqHI3kaeeuKgzJb1bqtDVjMzstgGRf6l8lDzGEmqTvKsYw6r7jPZ6WX7j1O8xc qiuJBiRQsfjruE48i+sAI9YMjGPhmbSXp87FxYeznJx1JIWDhuLSidNMZ2Mo1YlbbP5YTTiiGSVd +5jmD4Tmj0tzTGh60c1LHxcv/w98888lrS1rN6LqSJXZqTnlphlk+lLakNeRwG4KuoQTngXvpgij XEfiPHN5HQnkdSTc2hEo98VI9ACjA/uPBvIy5EWm4lGFVc0ZDV6HS1mJGxYwN/RN+mV7MCUsA8Py IbfZeA/dAQzwaYNSSDkODhjk1zUsXMefjndg6EIY3TyQyFiVGhlKfal7gBH1ozPXiQCDVyAwftRx kPkTFHLl/MhQ6QWXXYTC/sxRii79VokDwyo/iLhVYTwAQ1RizXFjFZ8DBnm6GAsM1p0vnwiMxsZ2 JAWbuR28qaMKjUlYbQEtoc6xhGBhWBcHagv/KVV6TilEpaO+zvJ9ebWm6IePR7mXJ+UmAsPVHHeu 5c1/qXT460RXqmblF2Di9bead4yhVH9DbWLAYIWpWDqhWLQSy8DQNMhKBciK5SXe6N+FL78Ff1ML snKzMePOr0WjU4WjldgdGJazHIcEDCJeCRj2PTD3YF+rgcE8Kza/xCa/sIEh7sLFlo/P54b1+/SR vSMjINRGvJaU1mclZFUgUVgYUlmX9JOOcFqYVCCmScL37srA0KQwoNvilFtcwOCvXYFBpBv7ACO5 iRITGArIXHnD7ejRu4+5Bd/7bz0n5McjMCSll4FB7tBFhmWBoUmnuJOKxTRbNEW8rU3N2Lopckre pFnFXD67CxhyOP4+BwyNVkSxXLyFwY6aQbhPAYNJhwUB465xz0FlYfi4OOvrm/TdR9WQQHRqd6JW BboCC8O62FnV97HIlcqEjyqmEhh6/MCw/8YLDPHaBRg6XR5XYCjTdQOGfLyA5WfarfeYrh+9vwTH yw94B4bLfQoYsj/wYThgsIrszXR38ian9e6Lr0bWfwzqjwuvEjfg7R5g6GJZYp14Rj0HIi26SWJ5 EbfoBwMMJ2333cJh31MDIxL/oqV79QG5bb7RfWhIWNIVqwJdgYUhtU36bxraM6JHaotfWKtudzMw REvBjicGMBSKTAPD8gM+HAkMcPfFdOgTz6hwfJjR46/CkLNHm67vPfuwUAYQFdmqWEylBYSKDhIY klXChaPcQFsklGKxSsO47dmyFXs/jZxVctM932Di4MPFDQwRmvyZwS7puJRB4aZJz0jj0pB21JL6 MBAHMPimCtsP0lJ7LOYem8a8ipAO9UlSHqRLsDCsiz3VfR5wlNa6cyItDOLajscFGIQiS26Un5hN EtXu504cJDBIi4IPM/ueyPEBhz7bhd0bVsUABhSVWFT8rgBDk4FBKJHkRgDjg4WRJQnnX3IhCgcM EMrAh9Ooe2RaTp4dYPii5YydP2/A4J+9HUQCK+tNk8qjkc9ReOZik4QBiRVu+fI9+th+dcIXQpYa f+q+Hz++7m3pRhzSJVgYMmlK8WNH/cZxR1Slh6R0NjBYSeQAIwoYlv84gaG7+aGaQkpgKNKlgCE9 K/m616AhuHTiVNNlyevPMpYOBQwfV2G7Dgwm+m4GxvrFS1B1uBIpaSmY9rWbST+im2OGEyM0irKJ zbJuAYZgPTjPkfAjjXzoimen+s0CA87xAky4uqPUUkFeKhqywi2dSfdLN+KULsPCkN2V+Xe7Kpig 2JFL4VxQxo8NDCYOT8BgASP1D8h+ugcY1nWcwIh5vEDkeuJX7zJPMzOGUle8+iSRF8jK3K3AIHr+ RWshDmD4m5qxKmpVXDOjGJl5eZKfxIEBqWyaEEf8wGCKLYUB/5zjAIa8W7jqN98XY/ZfRONdtmy3 J6uisjn1w3hna1LSLbCYMX3625/VDt6jan5EnChgyArIAUNSDEIJPQHD63kkVLxUOmDSYLb+jxMY coenfJ2Vn48JU6NnpS6fHxlKlfISFaLZkDgw3OdPJAqM1e/OR6AjgB6FPXFF8TTmK+kjwtBpRZxE YBBuGtGhmVCThHgWqqafKzA0BhiQgSFkR2M7QcU5GNBiWhXGjM21pb3CgZDvbulmAtItsDDkSE3y 9GA42V3BJGDogoWhAAbXGRnPeSSJAkPhRyqPdR4JG6b7j0i84vpb0W9wkTmUuvjFx+i8SJVf/OoS gIgFDE5hiXBxAuN4RQU+WrPWvDPl5pv4dBRKK7ppnDYRwBAtIKI5Eh8wfER+iLzFDQwrWvGIROeQ Ii4ceGAsW7JTaVUYkDhQk2NOwspMCf3Jy5Z5XqTbYDFrZnHprmMDX5e+vpKCURZGDGCw/iU/chgZ GJa3EwAMKww7MuIZGPAMjGuuv838tW3jWmcoVcoLBQdiDgYIxaeAoVBYNzc3YLz9zDOmy5CzhuOc iy+y/XBb5MVKi8sXCwxRqdkoCWB4bJLIz9UljFdgwAUYXGemk3+2A9TwV3u0CqJYkGCndf/4iXW/ kDwmKN0GC0OO1uN7jR0ZHZQyqYFhXarDaEKYE7qOxAaGix9JSa1yxFpHAs4tnnUko8dfiZHnX2T+ fuvxPxJ5615gWHF5BgaTNgWMXZ98gurDFeZU9pl33ikpG5k/yk36EscCBquccryxgGE/Cu4ZuYSJ dx2JFVLst5DWkThpL5y/hbMqjBmbB2udtR+GRWF0ajZ3JFm9x90i3QoLYyh179F+93pb1Wj9dllH QgLDuhsPMBA/MOJaeAZZycl05GHWeKaFX3fbt6KnmZVh98bVRN66Cxjo8joSERgLXnnF/Dtu/GWR oVJosiJR8VJuJDBiK3FCwAALDJ+cN2UYChiWF/UsTy5vUueohoaGVrQ3RPoq2Gndw3pG1n5Y0l2d mqx0KywMmTip+OXDTX12egMGwP8glBKOH97C8AoMQmnFNKU4nHRiA8NllieZTgLAiP4uHDwE4yZc Y/5+74XHeShK6XkBhuWVVtBuWXimaVj44gvmKEhWbg6uueFGZRwa4Sb7A5cW9+UX+xUIJfYEDFa4 /gsqL+q0EgWGwwx2RCRyvXLpVoMImtu07q2V+a0PPrlOfdJ1gtLtsDBkf3X2LH9neohUHPLLbzUV RD/g5mBA7BRkgaFMJ8zEIw6pqoDBX3PAINNxAQaZjnx4sjswnGnh1lCqcZrZilfnCOmEhfy5AIO9 DwEYRP9FIsAw/Lc2NaFk4wbTZfINNyArN09WrLiAIe5gRnyRuwoMjRpFYc4rZb789HN23JTrSBAL GKx7JL+lB4+htbkxWQUJ2DM1tW9KN7pBTggsjM7O7ZUDfwMovrQKpbQWnklNEsEyIIHhmk68wBCv qY7VrgJDvvYCjMhQ6izTxRhKbWmoI9LxAAxhElfEK/G7iytV5z03xxzF6TtoIC68eiKRHzkOV2Cw ZWLy2X0Lz0CWI+JHAAZONDAcP8a/9au3BscNaICbVDenrunqTE2VnBBYGDLlumn/c6Bu4N7YwACh PIQfqSkRDzAgxeMKDFKxYwCDyLsMDAjpyH0nXoDBDqUuefEJ99GbaGyyEoFXMM78FuAhzcGglFgG xqHdO7F3+6fmZfFtt8v+EwEGl2feT9fXkRDNEU1UEWLhmRdgkM+Led5KYET8rV29N1yU26DcBQsn sPlhyQmDhSHlNenFjR1ZQSUwSMWOKqYuuoFr72tSGBdgiGnFXEcSlsNLfsQ4iXQlYMj9FW7puC08 uya654U5lFp2kICoeLQYBQxi3QWpnB6AISoQgEWvvWz+Pf/SyzB09BhSiSS3mMAQlZP3ExcwrDCx gEGFkcrrVi7LsCDyZN/jn70TP9BQ70f1wd0atQuWJZHRj+RZ0o1ulBMKC6M58mll/zsQVXwJGBYQ FEqoBkbk2jMwKPPcFRhQKnL3rSNRpyOtI9FZ6yJyb/RlV2Dk+ReaLm8/8SfFsxWm1EsVmVAwJAoM viPvwwXvovrwEXP0pvj2O510ugwM2Y93N0qJCWAkvI6Ees7stfXcwOcpmg8bGEyzxWguLlv4SXBk YRObACfGPhU1rSlzunv0Q5QTCgtDpk2d9uaemsGbaGCoFUwCBpi/4pBqTMUlrpn4ZGBQADkRwFCn w7ZaVAvP+KHUNcSzhZAXEArAAoMAhGdgwK7g/sZGrF8W2Srv8klTzN2/uHQ8AcPJb7zA0KT4wZVV CqeIt1uAIZXTCzCcR7Bx3R70S6l0bX4crMuq+sFj67u8UCyWnHBYGHKkNnlaXXtOmwwMqBWM+Re5 LWwUQwHDUjTJjxxGskhOS2AwFgax8KxwUJE9lDr/xSf4siOsyAuitVHs4Ow+YKya+yZamprQo3ch Jn/tdklBT4aFwW9Jp9rZi0/b2MKfSyfudSQ+eh0JV06f07mqBEYkXH29H+W7doTdmh9bK/Pb2gK+ r0g3ToCcFFgYk7W2H+l9RUhPsr92OjGC4FRySErrWBi0UmpCGPv/ropsmfiqJolakXlgxFqv4rh5 B0Y4OjrkDoyJN99hD6WufPUZM05nJmkMYEjt564D4/jhcny0OmINX3fLbQrF8QIM+Vpj/SniFd2k JhYXt1D9FflJzMKQ/TjCwMsFGEvnbwqeXdhE6qgxIevjwz2M4we/3V1rP2JJ3CeSdUXWfbDw92P7 Hvglb46pSExVVkUlY/zoUhiYXwy3MOIL5beNo/3wXyQXP4qK3J1HJG5esQjvPv8UfEk+FPYbCJ+P rZhg4hJ/QwAIdS2K+r5Rl9r8fjTW1WHI2Wfjnl/9lgCV2MwkYCx1MDsfAnkiHh0v68av9GUBTUBe +hA48WqCHypt7qPm+jEQrEfuY6hj/Qe70FH+EViroj2QjNK6TGSkhFGQ0YlD9ZlPnYzmhyUnFRaG fLrpXyVD8ysuYM1FSpm6ExgRX/EAw2XvBEKR4waGPfvQDRjymRzWgiMKGE/88odm38XpIj/43f+h cNBgVyWOHxhhvqkVI17WjQaGaHkBrGInAgxujxOXPVZZNxEYdbVNWPrmAt3q1DQgcag+E/kZAXv7 vM1HCkp+/MS6C0/m63btODkRcuBo+sTstJ4HCzNqC6zn4/QLac5DY9108cQz3bHerDD23wgedCZM /EckRpPU5LilOKJuurVPAeWHLA8THtSJZ2EGGJZ66NF+e/nEs+l33Itn//Br09/km29HYf/B0ahZ 8x0cYCQRKrJuPQgmD5JSwQk377kn0dbaikuvmWT2p9gFZ4vKPU/LkmM+rJZH80T6MO8/6tE+w46K l3KLnlbuHJtpxc2eSiZUAC2xE8/sd2ND33o+ijBW+c1LsyJhwVurgucWNiWzkBjV2znoeGtlQcPJ BgVOBSyM/ov3FiyadNmQ1o+zUtqTLNPNGzCcSiYBQ1A2HhjxHpEYGw5Ohlnl8gIM51oCZSxguByR WDTmfHMode/2Ldj58Tp87w+3MxVWsHwoa0f68kW/epIb+Ovo75Wv/9MERXZuLq69+VYhXkKJbYUV gSHDQX5JcQIjmpZ1pGAkAj59SoljA4M9TxD284wcjwghz96AMfeND/QReceT9xzLlSBhyGfHcvyt nb6TDgqcrA5OUWbPnF6y5cig20LGeZPRhybNE4hVSSU/kNqIGhcGRHuXSsetwxO8P1t02USW/ImT pYgOTzsshLzwcahmed743R/aQ6mbVyyUFJr+ZwkFEbeVqrB/tzY2YP2KyFDphKkzkJXXowsrVWM0 +4TmJZk/yk3Z9KMAyqdPTQuPPDlrSTyjRvZ6FaEMxOiLmNb2LQdQW12pNbSnmJAQd+w2J14Fku8+ WR2aopwSWBhSPG3aW1sqhv6X/Yk9YetIuhEYbNzmUK6syPDUpnYBBgUmot1LASMzLx/jJkRm+658 5xWpX4CeFs6mFwcwmPtzn37UnHreb/BgXDHrFvt+witVJSvIvRNcmT9xFEK5tL0rwCDySI2QwB0Y dbXN2LZ+U/jCAfUSJBABhV7tT/36iVr34UVOGSxgLmef/tsdR4uWeAcGBOWhhl4pYOg0MFzTgQwM O04QSsfH4Q4MOe/eVqry6VLAmHnP95Gdl4uWxiYslycSVgAAE41JREFUePYRRRg2HfE4SY/AiP4u 27nNbPoYMv2Ob3NDqvEDw7rFmu+iUiviULlxf524u3fhGR83e18CBhGv8fe915cGxvRpIPUxOkPz 6VMJCpxqWBgy/qrri8sa+1V5AwZ9aLE9XEUCA0IYBhjKdOR4XJskxJffGzCE5oUEDCH/RLoUMCbd GFk3UrL+A/jr6xRhdCYfcQCDFU3DolciW+UZ/SVFYy6ww3X5xDOFwqrgoBFuESci7W4EBmdd2L/5 OKUmiRDvGy8uDZ9XWM0damyJAYqTPUSqklMOC0P2VWeeU9Oa2xATGJLCsWa26AammeB1WriYThzA IBRZnQ6RBgkMQYmpdBk3CxgXTSo2mwRG02De039Xwix+YICzFIx+EaN/xOgnueG7D0SDaYwiuTQT ROUU3LoPGETanCLLbnI4Jn0OmAQwFPlTAWPlgrV6oV6q1MM9x7Pnnw6gwOkCC2OEZOvhwqEN7Vkh GhhRsb/GlKKKwLC8qIGh/PJLiu0BGNK8AHGsns2/It2YwCDSVSw8M5sExky/7VtQtnOrBAx6HYnb SlXn2lAwf0MDVr7zquk6YfIMZOX3kJU+7pWqxFwXSmFJhbRTcfFDu9HAUF1DsLASP/Fsz/Z98Ffu gWo6d0lFwb6fPvXhbOnGKZLTAhawpoRXDrisI5Qe5sx0u/lBfRVlxbaBwSlpvMAgri1/SmCov/yu /QQxgYGEgFF0jjGUOs68XvTKHAGibJiwMDlJtVKVHzlY9faL5hRzY6r5pNu/LSujJ2DIIEocGEwz xnajlZZyk6eFU+eYOGEi60h4t3iAcWDvYXy2cZU+IM/PkscWAxQPPL7ubOnGKZTTBhaGTC+etnlT 2eBLO8JpNjB08ivoARjc1nW8HxsYln/r/5K1oEqXAobsp/uAkYCFoYdx43d+EB1KLXeGUklgMJCg YCsowPHyUpSsX2XemXXX92RAeAYG6HBdsjC6ARjUCA0JOXn+ihdg1Nc24JMVy0OfJ1DgdIMFLGAc GnypaGFIIxKegQEyjCaFEf3IYdyBAdKPDAwrXrikAyYNYbg2Rjrs9P3IUOpV5u+Vc18TwolhqDIS wDB67p+LDJUap7yfc/nVNCCka7gAIzrhSaHE3oEBGhgu8SrdlMAAWTY2jljAmPfSO+ERPeuTQMjp CgqcjrCACYzizZvKBt1vrlJNGBgQLAw5jAgMXfIjh1ED4wQckWj3kzDQi/MAo5nf+jdzVmVkKPUf CmCAgYw7MHZv+sA81d2Q2ff8kPkiU4BgrjUCGJLCgnDzCgww6Tn5lZs+crysG30eiZgmuLJRQ6oq YLz42KvB8/vWSnpnjHqczqDA6QoLRIAxZ2PZMAkY0tdXUjDWrLYu1WEcYNh3aSV0BYblrTtPPLOc WAuDV3BlHAIwJt30dfO3MZTa2lCvBgZUZbT8aVjy2hzz16UTp6Fw8HBCIRTAgAwMtR+1mxIYSoDI cbi6Ae7AkNL2DoyXHn8leE7BYWmJhTU8ejqDAqczLAyZOrX4qU1lw77HAoMcUo0JDEKhSGAISuMS RlY2N0WG5KZLfsR06DklpH9FOlYqF187zR5Knfv0w0Q4BciE+8tfecI8zd3oB7n2a9/iFJX8grPX mqzEZBiVm/1XobTiLE/Gj+YWr5RndpYnODdl2pZVQsYbuX7psZeDo/PVoDhdhkfd5LSGhSHXTS1+ ct2hYVM6QtFOT6mNDalSR5w8AMP+6zLLk1RkVpliDKkyeeDduniAEZUOsVeDlcot9/3I/Lt3ewl2 b1orhIsBDOjwN9Rgw/J3zVATr78dWfm9pE4/UvlFYGjWUKPTHJGaMWQ8zhYD3OniZBhIip0YMLq+ jsQo58uPvxAenV8ugcJY67G/NuuPnwdQ4PMAC0OmTytesams6NL2UFY4UvcTA4akZEIHqGYrXDzA AA0MXUhT6jshFp6R6cQAhtT0YcvkAMNYMj72sgmm6+p335StFSEfYlNp8Qv/iK7/GIorb7yLUBqP wAAkYMArMDxZGIQS23lziZfKI2lhuKRNAOPlx54Pjco7LOmZAQpzrUc3Hlx8okUqxOkqxijJxtL+ l5gWRkLAiDXLE1FgIAELgwCG5c/+q46jS8Bg0nb8yKNAxn/Fd95jD6V++J4ADKKpY5W9bOdm88gB QybeeAeTv3iBAUlB419HQvhXDGtScbgCg/urAkaMtBhgvPLYP8Oj8w9Lox7GMvOD9RlTTvVaj3jl cwMLQ2bOKN6yoXTQJXXt2cTmv7IS2mJBwjMwFE0SZToKYEjgIPoWKGCQ6cQAhhRG7mw1hlInTJ5m uq5fugCtjfUxgWH8XfjSk6bryLEXYfT4qxk/IJSGAYYkhNLFDQyh30McOpXyI8ehBIYENCef9CxP RVqmRfFseFReuaRfJRUFVTWtqeed6G37T4RIhTndxQDGlrLe/av9PWplYFhCK5h3YMj36YVnkJX7 hJx4xgLP8SM1SSD6kYEx6et3RYZSm5rw/r9ekcshAOOT5fPt9R833veTaPRu08IdxZEUX3Ud9xGJ vIJGfsoKK7nFBIZ72l6B8fKjz0hND6Mj8+PDBWseeHxd/1O1H0VX5XMHC0Snhu84kj9if/3AzbYS cXAArZgUMFhxmRYOCRhynGLzgwYG5DhIP2IZiDQkYIiLweh0Zt11r+lSsn4NaspLJUBY1/6G+si+ GADGTZgYPf9DHMa2RPzqswoWHzA0yp+r9aDo8PQEDLemhRxOnhbu+K2vqcfzf3s8OCq/nGt6WB2Z J/JowZMhn0tYIAqMC8bfeHFJ1fB3I/WXBYb1lScUjPkXuS1YFDGAQQJCeU0Bg1VsWUnpORjUtZMX NTCIvBunmV1yuT2UuvSNF0iLwrhm13/MvPeB6L0YxwtAkzoC4weGW7+HWrETA0ZsP6IbdR5JfU0d lr78XOjcXlXcqIdx/qjZP/E56shUyecWFpZcec30G9aUjrgvpCcT60gIYOiEhSGtI1EDw2kqsGEU iq1skqgVWQ0MEHE4bjQwxDBOOl/97g/Nq73bt0aHUnlgRNZ/rDavZt11f/RZUfn3tvCs6wcYyXCg 3Lq+UtUn+KHC8W67tmzDkpeeDbJTuI1mh7ED9w8fW5/1eeyfoORzDwtEhlafXrt/yEXWEne6UssK IwMDjh8mjBoYstLycTvx2dOplWHA5TfxE8+sa3cLw9im/3xrKPW9t6UDjJa9/nx0qLQIo8dfyTwr 8dlCyAtkZe42YETj1og0ug0YIPzI4ayyrF/+Afate08/q2e9bVHsPZ6j7zqW/dNTsQP3iZQvBCwQ 7fj85FCfXuVN/asgdXoSCiZUeh4YchgbGA4qSCWUgCE1SeS0pTgkYLhBRgSG94VnxXd8yx5KXTv/ bfu+YWlYW+V99f4HpSaKNDok5QWEoslKHfGmuoZHYNDpdQkYBBwkNwOo/5oXbjuwHNbq0ej6jqpa f+rwh57+8M/4gskXBhaI9mOcc/HN/XceG/qm6WB/9UBXaiUw6DAaFyYRYOgCMED44d10Nz+SklpQ 8rbwLCsvD5dPmmr+Xr90oT2UuvSNF023SydOQeHgIs7isPKeKDDkpoUCGJoIDBCKDlmJPQODvibz R7i99PAj4aTjH/usjWsMa8LoxPw8j3bEkpN+ItnJkvdXLLljbP/yF9NTAr6YXwr7mpmEI1VMJwx3 IphdkX0xKpjGrTFQ7p0gpeuTv3qSH/nrzZn8pMI46f7pB/eaQ6mXTpyM/F6FWPbWa6bF8eBfnkKm uQMWlTY7W5G4Z6dHwcTDeSSAfRi2xsBQ6pOi4qEALYGW7mAG2cx0/O3fuRsfvPt2+Py+NeYDNKwJ 4xRz43DiLyokLPnCwsKQ+QsWDx3aJ7hsaH75CHdF5oGhaaIfOYwDDMTxRSKAQSrySQAG05m366P1 eP2xh01AGGL0VRiHGl8x+2vSl5eC22kJDMGi6g5grHp3vt54cL3d7PjseG6guSPpL1+EkQ4v8oWG hSXvr1z654sHHXowSQsRCkMDA54sDHDX3obhutK29nUNGKAsmcj14//5E1QfPmz+7tG7ED/+85Pk maqegCHlBZIyegYGM5LU/cBQH4wsAuPlR/4e7JtUnmw0Ow43ZKG6OXVNIOQ7ZQf+nAr5UsDCkPcW LBo3sl/LkoG5Nb29KjIoYAhLoXXBLTYwoorGjdkT/jmlBHPtxcLgh/9cLYxovMcPl+HR//yZ6Xrr v/8Hxlz6FfM3DQwfDw9ppIN+lhIAYgIjzPzmgUGGodwYYHgewmbu7/joI2xYNj80tl9tktHkKK3P amjuSLr5izIcGo98aWBhyLz3Fub3zPU9PLZ/+V1JmlWJ3IFBNkkkYIh9GHI8kRsasxEshIVKoiKL p77zbhqZd8tNPsGLBoYXa6GrwPAJZaAVVhc7YgG+mdBtwHC3Jtg43nrmaT25aa/Z7NhaWRBsC2i/ +CKOcniVLxUsLFmwcPGFo/o3LeuXXdcz4kR/kb0Bg9kRSQSGpDyQO0KVwKAAwrvRwFDBIAYwFJvH 8MCQARETGFLHLxgF5fsMdGlyHGVteACGNN/FQ4cn42ffzk+x5t03guf1PpZs9EvUtqa88dDTa78h VaQvmXwpYWHJujWLHhtVWHl/enLAJ1fq7gKG/JWnAXIqgCFbE1Q6NjCsssQFDB+RFwiwEBRZqfgn Hhj/mvOE7mvcg5ZOH5rak9d+2fol3ORLDQtER0wGFYYXn9Xj8Ei5UncNGI4iq5RSVlIaGLG//LLJ T8SRIDDYZeDxA8OnyAsIC+PUAWP3J+uxfsl7QU3vSGoL+M5AgpAvPSwsWbJ06dfO6tP0bN/sumxe SXnFThwYKkB4sTCsOGhgOOlEp5QomlOsW5eAYYWJGxjg+2yisTlKHD7pwKitrsLCV54NVlQ3+DJS wq/qOn5zBhK0nIGFIMuWLf3fsQOPPpid2p7kCgyx4+6kAEPs9BQtDE1QSipdx+3kAcNH5I0CRlct jOhwJ+lPnsn6znNP6Tt27AvnpgdfO9MnEVvOwIIQY9SkVx4eHd33+J3pSYGIBwkYhEIxftyBoVJk sUniI9OW0o0qrsZdq/PGusmb0rrEYU5Yc5Tce5NEtXelAIwu9GFo7IgHCEAw4dYunIeVKzd0FmR0 zv3Zk6tvlWvAGaHkDCxcxOjP6FMQenJU72PXmRO6EgEGAwenqaAOI16fuGnhETfNR4/O0HH4uDzR Q6rEteZD7ElbECZJxQkMPcxP2oIMjM+2bcbrL74VSE/ufP/Xc1ZMU7/5M0LJGVh4EAMa/XuG54wq rJzkVPJ4ZnnGM2lLVqaTuo4kZjrxAoNJR1E+J265TwGuk7bYa2JaeDTcZ9u3YOWiZW2BQPvbP/3b 23edjDrzRZQzsIhDTGj00uaM6HlsUrIvoAaGoGyxJ22BViARGFKzgHATgSF9wel06DkYqnR8xByM UwwMqf8CqKuuwCvP/tMfDnXO/enf3jrTJ9FFOQOLBGTeewuH9MxL+e+RfY7ekZUSNHdHIpX5RFgY XoBhm/4ufsi+Ezj9C2Scct66DAwpXsgAiBMYwVAYnx1q/Kiiuv4XM2cUf+mmZZ8oOQOLLojREZqR lnz/0N5tvxiQW59LKjMHjEQtDLcREt6P6Nb9wJCbKDGBoQzTvcBo7whg5/7aBbV1zT+cNbP4zPBn N8sZWHSTLFi4+OaBvUK/GNar/qJkX9ip9C5DqrCAISkK6+Zj4nEBhrQGg2iSSGnRw6yuTRLFXI94 gSFPCxfKG43NCzCqj7X4Dx6pe6qxyf//jA2QTpc68UWTM7DoZjH6NfJykn40onfTd/PTW9PN2LsE DHloM/FJWwQsyHjcgEGM5ngChjwngwaGag6GOEJiNDVqtlZW1f9x6tQpb5yeteGLJWdgcQJl0eIl k/sU6D8f3KPpmqzUQFJ8wKAsgVjAUCuyDAzVXA/HjQYGla6o/BQwCGuDBIb7wrMj1fXN5ZX1f21u 9r9wpqlxcuUMLE6SLF6y9JaCbHxrQM+2KT0zWpM9A0MCiBswxKYPpHi6Bgy578ETMMhwVBgZGMat soraporqurmNTc0Pz545veRzWwk+53IGFqdA5i9YfFN+TvI3B/Rou7ZPjj+7e4EBVwtDE2CgTsfx owYGDSYZGHITxB0YPpQeqT1aebR+YXOL/x9nAHF6yBlYnGIxdvDKyUyd2Ts/fNeQno0jjBmHnpa2 s4CRgCH7kYFhXUMRphuB4WFaeFtHKFxW0VBSW9fyz6YW/8IbZs849IV96Z9TOQOL00wWL1k6OSsj aVZBVqi4d17HWTlp0bUpkiKrgEGZ/LKSysDw2iThR2fc0rHyJPdfAMfr2gPH61q3NjS3fdjib395 1oxpW740L/lzKmdgcZrLvPcWXpCZnnJZdgauys3ULy3MDYzISQ+SSuosPPMCjJO38KwtEELF0dYD jc2dHzX729e2tnVsuGH2jK1f4tf6uZQzsPgcitF0SUtJPjsnK+nqjNTw6Ox0bWhaSmBAYW442bMi u87BAA0MzSf0LTjpBEMaGv0BtLaHD7e0ho61dYY+8bd2rmlt69h9ps/hiyFnYPEFE8MSSU1J6pWS 7DtL0zAsKyM5O8mnj81KQ2F6ajjDUPLUFK2Pz4dkZ1EYGOUXLBAAbR16hfErrGvh5rZQS2dQW9vW HvIHg+Ga9s7ApmAwFLph9ozVX/Zn/4UWAP8fYUz71H+MLL4AAAAASUVORK5CYII= "
       id="image843"
       x="3.7496738"
       y="1.1038303" />
    <g
       id="g1456"
       transform="matrix(1.3822634,0,0,1.3822634,299.28193,65.738323)" />
  </g>
</svg>
