{
  "node": {
    "width": 200.0,
    "height": 200.0,
    "edge": {
      "width": 25.0,
      "height": 25.0
    },
    "text_color": {
      "red": 1.0,
      "green": 1.0,
      "blue": 1.0,
      "opacity": 1.0
    },
    "top_height": 35.0,
    "top_color": {
      "red": 0.52,
      "green": 0.75,
      "blue": 0.13,
      "opacity": 1.0
    },
    "bottom_color": {
      "red": 0.3529412,
      "green": 0.3529412,
      "blue": 0.3529412,
      "opacity": 1.0
    },
    "port_side_color": {
      "red": 0.27450982,
      "green": 0.27450982,
      "blue": 0.27450982,
      "opacity": 1.0
    },
    "selected_color": {
      "red": 0.95686275,
      "green": 0.6745098,
      "blue": 0.19215687,
      "opacity": 1.0
    },
    "outline_color": {
      "red": 0.16470589,
      "green": 0.16470589,
      "blue": 0.16470589,
      "opacity": 1.0
    },
    "collapsed": {
      "color": {
        "red": 0.0,
        "green": 0.0,
        "blue": 0.0,
        "opacity": 1.0
      },
      "width": 150.0,
      "height": 50.0
    },
    "node_shadow": {
      "use_shadow": false,
      "shadow_color": {
        "red": 0.1,
        "green": 0.1,
        "blue": 0.1,
        "opacity": 1.0
      },
      "shadow_width": 1.0,
      "shadow_height": 1.0,
      "shadow_offset_x": 1.0,
      "shadow_offset_y": 1.0,
      "shadow_radius": 10.0
    }
  },
  "port": {
    "input": {
      "color": {
        "red": 0.4,
        "green": 0.49803922,
        "blue": 0.8,
        "opacity": 1.0
      },
      "text_color": {
        "red": 1.0,
        "green": 1.0,
        "blue": 1.0,
        "opacity": 1.0
      },
      "offset_x": 0.0,
      "offset_y": 0.0,
      "size": 5.0
    },
    "output": {
      "color": {
        "red": 1.0,
        "green": 0.3,
        "blue": 0.3,
        "opacity": 1.0
      },
      "text_color": {
        "red": 1.0,
        "green": 1.0,
        "blue": 1.0,
        "opacity": 1.0
      },
      "offset_x": 0.0,
      "offset_y": 0.0,
      "size": 5.0
    },
    "port_offset_y": 50.0
  },
  "signal": {
    "color_default": {
      "red": 1.0,
      "green": 1.0,
      "blue": 1.0,
      "opacity": 1.0
    },
    "color_con_fail": {
      "red": 1.0,
      "green": 0.0,
      "blue": 0.0,
      "opacity": 1.0
    },
    "color_con_success": {
      "red": 0.0,
      "green": 0.5019608,
      "blue": 0.0,
      "opacity": 1.0
    },
    "signal_width": 1.0,
    "signal_shadow": {
      "use_shadow": false,
      "shadow_color": {
        "red": 0.1,
        "green": 0.1,
        "blue": 0.1,
        "opacity": 1.0
      },
      "shadow_width": 1.0,
      "shadow_height": 1.0,
      "shadow_offset_x": 1.0,
      "shadow_offset_y": 1.0,
      "shadow_radius": 10.0
    }
  }
}