{
	"credit": "Made with Blockbench",
	"textures": {
		"top": "hypersomnia:blocks/bed_feet_top",
		"particle": "hypersomnia:blocks/bed_feet_top",
		"bottom": "minecraft:blocks/planks_oak"
	},
	"elements": [
		{
			"from": [13, 5, 0],
			"to": [16, 9, 3],
			"faces": {
				"north": {"uv": [0, 0, 3, 4], "texture": "#bottom"},
				"east": {"uv": [0, 0, 3, 4], "texture": "#bottom"},
				"south": {"uv": [0, 0, 3, 4], "texture": "#bottom"},
				"west": {"uv": [0, 0, 3, 4], "texture": "#bottom"},
				"up": {"uv": [0, 0, 3, 3], "rotation": 90, "texture": "#bottom"},
				"down": {"uv": [0, 0, 3, 3], "rotation": 270, "texture": "#missing"}
			}
		},
		{
			"from": [0, 5, 0],
			"to": [3, 9, 3],
			"faces": {
				"north": {"uv": [0, 0, 3, 4], "texture": "#bottom"},
				"east": {"uv": [0, 0, 3, 4], "texture": "#bottom"},
				"south": {"uv": [0, 0, 3, 4], "texture": "#bottom"},
				"west": {"uv": [0, 0, 3, 4], "texture": "#bottom"},
				"up": {"uv": [0, 0, 3, 3], "rotation": 90, "texture": "#bottom"},
				"down": {"uv": [0, 0, 3, 3], "rotation": 270, "texture": "#missing"}
			}
		},
		{
			"from": [13, 0, 0],
			"to": [15, 4, 1],
			"faces": {
				"north": {"uv": [0, 0, 2, 4], "texture": "#bottom"},
				"east": {"uv": [0, 0, 1, 4], "texture": "#missing"},
				"south": {"uv": [0, 0, 2, 4], "texture": "#bottom"},
				"west": {"uv": [0, 0, 1, 4], "texture": "#bottom"},
				"up": {"uv": [0, 0, 1, 2], "rotation": 90, "texture": "#missing"},
				"down": {"uv": [0, 0, 1, 2], "rotation": 270, "texture": "#bottom"}
			}
		},
		{
			"from": [15, 0, 0],
			"to": [16, 4, 1],
			"faces": {
				"north": {"uv": [0, 0, 1, 4], "texture": "#bottom"},
				"east": {"uv": [0, 0, 1, 4], "texture": "#bottom"},
				"south": {"uv": [0, 0, 1, 4], "texture": "#missing"},
				"west": {"uv": [0, 0, 1, 4], "texture": "#missing"},
				"up": {"uv": [0, 0, 1, 1], "rotation": 90, "texture": "#missing"},
				"down": {"uv": [0, 0, 1, 1], "rotation": 270, "texture": "#bottom"}
			}
		},
		{
			"from": [15, 0, 1],
			"to": [16, 4, 3],
			"faces": {
				"north": {"uv": [0, 0, 1, 4], "texture": "#missing"},
				"east": {"uv": [0, 0, 2, 4], "texture": "#bottom"},
				"south": {"uv": [0, 0, 1, 4], "texture": "#bottom"},
				"west": {"uv": [0, 0, 2, 4], "texture": "#bottom"},
				"up": {"uv": [0, 0, 2, 1], "rotation": 90, "texture": "#missing"},
				"down": {"uv": [0, 0, 2, 1], "rotation": 270, "texture": "#bottom"}
			}
		},
		{
			"from": [0, 0, 1],
			"to": [1, 4, 3],
			"faces": {
				"north": {"uv": [0, 0, 1, 4], "texture": "#missing"},
				"east": {"uv": [0, 0, 2, 4], "texture": "#bottom"},
				"south": {"uv": [0, 0, 1, 4], "texture": "#bottom"},
				"west": {"uv": [0, 0, 2, 4], "texture": "#bottom"},
				"up": {"uv": [0, 0, 1, 2], "texture": "#missing"},
				"down": {"uv": [0, 0, 1, 2], "texture": "#bottom"}
			}
		},
		{
			"from": [0, 0, 0],
			"to": [1, 4, 1],
			"faces": {
				"north": {"uv": [0, 0, 1, 4], "texture": "#bottom"},
				"east": {"uv": [0, 0, 1, 4], "texture": "#missing"},
				"south": {"uv": [0, 0, 1, 4], "texture": "#missing"},
				"west": {"uv": [0, 0, 1, 4], "texture": "#bottom"},
				"up": {"uv": [0, 0, 1, 1], "texture": "#missing"},
				"down": {"uv": [0, 0, 1, 1], "texture": "#bottom"}
			}
		},
		{
			"from": [1, 0, 0],
			"to": [3, 4, 1],
			"faces": {
				"north": {"uv": [0, 0, 2, 4], "texture": "#bottom"},
				"east": {"uv": [0, 0, 1, 4], "texture": "#bottom"},
				"south": {"uv": [0, 0, 2, 4], "texture": "#bottom"},
				"west": {"uv": [0, 0, 1, 4], "texture": "#missing"},
				"up": {"uv": [0, 0, 2, 1], "texture": "#missing"},
				"down": {"uv": [0, 0, 2, 1], "texture": "#bottom"}
			}
		},
		{
			"from": [0.5, 6, 3.5],
			"to": [15.5, 7, 16],
			"faces": {
				"north": {"uv": [0, 0, 11, 1], "texture": "#top"},
				"east": {"uv": [3.5, 8, 16, 9], "texture": "#top"},
				"south": {"uv": [0, 0, 11, 1], "texture": "#top"},
				"west": {"uv": [0, 0, 12.5, 1], "texture": "#top"},
				"up": {"uv": [0, 0, 15, 12.5], "texture": "#top"},
				"down": {"uv": [0, 0, 11, 12.5], "texture": "#bottom"}
			}
		},
		{
			"from": [0, 4, 3],
			"to": [16, 6, 16],
			"faces": {
				"north": {"uv": [0, 0, 16, 2], "texture": "#top"},
				"east": {"uv": [0, 0, 13, 2], "texture": "#bottom"},
				"south": {"uv": [0, 0, 16, 2], "texture": "#bottom"},
				"west": {"uv": [0, 0, 13, 2], "texture": "#bottom"},
				"up": {"uv": [0, 0, 16, 13], "texture": "#top"},
				"down": {"uv": [0, 0, 16, 13], "texture": "#bottom"}
			}
		},
		{
			"from": [0, 4, 0],
			"to": [16, 5, 3],
			"faces": {
				"north": {"uv": [0, 0, 16, 1], "texture": "#bottom"},
				"east": {"uv": [0, 0, 3, 1], "texture": "#bottom"},
				"south": {"uv": [0, 0, 16, 1], "texture": "#missing"},
				"west": {"uv": [0, 0, 3, 1], "texture": "#bottom"},
				"up": {"uv": [0, 0, 16, 3], "texture": "#bottom"},
				"down": {"uv": [0, 0, 16, 3], "texture": "#bottom"}
			}
		},
		{
			"from": [3, 8, 0],
			"to": [13, 9, 3],
			"faces": {
				"north": {"uv": [0, 0, 10, 1], "texture": "#bottom"},
				"east": {"uv": [0, 0, 3, 1], "texture": "#missing"},
				"south": {"uv": [0, 0, 10, 1], "texture": "#bottom"},
				"west": {"uv": [0, 0, 3, 1], "texture": "#missing"},
				"up": {"uv": [0, 0, 10, 3], "texture": "#bottom"},
				"down": {"uv": [0, 0, 10, 3], "texture": "#bottom"}
			}
		}
	],
	"groups": [
		{
			"name": "DayBed",
			"children": [
				{
					"name": "foot_left",
					"children": [0, 1]
				},
				{
					"name": "foot_left",
					"children": [2, 3, 4]
				},
				{
					"name": "foot_right",
					"children": [5, 6, 7]
				},
				{
					"name": "blanket",
					"children": [8]
				},
				{
					"name": "bed",
					"children": [9]
				}
			]
		}, 10, 11]
}