{
  "applications": "*",
  "changelogDate": "20230324092602",
  "dto": "mapstruct",
  "embedded": false,
  "entityTableName": "course",
  "fields": [],
  "fluentMethods": true,
  "jpaMetamodelFiltering": false,
  "name": "Course",
  "pagination": "infinite-scroll",
  "readOnly": false,
  "relationships": [
    {
      "otherEntityName": "utilisateur",
      "otherEntityRelationshipName": "course",
      "relationshipName": "utilisateur",
      "relationshipType": "one-to-many"
    }
  ],
  "service": "serviceImpl"
}
