{
	"credit": "Made with Blockbench",
	"textures": {
		"1": "railway/rail_redstone_activated",
		"1_1": "railway/rail_iron_light",
		"1_2": "railway/rail_iron_dark",
		"1_0": "railway/rail_block",
		"particle": "railway/rail_block"
	},
	"elements": [
		{
			"from": [17, 1, 0],
			"to": [18.999, 4, 16],
			"rotation": {"angle": 0, "axis": "x", "origin": [17.5, 8, 8]},
			"faces": {
				"north": {"uv": [2, 13, 3.999, 16], "texture": "#1_1"},
				"east": {"uv": [0, 0, 16, 3], "texture": "#1_1"},
				"south": {"uv": [13, 13, 14.999, 16], "texture": "#1_1"},
				"west": {"uv": [0, 13, 16, 16], "texture": "#1_1"},
				"up": {"uv": [8.5, 0, 10.499, 16], "texture": "#1_1"},
				"down": {"uv": [13, 0, 14.999, 16], "texture": "#1_1"}
			}
		},
		{
			"from": [-1, 1, 0],
			"to": [-0.001, 2, 16],
			"rotation": {"angle": 0, "axis": "x", "origin": [-0.5, 8, 8]},
			"faces": {
				"north": {"uv": [12, 14.5, 12.999, 15.5], "texture": "#1_2"},
				"east": {"uv": [0, 15, 16, 16], "texture": "#1_2"},
				"south": {"uv": [3, 14.5, 3.999, 15.5], "texture": "#1_2"},
				"west": {"uv": [0, 14.5, 16, 15.5], "texture": "#1_2"},
				"up": {"uv": [3, 0, 3.999, 16], "texture": "#1_2"},
				"down": {"uv": [3, 0, 3.999, 16], "texture": "#1_2"}
			}
		},
		{
			"from": [16.001, 1, 0],
			"to": [17, 2, 16],
			"rotation": {"angle": 0, "axis": "x", "origin": [16.501, 8, 8]},
			"faces": {
				"north": {"uv": [3, 14.5, 3.999, 15.5], "texture": "#1_2"},
				"east": {"uv": [0, 15, 16, 16], "texture": "#1_2"},
				"south": {"uv": [12, 14.5, 12.999, 15.5], "texture": "#1_2"},
				"west": {"uv": [0, 14.5, 16, 15.5], "texture": "#1_2"},
				"up": {"uv": [12, 0, 12.999, 16], "texture": "#1_2"},
				"down": {"uv": [12, 0, 12.999, 16], "texture": "#1_2"}
			}
		},
		{
			"from": [-2.999, 1, 0],
			"to": [-1, 4, 16],
			"rotation": {"angle": 0, "axis": "x", "origin": [-1.499, 8, 8]},
			"faces": {
				"north": {"uv": [13, 13, 14.999, 16], "texture": "#1_1"},
				"east": {"uv": [0, 0, 16, 3], "texture": "#1_1"},
				"south": {"uv": [2, 13, 3.999, 16], "texture": "#1_1"},
				"west": {"uv": [0, 13, 16, 16], "texture": "#1_1"},
				"up": {"uv": [8.5, 0, 10.499, 16], "texture": "#1_1"},
				"down": {"uv": [2, 0, 3.999, 16], "texture": "#1_1"}
			}
		},
		{
			"from": [20, 0.25, 6.75],
			"to": [21, 2.25, 8.25],
			"faces": {
				"north": {"uv": [0, 0, 1, 2], "texture": "#1_2"},
				"east": {"uv": [5, 3, 6.5, 5], "texture": "#1_2"},
				"south": {"uv": [0, 0, 1, 2], "texture": "#1_2"},
				"west": {"uv": [0, 0, 1.5, 2], "texture": "#1_2"},
				"up": {"uv": [6.5, 5, 7.5, 6.5], "texture": "#1_2", "rotation": 180},
				"down": {"uv": [0, 0, 1, 1.5], "texture": "#1_2", "rotation": 180}
			}
		},
		{
			"from": [19, 1.25, 6.75],
			"to": [20, 2.25, 8.25],
			"faces": {
				"north": {"uv": [0, 0, 1, 1], "texture": "#1_2"},
				"east": {"uv": [0, 0, 1.5, 1], "texture": "#1_2"},
				"south": {"uv": [0, 0, 1, 1], "texture": "#1_2"},
				"west": {"uv": [0, 0, 1.5, 1], "texture": "#1_2"},
				"up": {"uv": [0, 0, 1, 1.5], "texture": "#1_2", "rotation": 180},
				"down": {"uv": [0, 0, 1, 1.5], "texture": "#1_2", "rotation": 180}
			}
		},
		{
			"from": [-5, 0.25, 6.75],
			"to": [-4, 2.25, 8.25],
			"faces": {
				"north": {"uv": [0, 0, 1, 2], "texture": "#1_2"},
				"east": {"uv": [0, 0, 1.5, 2], "texture": "#1_2"},
				"south": {"uv": [0, 0, 1, 2], "texture": "#1_2"},
				"west": {"uv": [0, 0, 1.5, 2], "texture": "#1_2"},
				"up": {"uv": [0, 0, 1, 1.5], "texture": "#1_2"},
				"down": {"uv": [0, 0, 1, 1.5], "texture": "#1_2"}
			}
		},
		{
			"from": [-4, 1.25, 6.75],
			"to": [-3, 2.25, 8.25],
			"faces": {
				"north": {"uv": [0, 0, 1, 1], "texture": "#1_2"},
				"east": {"uv": [0, 0, 1.5, 1], "texture": "#1_2"},
				"south": {"uv": [0, 0, 1, 1], "texture": "#1_2"},
				"west": {"uv": [0, 0, 1.5, 1], "texture": "#1_2"},
				"up": {"uv": [0, 0, 1, 1.5], "texture": "#1_2"},
				"down": {"uv": [0, 0, 1, 1.5], "texture": "#1_2"}
			}
		},
		{
			"name": "wood_block",
			"from": [-12, 0.75, 5],
			"to": [-8, 2, 10],
			"rotation": {"angle": 0, "axis": "x", "origin": [8, 10.75, 12]},
			"faces": {
				"north": {"uv": [0, 0, 4, 1.25], "texture": "#1_0"},
				"east": {"uv": [0, 0, 7, 1.25], "texture": "#1_0"},
				"south": {"uv": [0, 0, 4, 1.25], "texture": "#1_0"},
				"west": {"uv": [1, 15, 3, 16], "texture": "#1_0"},
				"up": {"uv": [0, 0, 4, 7], "texture": "#1_0"},
				"down": {"uv": [1, 13, 15, 15], "texture": "#1_0", "cullface": "down"}
			}
		},
		{
			"name": "wood_block",
			"from": [-12, -0.25, 5],
			"to": [28, 1, 10],
			"rotation": {"angle": 0, "axis": "x", "origin": [8, 9.75, 12]},
			"faces": {
				"north": {"uv": [0, 0, 16, 1.5], "texture": "#1_0"},
				"east": {"uv": [15, 16, 13, 15], "texture": "#1_0"},
				"south": {"uv": [1, 14.5, 15.5, 16], "texture": "#1_0"},
				"west": {"uv": [1, 15, 3, 16], "texture": "#1_0"},
				"up": {"uv": [0, 0, 16, 3.5], "texture": "#1_0"},
				"down": {"uv": [1, 13, 15, 15], "texture": "#1_0", "cullface": "down"}
			}
		},
		{
			"name": "wood_block",
			"from": [24, 0.75, 5],
			"to": [28, 2, 10],
			"rotation": {"angle": 0, "axis": "x", "origin": [8, 10.75, 12]},
			"faces": {
				"north": {"uv": [0, 0, 4, 1.25], "texture": "#1_0"},
				"east": {"uv": [3, 15, 1, 16], "texture": "#1_0"},
				"south": {"uv": [0, 0, 4, 1.25], "texture": "#1_0"},
				"west": {"uv": [0, 0, 7, 1.25], "texture": "#1_0"},
				"up": {"uv": [4, 0, 0, 7], "texture": "#1_0"},
				"down": {"uv": [15, 13, 1, 15], "texture": "#1_0", "cullface": "down"}
			}
		},
		{
			"name": "wood_block",
			"from": [22, 0.25, 5],
			"to": [26, 1.5, 10],
			"rotation": {"angle": 0, "axis": "x", "origin": [6, 10.25, 12]},
			"faces": {
				"north": {"uv": [0, 0, 4, 1.25], "texture": "#1_0"},
				"east": {"uv": [3, 15, 1, 16], "texture": "#1_0"},
				"south": {"uv": [0, 0, 4, 1.25], "texture": "#1_0"},
				"west": {"uv": [0, 0, 7, 1.25], "texture": "#1_0"},
				"up": {"uv": [4, 0, 0, 7], "texture": "#1_0"},
				"down": {"uv": [15, 13, 1, 15], "texture": "#1_0", "cullface": "down"}
			}
		},
		{
			"name": "wood_block",
			"from": [-10, 0.25, 5],
			"to": [-6, 1.5, 10],
			"rotation": {"angle": 0, "axis": "x", "origin": [10, 10.25, 12]},
			"faces": {
				"north": {"uv": [4, 0, 0, 1.25], "texture": "#1_0"},
				"east": {"uv": [7, 0, 0, 1.25], "texture": "#1_0"},
				"south": {"uv": [4, 0, 0, 1.25], "texture": "#1_0"},
				"west": {"uv": [1, 15, 3, 16], "texture": "#1_0"},
				"up": {"uv": [0, 0, 4, 7], "texture": "#1_0"},
				"down": {"uv": [1, 13, 15, 15], "texture": "#1_0", "cullface": "down"}
			}
		},
		{
			"name": "detector_base",
			"from": [3.5, 1, 3],
			"to": [12.5, 2, 12],
			"faces": {
				"north": {"uv": [0, 0, 9, 1], "texture": "#1"},
				"east": {"uv": [0, 0, 9, 1], "texture": "#1"},
				"south": {"uv": [0, 0, 9, 1], "texture": "#1"},
				"west": {"uv": [0, 0, 9, 1], "texture": "#1"},
				"up": {"uv": [0, 0, 9, 9], "texture": "#1"},
				"down": {"uv": [0, 0, 9, 9], "texture": "#1"}
			}
		},
		{
			"name": "detector",
			"from": [5, 1.25, 4.5],
			"to": [11, 2.25, 10.5],
			"faces": {
				"north": {"uv": [0, 0, 6, 1], "texture": "#1_1"},
				"east": {"uv": [0, 0, 6, 1], "texture": "#1_1"},
				"south": {"uv": [0, 0, 6, 1], "texture": "#1_1"},
				"west": {"uv": [0, 0, 6, 1], "texture": "#1_1"},
				"up": {"uv": [0, 0, 6, 6], "texture": "#1_1"},
				"down": {"uv": [0, 0, 6, 6], "texture": "#1_1"}
			}
		}
	],
	"groups": [
		{
			"name": "rail",
			"isOpen": true,
			"shade": true,
			"display": {
				"visibility": true,
				"autouv": true
			},
			"children": [0, 1, 2, 3]
		},
		{
			"name": "rail_holders",
			"isOpen": true,
			"shade": true,
			"display": {
				"visibility": true,
				"autouv": true
			},
			"children": [
				{
					"name": "rail_holder",
					"isOpen": false,
					"shade": true,
					"display": {
						"visibility": true,
						"autouv": true
					},
					"children": [4, 5]
				},
				{
					"name": "rail_holder",
					"isOpen": false,
					"shade": true,
					"display": {
						"visibility": true,
						"autouv": true
					},
					"children": [6, 7]
				}
			]
		},
		{
			"name": "rail_block",
			"shade": true,
			"display": {
				"visibility": true,
				"autouv": true
			},
			"children": [
				{
					"name": "rail_block",
					"isOpen": false,
					"shade": true,
					"display": {
						"visibility": true,
						"autouv": true
					},
					"children": [8, 9, 10, 11, 12]
				}
			]
		},
		{
			"name": "detector",
			"isOpen": false,
			"shade": true,
			"display": {
				"visibility": true,
				"autouv": true
			},
			"children": [13, 14]
		}
	]
}