{
  "parent": "item/handheld",
  "textures": {
    "layer0": "items/gold_sword"
  },
  "overrides": [
    {
      "predicate": { "damaged": 0, "damage": 0 },
      "model": "item/golden_sword"
    },
    {
      "predicate": { "damaged": 0, "damage": 0.03125 },
      "model": "item/misc/megumin"
    },
    {
      "predicate": { "damaged": 1, "damage": 0 },
      "model": "item/golden_sword"
    }
  ]
}
