{
	"credit": "Made with Blockbench, a free, modern block model editor by JannisX11",
	"textures": {
		"0": "blocks/hardened_clay_stained_white",
		"1": "blocks/concrete_blue",
		"2": "blocks/concrete_red",
		"3": "blocks/concrete_white",
		"4": "blocks/concrete_silver",
		"5": "blocks/shulker_top_silver",
		"6": "blocks/glass",
		"7": "blocks/concrete_gray",
		"particle": "blocks/hardened_clay_stained_white"
	},
	"elements": [
		{
			"from": [29, -13, 12],
			"to": [32, -7, 32],
			"faces": {
				"north": {"uv": [0, 0, 1.5, 3], "texture": "#1"},
				"east": {"uv": [0, 0, 14, 3], "texture": "#1"},
				"south": {"uv": [0, 0, 1.5, 3], "texture": "#1"},
				"west": {"uv": [0, 0, 14, 3], "texture": "#7"},
				"up": {"uv": [0, 0, 1.5, 14], "texture": "#1"},
				"down": {"uv": [0, 0, 1.5, 14], "texture": "#1"}
			}
		},
		{
			"from": [29, -7, 12],
			"to": [32, -6, 32],
			"faces": {
				"north": {"uv": [0, 0, 1.5, 0.5], "texture": "#3"},
				"east": {"uv": [0, 0, 14, 0.5], "texture": "#3"},
				"south": {"uv": [0, 0, 1.5, 0.5], "texture": "#3"},
				"west": {"uv": [0, 0, 14, 0.5], "texture": "#7"},
				"up": {"uv": [0, 0, 1.5, 14], "texture": "#3"},
				"down": {"uv": [0, 0, 1.5, 14], "texture": "#3"}
			}
		},
		{
			"from": [29, -6, 12],
			"to": [32, 4, 32],
			"faces": {
				"north": {"uv": [0, 0, 1.5, 5], "texture": "#2"},
				"east": {"uv": [0, 0, 14, 5], "texture": "#2"},
				"south": {"uv": [0, 0, 1.5, 5], "texture": "#2"},
				"west": {"uv": [0, 0, 14, 5], "texture": "#7"},
				"up": {"uv": [0, 0, 1.5, 14], "texture": "#2"},
				"down": {"uv": [0, 0, 1.5, 14], "texture": "#2"}
			}
		},
		{
			"from": [25, -6, 12],
			"to": [32, 32, 16],
			"faces": {
				"north": {"uv": [0, 0, 1.5, 14], "texture": "#2"},
				"east": {"uv": [0, 0, 2, 14], "texture": "#2"},
				"south": {"uv": [0, 0, 1.5, 14], "texture": "#7"},
				"west": {"uv": [0, 0, 2, 14], "texture": "#2"},
				"up": {"uv": [0, 0, 1.5, 2], "texture": "#2"},
				"down": {"uv": [0, 0, 1.5, 2], "texture": "#2"}
			}
		},
		{
			"from": [-16, -14, 12],
			"to": [32, -13, 32],
			"faces": {
				"north": {"uv": [0, 0, 16, 0.5], "texture": "#4"},
				"east": {"uv": [0, 0, 14, 0.5], "texture": "#4"},
				"south": {"uv": [0, 0, 16, 0.5], "texture": "#4"},
				"west": {"uv": [0, 0, 14, 0.5], "texture": "#4"},
				"up": {"uv": [0, 0, 16, 14], "texture": "#0"},
				"down": {"uv": [0, 0, 16, 14], "texture": "#4"}
			}
		},
		{
			"from": [-16, -7, 12],
			"to": [-13, -6, 32],
			"faces": {
				"north": {"uv": [0, 0, 1.5, 0.5], "texture": "#3"},
				"east": {"uv": [0, 0, 14, 0.5], "texture": "#7"},
				"south": {"uv": [0, 0, 1.5, 0.5], "texture": "#3"},
				"west": {"uv": [0, 0, 14, 0.5], "texture": "#3"},
				"up": {"uv": [0, 0, 1.5, 14], "texture": "#3"},
				"down": {"uv": [0, 0, 1.5, 14], "texture": "#3"}
			}
		},
		{
			"from": [-16, -13, 12],
			"to": [-13, -7, 32],
			"faces": {
				"north": {"uv": [0, 0, 1.5, 3], "texture": "#1"},
				"east": {"uv": [0, 0, 14, 3], "texture": "#7"},
				"south": {"uv": [0, 0, 1.5, 3], "texture": "#1"},
				"west": {"uv": [0, 0, 14, 3], "texture": "#1"},
				"up": {"uv": [0, 0, 1.5, 14], "texture": "#1"},
				"down": {"uv": [0, 0, 1.5, 14], "texture": "#1"}
			}
		},
		{
			"from": [-16, -6, 12],
			"to": [-13, 4, 32],
			"faces": {
				"north": {"uv": [0, 0, 1.5, 5], "texture": "#2"},
				"east": {"uv": [0, 0, 14, 5], "texture": "#7"},
				"south": {"uv": [0, 0, 1.5, 5], "texture": "#2"},
				"west": {"uv": [0, 0, 14, 5], "texture": "#2"},
				"up": {"uv": [0, 0, 1.5, 14], "texture": "#2"},
				"down": {"uv": [0, 0, 1.5, 14], "texture": "#2"}
			}
		},
		{
			"from": [15, -13, 16],
			"to": [29, 2, 32],
			"faces": {
				"north": {"uv": [0, 0, 7, 7.5], "texture": "#4"},
				"east": {"uv": [0, 0, 8, 7.5], "texture": "#4"},
				"south": {"uv": [0, 0, 7, 7.5], "texture": "#4"},
				"west": {"uv": [0, 0, 8, 7.5], "texture": "#4"},
				"up": {"uv": [7, 8, 14, 16], "texture": "#4"},
				"down": {"uv": [7, 8, 14, 16], "texture": "#4"}
			}
		},
		{
			"from": [16, 2, 18],
			"to": [28, 3, 31],
			"faces": {
				"north": {"uv": [0, 0, 6, 0.5], "texture": "#5"},
				"east": {"uv": [0, 0, 6.5, 0.5], "texture": "#5"},
				"south": {"uv": [0, 0, 6, 0.5], "texture": "#5"},
				"west": {"uv": [0, 0, 6.5, 0.5], "texture": "#5"},
				"up": {"uv": [0, 0, 16, 16], "texture": "#5"},
				"down": {"uv": [6, 7, 12, 13.5], "texture": "#5"}
			}
		},
		{
			"from": [16, 4, 17],
			"to": [28, 10, 18],
			"faces": {
				"north": {"uv": [0, 0, 6, 2.5], "texture": "#5"},
				"east": {"uv": [0, 0, 0.5, 2.5], "texture": "#5"},
				"south": {"uv": [0, 0, 16, 16], "texture": "#5"},
				"west": {"uv": [0, 0, 0.5, 2.5], "texture": "#5"},
				"up": {"uv": [7, 0.5, 13, 1], "texture": "#5"},
				"down": {"uv": [7, 0.5, 13, 1], "texture": "#5"}
			}
		},
		{
			"from": [-13, -13, 16],
			"to": [1, 2, 32],
			"faces": {
				"north": {"uv": [0, 0, 7, 7.5], "texture": "#4"},
				"east": {"uv": [0, 0, 8, 7.5], "texture": "#4"},
				"south": {"uv": [0, 0, 7, 7.5], "texture": "#4"},
				"west": {"uv": [0, 0, 8, 7.5], "texture": "#4"},
				"up": {"uv": [7, 8, 14, 16], "texture": "#4"},
				"down": {"uv": [7, 8, 14, 16], "texture": "#4"}
			}
		},
		{
			"from": [-12, 2, 18],
			"to": [0, 3, 31],
			"faces": {
				"north": {"uv": [0, 0, 6, 0.5], "texture": "#5"},
				"east": {"uv": [0, 0, 6.5, 0.5], "texture": "#5"},
				"south": {"uv": [0, 0, 6, 0.5], "texture": "#5"},
				"west": {"uv": [0, 0, 6.5, 0.5], "texture": "#5"},
				"up": {"uv": [0, 0, 16, 16], "texture": "#5"},
				"down": {"uv": [6, 7, 12, 13.5], "texture": "#5"}
			}
		},
		{
			"from": [-12, 4, 17],
			"to": [0, 10, 18],
			"faces": {
				"north": {"uv": [7, 0, 13, 2.5], "texture": "#5"},
				"east": {"uv": [8, 0, 8.5, 2.5], "texture": "#5"},
				"south": {"uv": [0, 0, 16, 16], "texture": "#5"},
				"west": {"uv": [8, 0, 8.5, 2.5], "texture": "#5"},
				"up": {"uv": [10, 0.5, 16, 1], "texture": "#5"},
				"down": {"uv": [10, 0.5, 16, 1], "texture": "#5"}
			}
		},
		{
			"from": [-13, 2, 16],
			"to": [1, 11, 17],
			"faces": {
				"north": {"uv": [7, 0, 14, 4.5], "texture": "#4"},
				"east": {"uv": [8, 0, 8.5, 4.5], "texture": "#4"},
				"south": {"uv": [7, 0, 14, 4.5], "texture": "#4"},
				"west": {"uv": [8, 0, 8.5, 4.5], "texture": "#4"},
				"up": {"uv": [9, 0.5, 16, 1], "texture": "#4"},
				"down": {"uv": [9, 0.5, 16, 1], "texture": "#4"}
			}
		},
		{
			"from": [15, 2, 16],
			"to": [29, 11, 17],
			"faces": {
				"north": {"uv": [7, 0, 14, 4.5], "texture": "#4"},
				"east": {"uv": [8, 0, 8.5, 4.5], "texture": "#4"},
				"south": {"uv": [7, 0, 14, 4.5], "texture": "#4"},
				"west": {"uv": [8, 0, 8.5, 4.5], "texture": "#4"},
				"up": {"uv": [9, 0.5, 16, 1], "texture": "#4"},
				"down": {"uv": [9, 0.5, 16, 1], "texture": "#4"}
			}
		},
		{
			"from": [-16, -6, 12],
			"to": [-9, 32, 16],
			"faces": {
				"north": {"uv": [0, 0, 3.5, 16], "texture": "#2"},
				"east": {"uv": [0, 0, 2, 16], "texture": "#2"},
				"south": {"uv": [0, 0, 3.5, 16], "texture": "#7"},
				"west": {"uv": [0, 0, 2, 16], "texture": "#2"},
				"up": {"uv": [0, 0, 3.5, 2], "texture": "#2"},
				"down": {"uv": [0, 0, 3.5, 2], "texture": "#2"}
			}
		},
		{
			"from": [-16, -7, 12],
			"to": [31, -6, 16],
			"faces": {
				"north": {"uv": [0, 0, 16, 0.5], "texture": "#3"},
				"east": {"uv": [0, 0, 2, 0.5], "texture": "#3"},
				"south": {"uv": [0, 0, 16, 0.5], "texture": "#7"},
				"west": {"uv": [0, 0, 2, 0.5], "texture": "#3"},
				"up": {"uv": [0, 0, 16, 2], "texture": "#3"},
				"down": {"uv": [0, 0, 16, 2], "texture": "#3"}
			}
		},
		{
			"from": [-16, -13, 12],
			"to": [31, -7, 16],
			"faces": {
				"north": {"uv": [0, 0, 16, 3], "texture": "#1"},
				"east": {"uv": [0, 0, 2, 3], "texture": "#1"},
				"south": {"uv": [0, 0, 16, 3], "texture": "#7"},
				"west": {"uv": [0, 0, 2, 3], "texture": "#1"},
				"up": {"uv": [0, 0, 16, 2], "texture": "#1"},
				"down": {"uv": [0, 0, 16, 2], "texture": "#1"}
			}
		},
		{
			"from": [-16, -6, 12],
			"to": [26, 10, 16],
			"faces": {
				"north": {"uv": [0, 0, 16, 8], "texture": "#2"},
				"east": {"uv": [0, 0, 2, 8], "texture": "#2"},
				"south": {"uv": [0, 0, 16, 8], "texture": "#7"},
				"west": {"uv": [0, 0, 2, 8], "texture": "#2"},
				"up": {"uv": [0, 0, 16, 2], "texture": "#2"},
				"down": {"uv": [0, 0, 16, 2], "texture": "#2"}
			}
		},
		{
			"from": [-9, 10, 13],
			"to": [25, 32, 15],
			"faces": {
				"north": {"uv": [0, 0, 16, 16], "texture": "#6"},
				"east": {"uv": [0, 0, 1, 11], "texture": "#6"},
				"south": {"uv": [0, 0, 16, 11], "texture": "#6"},
				"west": {"uv": [0, 0, 1, 11], "texture": "#6"},
				"up": {"uv": [0, 0, 16, 1], "texture": "#6"},
				"down": {"uv": [0, 0, 16, 1], "texture": "#6"}
			}
		},
		{
			"from": [-16, -6, 15],
			"to": [-13, 32, 29],
			"faces": {
				"north": {"uv": [0, 0, 1.5, 16], "texture": "#2"},
				"east": {"uv": [0, 0, 7, 16], "texture": "#7"},
				"south": {"uv": [0, 0, 1.5, 16], "texture": "#2"},
				"west": {"uv": [0, 0, 7, 16], "texture": "#2"},
				"up": {"uv": [0, 0, 1.5, 7], "texture": "#2"},
				"down": {"uv": [0, 0, 1.5, 7], "texture": "#2"}
			}
		},
		{
			"from": [29, -6, 15],
			"to": [32, 32, 29],
			"faces": {
				"north": {"uv": [0, 0, 1.5, 16], "texture": "#2"},
				"east": {"uv": [0, 0, 7, 16], "texture": "#2"},
				"south": {"uv": [0, 0, 1.5, 16], "texture": "#2"},
				"west": {"uv": [0, 0, 7, 16], "texture": "#7"},
				"up": {"uv": [0, 0, 1.5, 7], "texture": "#2"},
				"down": {"uv": [0, 0, 1.5, 7], "texture": "#2"}
			}
		},
		{
			"from": [-15, 4, 29],
			"to": [-14, 32, 32],
			"faces": {
				"north": {"uv": [0, 0, 1.5, 16], "texture": "#6"},
				"east": {"uv": [14.5, 0, 16, 16], "texture": "#6"},
				"south": {"uv": [1, 0.5, 2.5, 15.5], "texture": "#6"},
				"west": {"uv": [0, 0, 1.5, 16], "texture": "#6"},
				"up": {"uv": [0, 0, 1.5, 7], "texture": "#6"},
				"down": {"uv": [0, 0, 1.5, 7], "texture": "#6"}
			}
		},
		{
			"from": [30, 4, 29],
			"to": [31, 32, 32],
			"faces": {
				"north": {"uv": [0, 0, 1.5, 16], "texture": "#6"},
				"east": {"uv": [14.5, 0, 16, 16], "texture": "#6"},
				"south": {"uv": [1, 0.5, 2.5, 15.5], "texture": "#6"},
				"west": {"uv": [0, 0, 1.5, 16], "texture": "#6"},
				"up": {"uv": [0, 0, 1.5, 7], "texture": "#6"},
				"down": {"uv": [0, 0, 1.5, 7], "texture": "#6"}
			}
		}
	],
	"groups": [
		{
			"name": "group",
			"isOpen": true,
			"shade": true,
			"display": {
				"visibility": true,
				"autouv": true
			},
			"children": []
		},
		{
			"name": "group",
			"isOpen": true,
			"shade": true,
			"display": {
				"visibility": true,
				"autouv": true
			},
			"children": []
		},
		{
			"name": "group",
			"isOpen": true,
			"shade": true,
			"display": {
				"visibility": true,
				"autouv": true
			},
			"children": []
		}, 0, 1, 2, 3, 4,
		{
			"name": "group",
			"isOpen": true,
			"shade": true,
			"display": {
				"visibility": true,
				"autouv": true
			},
			"children": []
		}, 5, 6, 7, 8, 9, 10, 11, 12, 13, 14, 15, 16, 17, 18, 19, 20, 21, 22, 23, 24]
}