<svg width="25" height="25" viewBox="0 0 40 40" fill="none" xmlns="http://www.w3.org/2000/svg">
    <path fill-rule="evenodd" clip-rule="evenodd"
          d="M20 37C29.3888 37 37 29.3888 37 20C37 10.6112 29.3888 3 20 3C10.6112 3 3 10.6112 3 20C3 29.3888 10.6112 37 20 37ZM20 40C31.0457 40 40 31.0457 40 20C40 8.9543 31.0457 0 20 0C8.9543 0 0 8.9543 0 20C0 31.0457 8.9543 40 20 40Z"
          fill="white"/>
    <path
            d="M17.0795 24.76C16.9795 23.72 17.0295 22.84 17.2295 22.12C17.4295 21.38 17.6995 20.75 18.0395 20.23C18.3995 19.69 18.7995 19.23 19.2395 18.85C19.6995 18.45 20.1195 18.07 20.4995 17.71C20.8995 17.35 21.2295 16.98 21.4895 16.6C21.7495 16.2 21.8795 15.73 21.8795 15.19C21.8795 14.49 21.6795 13.93 21.2795 13.51C20.8995 13.09 20.2095 12.88 19.2095 12.88C18.8895 12.88 18.5495 12.92 18.1895 13C17.8295 13.06 17.4695 13.16 17.1095 13.3C16.7495 13.42 16.3995 13.57 16.0595 13.75C15.7395 13.91 15.4495 14.08 15.1895 14.26L13.6895 11.38C14.4495 10.86 15.3195 10.43 16.2995 10.09C17.2995 9.74996 18.4995 9.57996 19.8995 9.57996C21.7795 9.57996 23.2495 10.04 24.3095 10.96C25.3695 11.86 25.8995 13.08 25.8995 14.62C25.8995 15.64 25.7595 16.49 25.4795 17.17C25.2195 17.83 24.8895 18.4 24.4895 18.88C24.0895 19.34 23.6495 19.75 23.1695 20.11C22.6895 20.47 22.2495 20.86 21.8495 21.28C21.4495 21.68 21.1095 22.15 20.8295 22.69C20.5495 23.23 20.4095 23.92 20.4095 24.76H17.0795ZM16.4795 29.02C16.4795 28.32 16.6995 27.77 17.1395 27.37C17.5795 26.95 18.1595 26.74 18.8795 26.74C19.6395 26.74 20.2395 26.95 20.6795 27.37C21.1195 27.77 21.3395 28.32 21.3395 29.02C21.3395 29.72 21.1195 30.28 20.6795 30.7C20.2395 31.12 19.6395 31.33 18.8795 31.33C18.1595 31.33 17.5795 31.12 17.1395 30.7C16.6995 30.28 16.4795 29.72 16.4795 29.02Z"
            fill="white"/>
</svg>
