(module mouse_bite_0.3-drill_2.5-wide (layer F.Cu) (tedit 5EAA59FC)
  (fp_text reference REF** (at 0 1) (layer F.SilkS)
    (effects (font (size 1 1) (thickness 0.15)))
  )
  (fp_text value mouse_bite_0.3-drill_2.5-wide (at 0 -1) (layer F.Fab)
    (effects (font (size 1 1) (thickness 0.15)))
  )
  (pad "" np_thru_hole circle (at 0.5 0) (size 0.3 0.3) (drill 0.3) (layers *.Cu *.Mask))
  (pad "" np_thru_hole circle (at 1 0) (size 0.3 0.3) (drill 0.3) (layers *.Cu *.Mask))
  (pad "" np_thru_hole circle (at 1.5 0) (size 0.3 0.3) (drill 0.3) (layers *.Cu *.Mask))
  (pad "" np_thru_hole circle (at -1 0) (size 0.3 0.3) (drill 0.3) (layers *.Cu *.Mask))
  (pad "" np_thru_hole circle (at -0.5 0) (size 0.3 0.3) (drill 0.3) (layers *.Cu *.Mask))
  (pad "" np_thru_hole circle (at 0 0) (size 0.3 0.3) (drill 0.3) (layers *.Cu *.Mask))
)
