EESchema Schematic File Version 5
EELAYER 36 0
EELAYER END
$Descr A4 11693 8268
encoding utf-8
Sheet 1 1
Title "VulCAN USB CANbus Adapter"
Date "2020-04-14"
Rev "v01"
Comp "Copperforge"
Comment1 "Part Number: Cu//XXXX"
Comment2 "Schematic Status: Company Private"
Comment3 "Author: Benjamin Ward"
Comment4 ""
Comment5 ""
Comment6 ""
Comment7 ""
Comment8 ""
Comment9 ""
$EndDescr
Connection ~ 1200 2550
Connection ~ 1750 5450
Connection ~ 1800 3700
Connection ~ 1900 1600
Connection ~ 1900 1700
Connection ~ 2000 3400
Connection ~ 2050 1700
Connection ~ 2050 2200
Connection ~ 2200 3400
Connection ~ 2300 1000
Connection ~ 2300 6800
Connection ~ 2400 3800
Connection ~ 2400 6800
Connection ~ 2500 3400
Connection ~ 2500 3800
Connection ~ 2500 6800
Connection ~ 2600 3400
Connection ~ 2850 3400
Connection ~ 2850 3700
Connection ~ 3050 4050
Connection ~ 3050 4450
Connection ~ 3050 5350
Connection ~ 3050 6050
Connection ~ 3100 3700
Connection ~ 3150 1600
Connection ~ 3150 2200
Connection ~ 3500 4550
Connection ~ 3800 1000
Connection ~ 3900 1000
Connection ~ 4350 1450
Connection ~ 4850 1000
Connection ~ 5900 3450
Connection ~ 6750 2800
Connection ~ 6750 3700
Connection ~ 7600 3200
Connection ~ 7700 3300
Connection ~ 7750 3750
Connection ~ 8150 3650
Connection ~ 8400 3300
Connection ~ 8600 3200
Connection ~ 8750 3100
Connection ~ 8800 3200
Connection ~ 8850 3300
Connection ~ 8900 3400
Connection ~ 9800 1050
NoConn ~ 1800 1300
NoConn ~ 1800 2100
NoConn ~ 1800 2200
NoConn ~ 1800 5050
NoConn ~ 1800 5150
NoConn ~ 1800 5250
NoConn ~ 1800 5350
NoConn ~ 1800 5550
NoConn ~ 1800 5750
NoConn ~ 1800 5850
NoConn ~ 1800 6550
NoConn ~ 3000 4250
NoConn ~ 3000 4350
NoConn ~ 3000 4650
NoConn ~ 3000 4850
NoConn ~ 3000 5250
NoConn ~ 3000 5450
NoConn ~ 3000 5550
NoConn ~ 3000 5650
NoConn ~ 3000 5750
NoConn ~ 3000 6150
NoConn ~ 3000 6250
NoConn ~ 3000 6450
NoConn ~ 3000 6550
NoConn ~ 6250 1200
NoConn ~ 6250 3450
NoConn ~ 6750 1200
NoConn ~ 8150 3850
Wire Wire Line
	900  2500 900  2550
Wire Wire Line
	900  2550 1200 2550
Wire Wire Line
	1200 2550 1200 2500
Wire Wire Line
	1200 2550 1200 2600
Wire Wire Line
	1650 5450 1650 5500
Wire Wire Line
	1700 5950 1800 5950
Wire Wire Line
	1700 6150 1800 6150
Wire Wire Line
	1700 6250 1800 6250
Wire Wire Line
	1700 6350 1800 6350
Wire Wire Line
	1700 6450 1800 6450
Wire Wire Line
	1750 5450 1650 5450
Wire Wire Line
	1750 5450 1800 5450
Wire Wire Line
	1750 5650 1750 5450
Wire Wire Line
	1800 1000 2300 1000
Wire Wire Line
	1800 1200 1900 1200
Wire Wire Line
	1800 1500 1900 1500
Wire Wire Line
	1800 1600 1900 1600
Wire Wire Line
	1800 1700 1900 1700
Wire Wire Line
	1800 1800 1900 1800
Wire Wire Line
	1800 3400 1800 3450
Wire Wire Line
	1800 3700 1800 3650
Wire Wire Line
	1800 3700 1800 3750
Wire Wire Line
	1800 5650 1750 5650
Wire Wire Line
	1800 6050 1700 6050
Wire Wire Line
	1900 1500 1900 1600
Wire Wire Line
	1900 1600 3150 1600
Wire Wire Line
	1900 1700 2050 1700
Wire Wire Line
	1900 1800 1900 1700
Wire Wire Line
	2000 3400 1800 3400
Wire Wire Line
	2000 3400 2000 3450
Wire Wire Line
	2000 3650 2000 3700
Wire Wire Line
	2000 3700 1800 3700
Wire Wire Line
	2050 1700 2050 2200
Wire Wire Line
	2050 1700 3250 1700
Wire Wire Line
	2050 2200 2050 2400
Wire Wire Line
	2050 2200 2100 2200
Wire Wire Line
	2050 2400 2100 2400
Wire Wire Line
	2150 1200 2100 1200
Wire Wire Line
	2150 1250 2150 1200
Wire Wire Line
	2200 3350 2200 3400
Wire Wire Line
	2200 3400 2000 3400
Wire Wire Line
	2200 3850 2200 3400
Wire Wire Line
	2200 6750 2200 6800
Wire Wire Line
	2200 6800 2300 6800
Wire Wire Line
	2300 950  2300 1000
Wire Wire Line
	2300 1000 2350 1000
Wire Wire Line
	2300 1750 2300 1000
Wire Wire Line
	2300 1750 2600 1750
Wire Wire Line
	2300 3800 2400 3800
Wire Wire Line
	2300 3850 2300 3800
Wire Wire Line
	2300 6750 2300 6800
Wire Wire Line
	2300 6800 2400 6800
Wire Wire Line
	2400 3800 2500 3800
Wire Wire Line
	2400 3850 2400 3800
Wire Wire Line
	2400 6750 2400 6800
Wire Wire Line
	2400 6800 2500 6800
Wire Wire Line
	2400 6850 2400 6800
Wire Wire Line
	2500 3350 2500 3400
Wire Wire Line
	2500 3400 2600 3400
Wire Wire Line
	2500 3800 2500 3400
Wire Wire Line
	2500 3800 2600 3800
Wire Wire Line
	2500 3850 2500 3800
Wire Wire Line
	2500 6750 2500 6800
Wire Wire Line
	2500 6800 2600 6800
Wire Wire Line
	2600 1750 2600 1800
Wire Wire Line
	2600 2800 2600 2850
Wire Wire Line
	2600 3400 2600 3450
Wire Wire Line
	2600 3400 2850 3400
Wire Wire Line
	2600 3650 2600 3700
Wire Wire Line
	2600 3700 2850 3700
Wire Wire Line
	2600 3800 2600 3850
Wire Wire Line
	2600 6800 2600 6750
Wire Wire Line
	2850 3400 2850 3450
Wire Wire Line
	2850 3400 3100 3400
Wire Wire Line
	2850 3650 2850 3700
Wire Wire Line
	2850 3700 3100 3700
Wire Wire Line
	3000 4050 3050 4050
Wire Wire Line
	3000 4750 3050 4750
Wire Wire Line
	3000 5150 3100 5150
Wire Wire Line
	3000 5850 3100 5850
Wire Wire Line
	3000 5950 3100 5950
Wire Wire Line
	3000 6050 3050 6050
Wire Wire Line
	3000 6350 3050 6350
Wire Wire Line
	3050 4050 3050 4150
Wire Wire Line
	3050 4050 3100 4050
Wire Wire Line
	3050 4150 3150 4150
Wire Wire Line
	3050 4450 3000 4450
Wire Wire Line
	3050 4450 3050 4550
Wire Wire Line
	3050 4450 3550 4450
Wire Wire Line
	3050 4550 3150 4550
Wire Wire Line
	3050 4750 3050 5350
Wire Wire Line
	3050 5350 3000 5350
Wire Wire Line
	3050 5350 3050 6050
Wire Wire Line
	3050 5350 3150 5350
Wire Wire Line
	3050 6350 3050 6050
Wire Wire Line
	3100 2200 3150 2200
Wire Wire Line
	3100 3400 3100 3450
Wire Wire Line
	3100 3700 3100 3650
Wire Wire Line
	3100 3700 3100 3750
Wire Wire Line
	3100 5050 3000 5050
Wire Wire Line
	3150 1600 3250 1600
Wire Wire Line
	3150 2200 3150 1600
Wire Wire Line
	3150 2200 3150 2400
Wire Wire Line
	3150 2400 3100 2400
Wire Wire Line
	3150 5350 3150 5400
Wire Wire Line
	3350 4150 3500 4150
Wire Wire Line
	3350 4550 3500 4550
Wire Wire Line
	3500 4550 3500 4150
Wire Wire Line
	3500 4550 3500 4600
Wire Wire Line
	3800 1000 3800 950 
Wire Wire Line
	3800 1000 3800 1050
Wire Wire Line
	3800 1450 3800 1250
Wire Wire Line
	3900 1000 3800 1000
Wire Wire Line
	3900 1000 3900 1200
Wire Wire Line
	3900 1200 3950 1200
Wire Wire Line
	3950 1000 3900 1000
Wire Wire Line
	3950 4450 4050 4450
Wire Wire Line
	4050 4400 4050 4450
Wire Wire Line
	4350 1450 3800 1450
Wire Wire Line
	4350 1450 4350 1400
Wire Wire Line
	4350 1450 4350 1500
Wire Wire Line
	4750 1000 4850 1000
Wire Wire Line
	4850 1000 4850 950 
Wire Wire Line
	4850 1000 4850 1050
Wire Wire Line
	4850 1250 4850 1450
Wire Wire Line
	4850 1450 4350 1450
Wire Wire Line
	5900 3400 5900 3450
Wire Wire Line
	5900 3450 5900 3500
Wire Wire Line
	5900 3450 6050 3450
Wire Wire Line
	5900 3750 5900 3700
Wire Wire Line
	6050 3350 6050 3450
Wire Wire Line
	6050 3350 6250 3350
Wire Wire Line
	6150 900  6150 850 
Wire Wire Line
	6150 1100 6250 1100
Wire Wire Line
	6150 1300 6250 1300
Wire Wire Line
	6150 3150 6250 3150
Wire Wire Line
	6250 900  6150 900 
Wire Wire Line
	6250 1000 6150 1000
Wire Wire Line
	6250 3050 6150 3050
Wire Wire Line
	6750 900  6800 900 
Wire Wire Line
	6750 1300 6850 1300
Wire Wire Line
	6750 2750 6750 2800
Wire Wire Line
	6750 2800 6750 2850
Wire Wire Line
	6750 3650 6750 3700
Wire Wire Line
	6750 3750 6750 3700
Wire Wire Line
	6800 1450 6800 900 
Wire Wire Line
	6850 1000 6750 1000
Wire Wire Line
	6850 1100 6750 1100
Wire Wire Line
	6850 3650 6850 3700
Wire Wire Line
	6850 3700 6750 3700
Wire Wire Line
	7000 2800 6750 2800
Wire Wire Line
	7200 2800 7250 2800
Wire Wire Line
	7250 2800 7250 2850
Wire Wire Line
	7250 3150 7300 3150
Wire Wire Line
	7250 3350 7300 3350
Wire Wire Line
	7300 3150 7300 3200
Wire Wire Line
	7300 3200 7600 3200
Wire Wire Line
	7300 3300 7700 3300
Wire Wire Line
	7300 3350 7300 3300
Wire Wire Line
	7600 3200 7600 3750
Wire Wire Line
	7600 3200 8600 3200
Wire Wire Line
	7600 3750 7750 3750
Wire Wire Line
	7700 3300 7700 3400
Wire Wire Line
	7700 3300 8400 3300
Wire Wire Line
	7850 3400 7700 3400
Wire Wire Line
	8050 3400 8200 3400
Wire Wire Line
	8200 3400 8200 3650
Wire Wire Line
	8200 3650 8150 3650
Wire Wire Line
	8400 3300 8850 3300
Wire Wire Line
	8400 3350 8400 3300
Wire Wire Line
	8500 3050 8500 3100
Wire Wire Line
	8500 3100 8750 3100
Wire Wire Line
	8500 3750 8500 3800
Wire Wire Line
	8600 3200 8800 3200
Wire Wire Line
	8600 3350 8600 3200
Wire Wire Line
	8750 2600 8950 2600
Wire Wire Line
	8750 3100 8750 2600
Wire Wire Line
	8800 2700 8950 2700
Wire Wire Line
	8800 3200 8800 2700
Wire Wire Line
	8850 2800 8950 2800
Wire Wire Line
	8850 3300 8850 2800
Wire Wire Line
	8900 2900 8900 3400
Wire Wire Line
	8900 3400 8950 3400
Wire Wire Line
	8900 3450 8900 3400
Wire Wire Line
	8950 2900 8900 2900
Wire Wire Line
	8950 3100 8750 3100
Wire Wire Line
	8950 3200 8800 3200
Wire Wire Line
	8950 3300 8850 3300
Wire Wire Line
	9800 1000 9800 1050
Wire Wire Line
	9800 1050 9800 1450
Wire Wire Line
	9800 1450 9950 1450
Wire Wire Line
	9950 1050 9800 1050
Wire Wire Line
	10150 1050 10250 1050
Wire Wire Line
	10150 1450 10250 1450
Wire Wire Line
	10650 1050 10550 1050
Wire Wire Line
	10650 1450 10550 1450
Text Notes 900  1100 0    50   ~ 0
USB-C!
Text Notes 1550 650  0    50   ~ 0
Ferrite? 0ZCK0035FF2G?
Text Notes 1600 7550 0    50   ~ 0
Possibly C6 instead for more flash\n48-pin package is the smallest which exposes \n    pins for CAN and USB simultaneously\nOption for LQFP or UFQFPN
Text Notes 2400 1400 0    50   ~ 0
Do we need a second \nCC resistor for dumb \nA-to-C cables?
Text Notes 3350 5400 0    50   ~ 0
Pins: 3, 14, 16, 21, 26, and 39 tied to \nGND for via placement
Text Notes 3550 1850 0    50   ~ 0
Replaced 2.2uF with 4.7uF to reduce BOM
Text Notes 5700 1600 0    50   ~ 0
Place on breakaway tab
Text Notes 6050 3750 0    50   ~ 0
Internal pull-\ndown on S
Text Notes 6150 1200 2    50   ~ 0
SDA
Text Notes 6475 2450 0    50   ~ 0
Add addtl 1u cap
Text Notes 6850 1200 0    50   ~ 0
SCL
Text Notes 7500 2650 0    50   ~ 0
5V output...\nHow do we prevent reverse current? \nDo we care?\nMake it the user's problem!
Text Notes 8400 4350 0    50   ~ 0
Next revision:\nReplace with ESDCAN24-2BLY\nAdd VUSB output TVS\nSMT switch
Text Notes 8950 5500 0    50   ~ 0
#6/M3 Mounting Holes\nBreakaway
Text Notes 10250 1250 0    50   ~ 0
Green
Text Notes 10250 1650 0    50   ~ 0
Orange
Text Label 1700 5950 2    50   ~ 0
UART_TX
Text Label 1700 6050 2    50   ~ 0
UART_RX
Text Label 1700 6150 2    50   ~ 0
USB_D-
Text Label 1700 6250 2    50   ~ 0
USB_D+
Text Label 1700 6350 2    50   ~ 0
SYS_SWDIO
Text Label 1700 6450 2    50   ~ 0
SYS_SWCLK
Text Label 1800 1200 0    10   ~ 0
USB_CCR
Text Label 3100 4050 0    50   ~ 0
NRST
Text Label 3100 4450 0    50   ~ 0
BOOT
Text Label 3100 5050 0    50   ~ 0
LED_TX
Text Label 3100 5150 0    50   ~ 0
LED_RX
Text Label 3100 5850 0    50   ~ 0
CAN_RX
Text Label 3100 5950 0    50   ~ 0
CAN_TX
Text Label 3250 1600 0    50   ~ 0
USB_D-
Text Label 3250 1700 0    50   ~ 0
USB_D+
Text Label 6150 1000 2    50   ~ 0
SYS_SWDIO
Text Label 6150 1100 2    50   ~ 0
UART_TX
Text Label 6150 1300 2    50   ~ 0
BOOT
Text Label 6150 3050 2    50   ~ 0
CAN_TX
Text Label 6150 3150 2    50   ~ 0
CAN_RX
Text Label 6850 1000 0    50   ~ 0
SYS_SWCLK
Text Label 6850 1100 0    50   ~ 0
UART_RX
Text Label 6850 1300 0    50   ~ 0
NRST
Text Label 7300 3200 0    50   ~ 0
CAN_H
Text Label 7300 3300 0    50   ~ 0
CAN_L
Text Label 8200 3400 2    10   ~ 0
CAN_TERMR
Text Label 10650 1050 0    50   ~ 0
LED_TX
Text Label 10650 1450 0    50   ~ 0
LED_RX
$Comp
L vulcan_portal-rescue:MouseBite-Copperforge H11
U 1 1 5EB61B73
P 7400 750
F 0 "H11" H 7488 771 50  0000 L CNN
F 1 "MouseBite" H 7488 680 50  0000 L CNN
F 2 "copperforge:mouse_bite_0.3-drill_2.5-wide" H 7488 634 31  0000 L CNN
F 3 "~" H 7400 750 50  0001 C CNN
	1    7400 750 
	1    0    0    -1  
$EndComp
$Comp
L vulcan_portal-rescue:MouseBite-Copperforge H12
U 1 1 5EC9DA7E
P 7400 1000
F 0 "H12" H 7488 1052 50  0000 L CNN
F 1 "MouseBite" H 7488 961 50  0000 L CNN
F 2 "copperforge:mouse_bite_0.3-drill_0.3-wide" H 7488 884 31  0000 L CNN
F 3 "~" H 7400 1000 50  0001 C CNN
	1    7400 1000
	1    0    0    -1  
$EndComp
$Comp
L vulcan_portal-rescue:MouseBite-Copperforge H13
U 1 1 5EC9DF6E
P 7400 1250
F 0 "H13" H 7488 1271 50  0000 L CNN
F 1 "MouseBite" H 7488 1180 50  0000 L CNN
F 2 "copperforge:mouse_bite_0.3-drill_0.3-wide" H 7488 1134 31  0001 L CNN
F 3 "~" H 7400 1250 50  0001 C CNN
	1    7400 1250
	1    0    0    -1  
$EndComp
$Comp
L vulcan_portal-rescue:MouseBite-Copperforge H14
U 1 1 5EAB2EEB
P 7400 1450
F 0 "H14" H 7488 1471 50  0000 L CNN
F 1 "MouseBite" H 7488 1380 50  0000 L CNN
F 2 "copperforge:mouse_bite_0.3-drill_0.3-wide" H 7488 1334 31  0001 L CNN
F 3 "~" H 7400 1450 50  0001 C CNN
	1    7400 1450
	1    0    0    -1  
$EndComp
$Comp
L vulcan_portal-rescue:MouseBite-Copperforge H5
U 1 1 5EAE0A57
P 10000 5650
F 0 "H5" H 10088 5702 50  0000 L CNN
F 1 "MouseBite" H 10088 5611 50  0000 L CNN
F 2 "copperforge:mouse_bite_0.3-drill_5.5-wide" H 10088 5534 31  0000 L CNN
F 3 "~" H 10000 5650 50  0001 C CNN
	1    10000 5650
	1    0    0    -1  
$EndComp
$Comp
L vulcan_portal-rescue:MouseBite-Copperforge H6
U 1 1 5EAF7CBF
P 10000 5900
F 0 "H6" H 10088 5921 50  0000 L CNN
F 1 "MouseBite" H 10088 5830 50  0000 L CNN
F 2 "copperforge:mouse_bite_0.3-drill_5.5-wide" H 10088 5784 50  0001 L CNN
F 3 "~" H 10000 5900 50  0001 C CNN
	1    10000 5900
	1    0    0    -1  
$EndComp
$Comp
L vulcan_portal-rescue:MouseBite-Copperforge H7
U 1 1 5EAF8493
P 10000 6100
F 0 "H7" H 10088 6121 50  0000 L CNN
F 1 "MouseBite" H 10088 6030 50  0000 L CNN
F 2 "copperforge:mouse_bite_0.3-drill_5.5-wide" H 10088 5984 50  0001 L CNN
F 3 "~" H 10000 6100 50  0001 C CNN
	1    10000 6100
	1    0    0    -1  
$EndComp
$Comp
L vulcan_portal-rescue:MouseBite-Copperforge H8
U 1 1 5EAF8676
P 10000 6300
F 0 "H8" H 10088 6321 50  0000 L CNN
F 1 "MouseBite" H 10088 6230 50  0000 L CNN
F 2 "copperforge:mouse_bite_0.3-drill_5.5-wide" H 10088 6184 50  0001 L CNN
F 3 "~" H 10000 6300 50  0001 C CNN
	1    10000 6300
	1    0    0    -1  
$EndComp
$Comp
L power:+3.3V #PWR09
U 1 1 5EB9ECE8
P 2200 3350
F 0 "#PWR09" H 2200 3200 50  0001 C CNN
F 1 "+3.3V" H 2215 3523 50  0000 C CNN
F 2 "" H 2200 3350 50  0001 C CNN
F 3 "" H 2200 3350 50  0001 C CNN
	1    2200 3350
	1    0    0    -1  
$EndComp
$Comp
L vulcan_portal-rescue:VUSB-Copperforge #PWR01
U 1 1 5EA0822D
P 2300 950
F 0 "#PWR01" H 2300 800 50  0001 C CNN
F 1 "VUSB" H 2315 1123 50  0000 C CNN
F 2 "" H 2300 950 50  0001 C CNN
F 3 "" H 2300 950 50  0001 C CNN
	1    2300 950 
	1    0    0    -1  
$EndComp
$Comp
L power:+3.3V #PWR010
U 1 1 5EB66CF5
P 2500 3350
F 0 "#PWR010" H 2500 3200 50  0001 C CNN
F 1 "+3.3V" H 2515 3523 50  0000 C CNN
F 2 "" H 2500 3350 50  0001 C CNN
F 3 "" H 2500 3350 50  0001 C CNN
	1    2500 3350
	1    0    0    -1  
$EndComp
$Comp
L vulcan_portal-rescue:VUSB-Copperforge #PWR02
U 1 1 5EA95747
P 3800 950
F 0 "#PWR02" H 3800 800 50  0001 C CNN
F 1 "VUSB" H 3815 1123 50  0000 C CNN
F 2 "" H 3800 950 50  0001 C CNN
F 3 "" H 3800 950 50  0001 C CNN
	1    3800 950 
	1    0    0    -1  
$EndComp
$Comp
L power:+3.3V #PWR07
U 1 1 5F4F0A0A
P 4050 4400
F 0 "#PWR07" H 4050 4250 50  0001 C CNN
F 1 "+3.3V" H 4065 4573 50  0000 C CNN
F 2 "" H 4050 4400 50  0001 C CNN
F 3 "" H 4050 4400 50  0001 C CNN
	1    4050 4400
	1    0    0    -1  
$EndComp
$Comp
L power:+3.3V #PWR03
U 1 1 5EAA5B52
P 4850 950
F 0 "#PWR03" H 4850 800 50  0001 C CNN
F 1 "+3.3V" H 4865 1123 50  0000 C CNN
F 2 "" H 4850 950 50  0001 C CNN
F 3 "" H 4850 950 50  0001 C CNN
	1    4850 950 
	1    0    0    -1  
$EndComp
$Comp
L power:+3.3V #PWR0107
U 1 1 5E96EB26
P 5900 3400
F 0 "#PWR0107" H 5900 3250 50  0001 C CNN
F 1 "+3.3V" H 5915 3573 50  0000 C CNN
F 2 "" H 5900 3400 50  0001 C CNN
F 3 "" H 5900 3400 50  0001 C CNN
	1    5900 3400
	1    0    0    -1  
$EndComp
$Comp
L power:+3.3V #PWR0108
U 1 1 5E994C0D
P 6150 850
F 0 "#PWR0108" H 6150 700 50  0001 C CNN
F 1 "+3.3V" H 6165 1023 50  0000 C CNN
F 2 "" H 6150 850 50  0001 C CNN
F 3 "" H 6150 850 50  0001 C CNN
	1    6150 850 
	1    0    0    -1  
$EndComp
$Comp
L vulcan_portal-rescue:VUSB-Copperforge #PWR0103
U 1 1 5E96787B
P 6750 2750
F 0 "#PWR0103" H 6750 2600 50  0001 C CNN
F 1 "VUSB" H 6765 2923 50  0000 C CNN
F 2 "" H 6750 2750 50  0001 C CNN
F 3 "" H 6750 2750 50  0001 C CNN
	1    6750 2750
	1    0    0    -1  
$EndComp
$Comp
L vulcan_portal-rescue:VUSB-Copperforge #PWR015
U 1 1 5EA79F9C
P 8500 3050
F 0 "#PWR015" H 8500 2900 50  0001 C CNN
F 1 "VUSB" H 8515 3223 50  0000 C CNN
F 2 "" H 8500 3050 50  0001 C CNN
F 3 "" H 8500 3050 50  0001 C CNN
	1    8500 3050
	1    0    0    -1  
$EndComp
$Comp
L power:+3.3V #PWR016
U 1 1 5ECC9D3D
P 9800 1000
F 0 "#PWR016" H 9800 850 50  0001 C CNN
F 1 "+3.3V" H 9815 1173 50  0000 C CNN
F 2 "" H 9800 1000 50  0001 C CNN
F 3 "" H 9800 1000 50  0001 C CNN
	1    9800 1000
	1    0    0    -1  
$EndComp
$Comp
L power:PWR_FLAG #FLG0101
U 1 1 5F30C28B
P 1200 2550
F 0 "#FLG0101" H 1200 2625 50  0001 C CNN
F 1 "PWR_FLAG" V 1200 2678 50  0000 L CNN
F 2 "" H 1200 2550 50  0001 C CNN
F 3 "~" H 1200 2550 50  0001 C CNN
	1    1200 2550
	0    1    1    0   
$EndComp
$Comp
L power:PWR_FLAG #FLG01
U 1 1 5EA2B9FC
P 2350 1000
F 0 "#FLG01" H 2350 1075 50  0001 C CNN
F 1 "PWR_FLAG" V 2350 1128 50  0000 L CNN
F 2 "" H 2350 1000 50  0001 C CNN
F 3 "~" H 2350 1000 50  0001 C CNN
	1    2350 1000
	0    1    1    0   
$EndComp
$Comp
L power:GND #PWR08
U 1 1 5EA261D9
P 1200 2600
F 0 "#PWR08" H 1200 2350 50  0001 C CNN
F 1 "GND" H 1205 2427 50  0000 C CNN
F 2 "" H 1200 2600 50  0001 C CNN
F 3 "" H 1200 2600 50  0001 C CNN
	1    1200 2600
	1    0    0    -1  
$EndComp
$Comp
L power:GND #PWR05
U 1 1 5EE6FDD7
P 1650 5500
F 0 "#PWR05" H 1650 5250 50  0001 C CNN
F 1 "GND" H 1655 5327 50  0000 C CNN
F 2 "" H 1650 5500 50  0001 C CNN
F 3 "" H 1650 5500 50  0001 C CNN
	1    1650 5500
	1    0    0    -1  
$EndComp
$Comp
L power:GND #PWR011
U 1 1 5EB8B2B7
P 1800 3750
F 0 "#PWR011" H 1800 3500 50  0001 C CNN
F 1 "GND" H 1805 3577 50  0000 C CNN
F 2 "" H 1800 3750 50  0001 C CNN
F 3 "" H 1800 3750 50  0001 C CNN
	1    1800 3750
	1    0    0    -1  
$EndComp
$Comp
L power:GND #PWR04
U 1 1 5EA0E054
P 2150 1250
F 0 "#PWR04" H 2150 1000 50  0001 C CNN
F 1 "GND" H 2155 1077 50  0000 C CNN
F 2 "" H 2150 1250 50  0001 C CNN
F 3 "" H 2150 1250 50  0001 C CNN
	1    2150 1250
	1    0    0    -1  
$EndComp
$Comp
L power:GND #PWR0110
U 1 1 5E9C1378
P 2400 6850
F 0 "#PWR0110" H 2400 6600 50  0001 C CNN
F 1 "GND" H 2405 6677 50  0000 C CNN
F 2 "" H 2400 6850 50  0001 C CNN
F 3 "" H 2400 6850 50  0001 C CNN
	1    2400 6850
	1    0    0    -1  
$EndComp
$Comp
L power:GND #PWR0102
U 1 1 5F1C38EB
P 2600 2850
F 0 "#PWR0102" H 2600 2600 50  0001 C CNN
F 1 "GND" H 2605 2677 50  0000 C CNN
F 2 "" H 2600 2850 50  0001 C CNN
F 3 "" H 2600 2850 50  0001 C CNN
	1    2600 2850
	1    0    0    -1  
$EndComp
$Comp
L power:GND #PWR012
U 1 1 5EB54560
P 3100 3750
F 0 "#PWR012" H 3100 3500 50  0001 C CNN
F 1 "GND" H 3105 3577 50  0000 C CNN
F 2 "" H 3100 3750 50  0001 C CNN
F 3 "" H 3100 3750 50  0001 C CNN
	1    3100 3750
	1    0    0    -1  
$EndComp
$Comp
L power:GND #PWR0111
U 1 1 5F63CF5B
P 3150 5400
F 0 "#PWR0111" H 3150 5150 50  0001 C CNN
F 1 "GND" H 3155 5227 50  0000 C CNN
F 2 "" H 3150 5400 50  0001 C CNN
F 3 "" H 3150 5400 50  0001 C CNN
	1    3150 5400
	1    0    0    -1  
$EndComp
$Comp
L power:GND #PWR013
U 1 1 5EAF1BFA
P 3500 4600
F 0 "#PWR013" H 3500 4350 50  0001 C CNN
F 1 "GND" H 3505 4427 50  0000 C CNN
F 2 "" H 3500 4600 50  0001 C CNN
F 3 "" H 3500 4600 50  0001 C CNN
	1    3500 4600
	1    0    0    -1  
$EndComp
$Comp
L power:GND #PWR06
U 1 1 5EAA681A
P 4350 1500
F 0 "#PWR06" H 4350 1250 50  0001 C CNN
F 1 "GND" H 4355 1327 50  0000 C CNN
F 2 "" H 4350 1500 50  0001 C CNN
F 3 "" H 4350 1500 50  0001 C CNN
	1    4350 1500
	1    0    0    -1  
$EndComp
$Comp
L power:GND #PWR0106
U 1 1 5E96DD1C
P 5900 3750
F 0 "#PWR0106" H 5900 3500 50  0001 C CNN
F 1 "GND" H 5905 3577 50  0000 C CNN
F 2 "" H 5900 3750 50  0001 C CNN
F 3 "" H 5900 3750 50  0001 C CNN
	1    5900 3750
	1    0    0    -1  
$EndComp
$Comp
L power:GND #PWR0104
U 1 1 5E968156
P 6750 3750
F 0 "#PWR0104" H 6750 3500 50  0001 C CNN
F 1 "GND" H 6755 3577 50  0000 C CNN
F 2 "" H 6750 3750 50  0001 C CNN
F 3 "" H 6750 3750 50  0001 C CNN
	1    6750 3750
	1    0    0    -1  
$EndComp
$Comp
L power:GND #PWR0109
U 1 1 5E99631F
P 6800 1450
F 0 "#PWR0109" H 6800 1200 50  0001 C CNN
F 1 "GND" H 6805 1277 50  0000 C CNN
F 2 "" H 6800 1450 50  0001 C CNN
F 3 "" H 6800 1450 50  0001 C CNN
	1    6800 1450
	1    0    0    -1  
$EndComp
$Comp
L power:GND #PWR014
U 1 1 5EA40809
P 7250 2850
F 0 "#PWR014" H 7250 2600 50  0001 C CNN
F 1 "GND" H 7255 2677 50  0000 C CNN
F 2 "" H 7250 2850 50  0001 C CNN
F 3 "" H 7250 2850 50  0001 C CNN
	1    7250 2850
	1    0    0    -1  
$EndComp
$Comp
L power:GND #PWR0105
U 1 1 5E96BE99
P 8500 3800
F 0 "#PWR0105" H 8500 3550 50  0001 C CNN
F 1 "GND" H 8505 3627 50  0000 C CNN
F 2 "" H 8500 3800 50  0001 C CNN
F 3 "" H 8500 3800 50  0001 C CNN
	1    8500 3800
	1    0    0    -1  
$EndComp
$Comp
L power:GND #PWR017
U 1 1 5EECDF18
P 8900 3450
F 0 "#PWR017" H 8900 3200 50  0001 C CNN
F 1 "GND" H 8905 3277 50  0000 C CNN
F 2 "" H 8900 3450 50  0001 C CNN
F 3 "" H 8900 3450 50  0001 C CNN
	1    8900 3450
	1    0    0    -1  
$EndComp
$Comp
L Device:R_Small_US R1
U 1 1 5EA07957
P 2000 1200
F 0 "R1" V 1900 1100 50  0000 C CNN
F 1 "5.1k" V 1900 1300 50  0000 C CNN
F 2 "Resistor_SMD:R_0603_1608Metric" H 2000 1200 50  0001 C CNN
F 3 "~" H 2000 1200 50  0001 C CNN
	1    2000 1200
	0    1    1    0   
$EndComp
$Comp
L Device:R_Small_US R2
U 1 1 5EAF0818
P 3250 4550
F 0 "R2" V 3200 4450 50  0000 C CNN
F 1 "5.1k" V 3200 4700 50  0000 C CNN
F 2 "Resistor_SMD:R_0603_1608Metric" H 3250 4550 50  0001 C CNN
F 3 "~" H 3250 4550 50  0001 C CNN
	1    3250 4550
	0    1    1    0   
$EndComp
$Comp
L Device:R_Small_US R5
U 1 1 5EF6885A
P 7950 3400
F 0 "R5" V 8050 3300 50  0000 C CNN
F 1 "120" V 8050 3500 50  0000 C CNN
F 2 "Resistor_SMD:R_0603_1608Metric" H 7950 3400 50  0001 C CNN
F 3 "~" H 7950 3400 50  0001 C CNN
	1    7950 3400
	0    1    1    0   
$EndComp
$Comp
L Device:R_Small_US R3
U 1 1 5EC5E822
P 10050 1050
F 0 "R3" V 10255 1050 50  0000 C CNN
F 1 "580" V 10164 1050 50  0000 C CNN
F 2 "Resistor_SMD:R_0603_1608Metric" H 10050 1050 50  0001 C CNN
F 3 "~" H 10050 1050 50  0001 C CNN
	1    10050 1050
	0    -1   -1   0   
$EndComp
$Comp
L Device:R_Small_US R4
U 1 1 5EC6E8C7
P 10050 1450
F 0 "R4" V 10255 1450 50  0000 C CNN
F 1 "580" V 10164 1450 50  0000 C CNN
F 2 "Resistor_SMD:R_0603_1608Metric" H 10050 1450 50  0001 C CNN
F 3 "~" H 10050 1450 50  0001 C CNN
	1    10050 1450
	0    -1   -1   0   
$EndComp
$Comp
L Mechanical:MountingHole H1
U 1 1 5ED5C4BB
P 9000 5700
F 0 "H1" H 9100 5777 50  0000 L CNN
F 1 "MountingHole" H 9100 5686 50  0000 L CNN
F 2 "MountingHole:MountingHole_3.7mm" H 9100 5609 31  0000 L CNN
F 3 "~" H 9000 5700 50  0001 C CNN
	1    9000 5700
	1    0    0    -1  
$EndComp
$Comp
L Mechanical:MountingHole H2
U 1 1 5ED5C058
P 9000 5950
F 0 "H2" H 9100 5996 50  0000 L CNN
F 1 "MountingHole" H 9100 5905 50  0000 L CNN
F 2 "MountingHole:MountingHole_3.7mm" H 9000 5950 50  0001 C CNN
F 3 "~" H 9000 5950 50  0001 C CNN
	1    9000 5950
	1    0    0    -1  
$EndComp
$Comp
L Mechanical:MountingHole H3
U 1 1 5ED5BE8F
P 9000 6150
F 0 "H3" H 9100 6196 50  0000 L CNN
F 1 "MountingHole" H 9100 6105 50  0000 L CNN
F 2 "MountingHole:MountingHole_3.7mm" H 9000 6150 50  0001 C CNN
F 3 "~" H 9000 6150 50  0001 C CNN
	1    9000 6150
	1    0    0    -1  
$EndComp
$Comp
L Mechanical:MountingHole H4
U 1 1 5ED5B718
P 9000 6350
F 0 "H4" H 9100 6396 50  0000 L CNN
F 1 "MountingHole" H 9100 6305 50  0000 L CNN
F 2 "MountingHole:MountingHole_3.7mm" H 9000 6350 50  0001 C CNN
F 3 "~" H 9000 6350 50  0001 C CNN
	1    9000 6350
	1    0    0    -1  
$EndComp
$Comp
L vulcan_portal-rescue:Logo_VulCAN-Copperforge LOGO2
U 1 1 5EAF568D
P 11050 650
F 0 "LOGO2" H 11050 750 50  0001 C CNN
F 1 "Logo_VulCAN" H 11050 550 50  0001 C CNN
F 2 "copperforge:vulcan_logo_18.1x5.1" H 11050 650 50  0001 C CNN
F 3 "" H 11050 650 50  0001 C CNN
	1    11050 650 
	1    0    0    -1  
$EndComp
$Comp
L Device:C_Small C5
U 1 1 5EB79D28
P 1800 3550
F 0 "C5" H 1800 3650 50  0000 L CNN
F 1 "100n" H 1800 3450 50  0000 L CNN
F 2 "Capacitor_SMD:C_0603_1608Metric" H 1800 3550 50  0001 C CNN
F 3 "~" H 1800 3550 50  0001 C CNN
	1    1800 3550
	1    0    0    -1  
$EndComp
$Comp
L Device:C_Small C6
U 1 1 5EB79D2E
P 2000 3550
F 0 "C6" H 2000 3650 50  0000 L CNN
F 1 "4.7u" H 2000 3450 50  0000 L CNN
F 2 "Capacitor_SMD:C_0603_1608Metric" H 2000 3550 50  0001 C CNN
F 3 "~" H 2000 3550 50  0001 C CNN
	1    2000 3550
	1    0    0    -1  
$EndComp
$Comp
L Device:C_Small C7
U 1 1 5EB2B193
P 2600 3550
F 0 "C7" H 2600 3650 50  0000 L CNN
F 1 "4.7u" H 2600 3450 50  0000 L CNN
F 2 "Capacitor_SMD:C_0603_1608Metric" H 2600 3550 50  0001 C CNN
F 3 "~" H 2600 3550 50  0001 C CNN
	1    2600 3550
	1    0    0    -1  
$EndComp
$Comp
L Device:C_Small C8
U 1 1 5EB259C2
P 2850 3550
F 0 "C8" H 2850 3650 50  0000 L CNN
F 1 "100n" H 2850 3450 50  0000 L CNN
F 2 "Capacitor_SMD:C_0603_1608Metric" H 2850 3550 50  0001 C CNN
F 3 "~" H 2850 3550 50  0001 C CNN
	1    2850 3550
	1    0    0    -1  
$EndComp
$Comp
L Device:C_Small C9
U 1 1 5EB2612C
P 3100 3550
F 0 "C9" H 3100 3650 50  0000 L CNN
F 1 "100n" H 3100 3450 50  0000 L CNN
F 2 "Capacitor_SMD:C_0603_1608Metric" H 3100 3550 50  0001 C CNN
F 3 "~" H 3100 3550 50  0001 C CNN
	1    3100 3550
	1    0    0    -1  
$EndComp
$Comp
L Device:C_Small C10
U 1 1 5EBD0C6B
P 3250 4150
F 0 "C10" V 3200 4050 50  0000 C CNN
F 1 "100n" V 3200 4300 50  0000 C CNN
F 2 "Capacitor_SMD:C_0603_1608Metric" H 3250 4150 50  0001 C CNN
F 3 "~" H 3250 4150 50  0001 C CNN
	1    3250 4150
	0    1    1    0   
$EndComp
$Comp
L Device:C_Small C3
U 1 1 5EA86017
P 3800 1150
F 0 "C3" H 3708 1104 50  0000 R CNN
F 1 "4.7u" H 3708 1195 50  0000 R CNN
F 2 "Capacitor_SMD:C_0603_1608Metric" H 3800 1150 50  0001 C CNN
F 3 "~" H 3800 1150 50  0001 C CNN
	1    3800 1150
	1    0    0    1   
$EndComp
$Comp
L Device:C_Small C4
U 1 1 5EA8A7AB
P 4850 1150
F 0 "C4" H 4942 1196 50  0000 L CNN
F 1 "4.7u" H 4942 1105 50  0000 L CNN
F 2 "Capacitor_SMD:C_0603_1608Metric" H 4850 1150 50  0001 C CNN
F 3 "~" H 4850 1150 50  0001 C CNN
	1    4850 1150
	1    0    0    -1  
$EndComp
$Comp
L Device:C_Small C1
U 1 1 5E96D084
P 5900 3600
F 0 "C1" H 5808 3554 50  0000 R CNN
F 1 "100n" H 5808 3645 50  0000 R CNN
F 2 "Capacitor_SMD:C_0603_1608Metric" H 5900 3600 50  0001 C CNN
F 3 "~" H 5900 3600 50  0001 C CNN
	1    5900 3600
	1    0    0    1   
$EndComp
$Comp
L Device:C_Small C11
U 1 1 5EA2C3C6
P 7100 2800
F 0 "C11" V 6871 2800 50  0000 C CNN
F 1 "100n" V 6962 2800 50  0000 C CNN
F 2 "Capacitor_SMD:C_0603_1608Metric" H 7100 2800 50  0001 C CNN
F 3 "~" H 7100 2800 50  0001 C CNN
	1    7100 2800
	0    1    1    0   
$EndComp
$Comp
L Device:LED D3
U 1 1 5EC55907
P 10400 1050
F 0 "D3" H 10400 950 50  0000 C CNN
F 1 "‎LTST-C190GKT‎" H 10400 1150 50  0000 C CNN
F 2 "LED_SMD:LED_0603_1608Metric" H 10400 1050 50  0001 C CNN
F 3 "~" H 10400 1050 50  0001 C CNN
	1    10400 1050
	-1   0    0    1   
$EndComp
$Comp
L Device:LED D5
U 1 1 5EC55149
P 10400 1450
F 0 "D5" H 10400 1350 50  0000 C CNN
F 1 "‎LTST-C190KFKT" H 10400 1550 50  0000 C CNN
F 2 "LED_SMD:LED_0603_1608Metric" H 10400 1450 50  0001 C CNN
F 3 "~" H 10400 1450 50  0001 C CNN
	1    10400 1450
	-1   0    0    1   
$EndComp
$Comp
L vulcan_portal-rescue:Logo_Copperforge-Copperforge LOGO1
U 1 1 5ED5A33C
P 10900 550
F 0 "LOGO1" H 10900 650 50  0001 C CNN
F 1 "Logo_Copperforge" H 10900 450 50  0001 C CNN
F 2 "copperforge:newlogo_19x3mm" H 10900 550 50  0001 C CNN
F 3 "" H 10900 550 50  0001 C CNN
	1    10900 550 
	1    0    0    -1  
$EndComp
$Comp
L Switch:SW_Push SW1
U 1 1 5E9F1F3C
P 3750 4450
F 0 "SW1" H 3750 4735 50  0000 C CNN
F 1 "PTS830" H 3750 4644 50  0000 C CNN
F 2 "copperforge:SW_SPST_PTS830" H 3750 4650 50  0001 C CNN
F 3 "~" H 3750 4650 50  0001 C CNN
	1    3750 4450
	1    0    0    -1  
$EndComp
$Comp
L Switch:SW_DPDT_x2 SW2
U 1 1 5ECF6589
P 7950 3750
F 0 "SW2" H 7900 3900 50  0000 C CNN
F 1 "JS202011CQN" H 8000 4000 50  0000 C CNN
F 2 "Button_Switch_THT:SW_CuK_JS202011CQN_DPDT_Straight" H 7950 3750 50  0001 C CNN
F 3 "~" H 7950 3750 50  0001 C CNN
	1    7950 3750
	1    0    0    1   
$EndComp
$Comp
L Switch:SW_DPDT_x2 SW2
U 2 1 5ED1B614
P 7950 3750
F 0 "SW2" H 7900 3900 50  0000 C CNN
F 1 "JS202011CQN" H 8000 4000 50  0000 C CNN
F 2 "" H 7950 3750 50  0001 C CNN
F 3 "~" H 7950 3750 50  0001 C CNN
	2    7950 3750
	1    0    0    1   
$EndComp
$Comp
L Connector_Generic:Conn_01x04 J3
U 1 1 5E9C72AE
P 9150 2700
F 0 "J3" H 9230 2723 50  0000 L CNN
F 1 "Conn_01x04" H 9230 2632 50  0000 L CNN
F 2 "Connector_PinSocket_2.54mm:PinSocket_1x04_P2.54mm_Vertical" H 9230 2555 31  0000 L CNN
F 3 "~" H 9150 2700 50  0001 C CNN
	1    9150 2700
	1    0    0    -1  
$EndComp
$Comp
L Connector:Screw_Terminal_01x04 J5
U 1 1 5EA821FA
P 9150 3300
F 0 "J5" H 9230 3292 50  0000 L CNN
F 1 "Screw_Terminal_01x04" H 9230 3201 50  0000 L CNN
F 2 "Copperforge:EBWA-04-A" H 9150 3300 50  0001 C CNN
F 3 "~" H 9150 3300 50  0001 C CNN
	1    9150 3300
	1    0    0    1   
$EndComp
$Comp
L Power_Protection:SP0502BAHT D6
U 1 1 5EDEAACD
P 8500 3550
F 0 "D6" H 8600 3400 50  0000 L CNN
F 1 "PESD1CAN-UX/ESDCAN02-2BWY" H 8600 3300 50  0000 L CNN
F 2 "Package_TO_SOT_SMD:SOT-323_SC-70" H 8725 3500 50  0001 L CNN
F 3 "http://www.littelfuse.com/~/media/files/littelfuse/technical%20resources/documents/data%20sheets/sp05xxba.pdf" H 8625 3675 50  0001 C CNN
	1    8500 3550
	1    0    0    -1  
$EndComp
$Comp
L Connector_Generic:Conn_02x05_Counter_Clockwise J2
U 1 1 5E98861F
P 6450 1100
F 0 "J2" H 6500 1500 50  0000 C CNN
F 1 "PROG" H 6500 1400 50  0000 C CNN
F 2 "Connector:Tag-Connect_TC2050-IDC-NL_2x05_P1.27mm_Vertical" H 6500 800 31  0000 C CNN
F 3 "~" H 6450 1100 50  0001 C CNN
	1    6450 1100
	1    0    0    -1  
$EndComp
$Comp
L Regulator_Linear:MIC5504-3.3YM5 U2
U 1 1 5EA84A97
P 4350 1100
F 0 "U2" H 4350 1467 50  0000 C CNN
F 1 "MIC5504-3.3YM5" H 4350 1376 50  0000 C CNN
F 2 "Package_TO_SOT_SMD:SOT-23-5" H 4350 700 50  0001 C CNN
F 3 "http://ww1.microchip.com/downloads/en/DeviceDoc/MIC550X.pdf" H 4100 1350 50  0001 C CNN
	1    4350 1100
	1    0    0    -1  
$EndComp
$Comp
L Power_Protection:USBLC6-2SC6 D1
U 1 1 5EE07680
P 2600 2300
F 0 "D1" H 2850 1950 50  0000 C CNN
F 1 "USBLC6" H 2950 1850 50  0000 C CNN
F 2 "Package_TO_SOT_SMD:SOT-666" H 1850 2700 50  0001 C CNN
F 3 "http://www2.st.com/resource/en/datasheet/CD00050750.pdf" H 2800 2650 50  0001 C CNN
	1    2600 2300
	1    0    0    -1  
$EndComp
$Comp
L Interface_CAN_LIN:TJA1051TK-3 U3
U 1 1 5EE7C091
P 6750 3250
F 0 "U3" H 7050 2900 50  0000 C CNN
F 1 "TJA1051TK-3" H 6750 3250 50  0000 C CNN
F 2 "Package_DFN_QFN:DFN-8-1EP_3x3mm_P0.65mm_EP1.55x2.4mm" H 6750 2750 50  0001 C CIN
F 3 "http://www.nxp.com/documents/data_sheet/TJA1051.pdf" H 6750 3250 50  0001 C CNN
	1    6750 3250
	1    0    0    -1  
$EndComp
$Comp
L Connector:USB_C_Receptacle_USB2.0 J1
U 1 1 5E98A9BC
P 1200 1600
F 0 "J1" H 1500 850 50  0000 C CNN
F 1 "USB_C_Receptacle_USB2.0" V 750 1600 50  0000 C CNN
F 2 "Connector_USB:USB_C_Receptacle_HRO_TYPE-C-31-M-12" H 1350 1600 50  0001 C CNN
F 3 "https://www.usb.org/sites/default/files/documents/usb_type-c.zip" H 1350 1600 50  0001 C CNN
	1    1200 1600
	1    0    0    -1  
$EndComp
$Comp
L MCU_ST_STM32F0:STM32F042C4Ux U1
U 1 1 5E973B8F
P 2400 5250
F 0 "U1" H 2000 3800 50  0000 C CNN
F 1 "STM32F042C4Ux" V 2400 5250 50  0000 C CNN
F 2 "Package_DFN_QFN:QFN-48-1EP_7x7mm_P0.5mm_EP5.6x5.6mm" V 2300 5250 31  0000 C CNN
F 3 "http://www.st.com/st-web-ui/static/active/en/resource/technical/document/datasheet/DM00105814.pdf" H 2400 5250 50  0001 C CNN
	1    2400 5250
	-1   0    0    -1  
$EndComp
$EndSCHEMATC
