G04 #@! TF.GenerationSoftware,KiCad,Pcbnew,(6.0.10)*
G04 #@! TF.CreationDate,2023-01-24T10:04:16-05:00*
G04 #@! TF.ProjectId,vulcan_portal,76756c63-616e-45f7-906f-7274616c2e6b,rev?*
G04 #@! TF.SameCoordinates,Original*
G04 #@! TF.FileFunction,Soldermask,Top*
G04 #@! TF.FilePolarity,Negative*
%FSLAX46Y46*%
G04 Gerber Fmt 4.6, Leading zero omitted, Abs format (unit mm)*
G04 Created by KiCad (PCBNEW (6.0.10)) date 2023-01-24 10:04:16*
%MOMM*%
%LPD*%
G01*
G04 APERTURE LIST*
G04 Aperture macros list*
%AMRoundRect*
0 Rectangle with rounded corners*
0 $1 Rounding radius*
0 $2 $3 $4 $5 $6 $7 $8 $9 X,Y pos of 4 corners*
0 Add a 4 corners polygon primitive as box body*
4,1,4,$2,$3,$4,$5,$6,$7,$8,$9,$2,$3,0*
0 Add four circle primitives for the rounded corners*
1,1,$1+$1,$2,$3*
1,1,$1+$1,$4,$5*
1,1,$1+$1,$6,$7*
1,1,$1+$1,$8,$9*
0 Add four rect primitives between the rounded corners*
20,1,$1+$1,$2,$3,$4,$5,0*
20,1,$1+$1,$4,$5,$6,$7,0*
20,1,$1+$1,$6,$7,$8,$9,0*
20,1,$1+$1,$8,$9,$2,$3,0*%
G04 Aperture macros list end*
%ADD10RoundRect,0.218750X0.218750X0.256250X-0.218750X0.256250X-0.218750X-0.256250X0.218750X-0.256250X0*%
%ADD11RoundRect,0.218750X-0.256250X0.218750X-0.256250X-0.218750X0.256250X-0.218750X0.256250X0.218750X0*%
%ADD12RoundRect,0.218750X-0.218750X-0.256250X0.218750X-0.256250X0.218750X0.256250X-0.218750X0.256250X0*%
%ADD13C,3.700000*%
%ADD14RoundRect,0.218750X0.256250X-0.218750X0.256250X0.218750X-0.256250X0.218750X-0.256250X-0.218750X0*%
%ADD15R,0.650000X1.060000*%
%ADD16RoundRect,0.062500X0.375000X0.062500X-0.375000X0.062500X-0.375000X-0.062500X0.375000X-0.062500X0*%
%ADD17RoundRect,0.062500X0.062500X0.375000X-0.062500X0.375000X-0.062500X-0.375000X0.062500X-0.375000X0*%
%ADD18R,5.600000X5.600000*%
%ADD19C,0.650000*%
%ADD20R,1.450000X0.600000*%
%ADD21R,1.450000X0.300000*%
%ADD22O,1.600000X1.000000*%
%ADD23O,2.100000X1.000000*%
%ADD24R,0.700000X0.750000*%
%ADD25RoundRect,0.250000X1.550000X-0.650000X1.550000X0.650000X-1.550000X0.650000X-1.550000X-0.650000X0*%
%ADD26O,3.600000X1.800000*%
%ADD27R,1.700000X1.700000*%
%ADD28O,1.700000X1.700000*%
%ADD29C,0.787400*%
%ADD30C,0.300000*%
%ADD31R,1.400000X1.400000*%
%ADD32C,1.400000*%
%ADD33R,0.650000X0.350000*%
%ADD34R,1.550000X2.400000*%
%ADD35R,0.500000X0.375000*%
%ADD36R,0.650000X0.300000*%
%ADD37R,0.450000X0.700000*%
G04 APERTURE END LIST*
D10*
X132359500Y-83820000D03*
X130784500Y-83820000D03*
D11*
X134315200Y-86105900D03*
X134315200Y-87680900D03*
X137261600Y-86105900D03*
X137261600Y-87680900D03*
X135788400Y-86105900D03*
X135788400Y-87680900D03*
D10*
X132237580Y-77536040D03*
X130662580Y-77536040D03*
D11*
X143764000Y-79603500D03*
X143764000Y-81178500D03*
X142798800Y-86105900D03*
X142798800Y-87680900D03*
D12*
X130677820Y-74574400D03*
X132252820Y-74574400D03*
X130670200Y-76075540D03*
X132245200Y-76075540D03*
D13*
X125832000Y-68578000D03*
X157582000Y-68578000D03*
X157582000Y-93978000D03*
X125832000Y-93978000D03*
D14*
X138734800Y-87680900D03*
X138734800Y-86105900D03*
D15*
X132725200Y-85361600D03*
X131775200Y-85361600D03*
X130825200Y-85361600D03*
X130825200Y-87561600D03*
X132725200Y-87561600D03*
D11*
X144653000Y-82588000D03*
X144653000Y-84163000D03*
D16*
X141727800Y-84030000D03*
X141727800Y-83530000D03*
X141727800Y-83030000D03*
X141727800Y-82530000D03*
X141727800Y-82030000D03*
X141727800Y-81530000D03*
X141727800Y-81030000D03*
X141727800Y-80530000D03*
X141727800Y-80030000D03*
X141727800Y-79530000D03*
X141727800Y-79030000D03*
X141727800Y-78530000D03*
D17*
X141040300Y-77842500D03*
X140540300Y-77842500D03*
X140040300Y-77842500D03*
X139540300Y-77842500D03*
X139040300Y-77842500D03*
X138540300Y-77842500D03*
X138040300Y-77842500D03*
X137540300Y-77842500D03*
X137040300Y-77842500D03*
X136540300Y-77842500D03*
X136040300Y-77842500D03*
X135540300Y-77842500D03*
D16*
X134852800Y-78530000D03*
X134852800Y-79030000D03*
X134852800Y-79530000D03*
X134852800Y-80030000D03*
X134852800Y-80530000D03*
X134852800Y-81030000D03*
X134852800Y-81530000D03*
X134852800Y-82030000D03*
X134852800Y-82530000D03*
X134852800Y-83030000D03*
X134852800Y-83530000D03*
X134852800Y-84030000D03*
D17*
X135540300Y-84717500D03*
X136040300Y-84717500D03*
X136540300Y-84717500D03*
X137040300Y-84717500D03*
X137540300Y-84717500D03*
X138040300Y-84717500D03*
X138540300Y-84717500D03*
X139040300Y-84717500D03*
X139540300Y-84717500D03*
X140040300Y-84717500D03*
X140540300Y-84717500D03*
X141040300Y-84717500D03*
D18*
X138290300Y-81280000D03*
D14*
X143167100Y-84163000D03*
X143167100Y-82588000D03*
D11*
X141325600Y-86105900D03*
X141325600Y-87680900D03*
D19*
X127294080Y-84122280D03*
X127294080Y-78342280D03*
D20*
X128739080Y-77982280D03*
X128739080Y-78782280D03*
D21*
X128739080Y-79982280D03*
X128739080Y-80982280D03*
X128739080Y-81482280D03*
X128739080Y-82482280D03*
D20*
X128739080Y-83682280D03*
X128739080Y-84482280D03*
X128739080Y-84482280D03*
X128739080Y-83682280D03*
D21*
X128739080Y-82982280D03*
X128739080Y-81982280D03*
X128739080Y-80482280D03*
X128739080Y-79482280D03*
D20*
X128739080Y-78782280D03*
X128739080Y-77982280D03*
D22*
X123644080Y-76912280D03*
D23*
X127824080Y-85552280D03*
X127824080Y-76912280D03*
D22*
X123644080Y-85552280D03*
D10*
X135229700Y-74574400D03*
X133654700Y-74574400D03*
X132232500Y-79021940D03*
X130657500Y-79021940D03*
X135222080Y-76075540D03*
X133647080Y-76075540D03*
D24*
X137224100Y-76108600D03*
X140424100Y-76108600D03*
X140424100Y-74458600D03*
X137224100Y-74458600D03*
D25*
X156768800Y-86547960D03*
D26*
X156768800Y-83047960D03*
X156768800Y-79547960D03*
X156768800Y-76047960D03*
D27*
X150037800Y-80010000D03*
D28*
X150037800Y-82550000D03*
X150037800Y-85090000D03*
X150037800Y-87630000D03*
D29*
X135750300Y-92073000D03*
X137020300Y-92073000D03*
X138290300Y-92073000D03*
X139560300Y-92073000D03*
X140830300Y-92073000D03*
X140830300Y-90803000D03*
X139560300Y-90803000D03*
X138290300Y-90803000D03*
X137020300Y-90803000D03*
X135750300Y-90803000D03*
D30*
X126651900Y-73152000D03*
X127651900Y-73152000D03*
X123151900Y-73152000D03*
X127151900Y-73152000D03*
X128651900Y-73152000D03*
X124151900Y-73152000D03*
X124651900Y-73152000D03*
X123651900Y-73152000D03*
X125651900Y-73152000D03*
X126151900Y-73152000D03*
X125151900Y-73152000D03*
X128151900Y-73152000D03*
X156213300Y-73152000D03*
X158713300Y-73152000D03*
X154713300Y-73152000D03*
X157213300Y-73152000D03*
X159713300Y-73152000D03*
X155213300Y-73152000D03*
X160213300Y-73152000D03*
X157713300Y-73152000D03*
X158213300Y-73152000D03*
X159213300Y-73152000D03*
X155713300Y-73152000D03*
X156713300Y-73152000D03*
X156264100Y-89306400D03*
X158264100Y-89306400D03*
X156764100Y-89306400D03*
X155264100Y-89306400D03*
X154764100Y-89306400D03*
X157764100Y-89306400D03*
X155764100Y-89306400D03*
X159264100Y-89306400D03*
X158764100Y-89306400D03*
X157264100Y-89306400D03*
X160264100Y-89306400D03*
X159764100Y-89306400D03*
X123717300Y-89306400D03*
X128717300Y-89306400D03*
X127217300Y-89306400D03*
X127717300Y-89306400D03*
X125217300Y-89306400D03*
X124717300Y-89306400D03*
X123217300Y-89306400D03*
X128217300Y-89306400D03*
X124217300Y-89306400D03*
X126717300Y-89306400D03*
X126217300Y-89306400D03*
X125717300Y-89306400D03*
D11*
X145237200Y-79590800D03*
X145237200Y-81165800D03*
D30*
X136456420Y-89306400D03*
X139969240Y-89306400D03*
X140472160Y-89306400D03*
X137960100Y-89306400D03*
X138460100Y-89306400D03*
X136960100Y-89306400D03*
X139460100Y-89306400D03*
X138960100Y-89306400D03*
X137460100Y-89306400D03*
D31*
X144678400Y-74371200D03*
D32*
X147178400Y-74371200D03*
X149678400Y-74371200D03*
X144678400Y-77671200D03*
X147178400Y-77671200D03*
X149678400Y-77671200D03*
D33*
X144520320Y-85870140D03*
X144520320Y-86520140D03*
X144520320Y-87170140D03*
X144520320Y-87820140D03*
X147620320Y-87820140D03*
X147620320Y-87170140D03*
X147620320Y-86520140D03*
X147620320Y-85870140D03*
D34*
X146070320Y-86845140D03*
D30*
X141688820Y-89308940D03*
X134884160Y-89308940D03*
D35*
X130874400Y-80666300D03*
D36*
X130799400Y-81203800D03*
D35*
X130874400Y-81741300D03*
X132574400Y-81741300D03*
D36*
X132649400Y-81203800D03*
D35*
X132574400Y-80666300D03*
D37*
X146276300Y-84388200D03*
X147576300Y-84388200D03*
X146926300Y-82388200D03*
M02*
