%TF.GenerationSoftware,KiCad,Pcbnew,(6.0.10)*%
%TF.CreationDate,2023-01-24T10:04:16-05:00*%
%TF.ProjectId,vulcan_portal,76756c63-616e-45f7-906f-7274616c2e6b,rev?*%
%TF.SameCoordinates,Original*%
%TF.FileFunction,Drillmap*%
%TF.FilePolarity,Positive*%
%FSLAX45Y45*%
G04 Gerber Fmt 4.5, Leading zero omitted, Abs format (unit mm)*
G04 Created by KiCad (PCBNEW (6.0.10)) date 2023-01-24 10:04:16*
%MOMM*%
%LPD*%
G01*
G04 APERTURE LIST*
%ADD10C,0.050000*%
%ADD11C,0.200000*%
%ADD12C,0.030000*%
%ADD13C,0.065000*%
%ADD14C,0.370000*%
G04 APERTURE END LIST*
D10*
X12960460Y-7340400D02*
X15350860Y-7340400D01*
X14260500Y-8915400D02*
X15350860Y-8915400D01*
X13500100Y-9015400D02*
G75*
G03*
X13400100Y-8915400I-100000J0D01*
G01*
X15450900Y-9397800D02*
G75*
G03*
X16065500Y-9397800I307300J0D01*
G01*
X12280900Y-8915400D02*
X12280900Y-7340600D01*
X12985460Y-8915400D02*
G75*
G03*
X12885460Y-9015400I0J-100000D01*
G01*
X16065500Y-8763000D02*
X16065500Y-8915400D01*
X14260500Y-8915400D02*
G75*
G03*
X14160500Y-9015400I0J-100000D01*
G01*
X16065540Y-6857800D02*
G75*
G03*
X15450860Y-6857800I-307340J0D01*
G01*
X15450860Y-6857800D02*
X15450860Y-7240400D01*
X12885460Y-7265400D02*
G75*
G03*
X12960460Y-7340400I75000J0D01*
G01*
X14160500Y-9328000D02*
X14160500Y-9015400D01*
X15350860Y-7340400D02*
G75*
G03*
X15450860Y-7240400I0J100000D01*
G01*
X16065500Y-8763000D02*
X16065500Y-7493000D01*
X15450900Y-9397800D02*
X15450860Y-9015400D01*
X16065500Y-7340600D02*
X16065540Y-6857800D01*
X15450860Y-9015400D02*
G75*
G03*
X15350860Y-8915400I-100000J0D01*
G01*
X12885500Y-9397800D02*
X12885460Y-9015400D01*
X14160500Y-9328000D02*
X13500080Y-9328000D01*
X16065500Y-8915400D02*
X16065500Y-9397800D01*
X13400100Y-8915400D02*
X12985460Y-8915400D01*
X16065500Y-7493000D02*
X16065500Y-7340600D01*
X12885500Y-6857800D02*
G75*
G03*
X12280900Y-6857800I-302300J0D01*
G01*
X12280900Y-7340600D02*
X12280900Y-6857800D01*
X12885500Y-6857800D02*
X12885460Y-7265400D01*
X12280900Y-9397800D02*
G75*
G03*
X12885500Y-9397800I302300J0D01*
G01*
X12280900Y-8915400D02*
X12280900Y-9397800D01*
X13500080Y-9328000D02*
X13500100Y-9015400D01*
D11*
D12*
X12300190Y-7300200D02*
X12330190Y-7330200D01*
X12330190Y-7300200D02*
X12300190Y-7330200D01*
X12306730Y-8915640D02*
X12336730Y-8945640D01*
X12336730Y-8915640D02*
X12306730Y-8945640D01*
X12350190Y-7300200D02*
X12380190Y-7330200D01*
X12380190Y-7300200D02*
X12350190Y-7330200D01*
X12356730Y-8915640D02*
X12386730Y-8945640D01*
X12386730Y-8915640D02*
X12356730Y-8945640D01*
X12400190Y-7300200D02*
X12430190Y-7330200D01*
X12430190Y-7300200D02*
X12400190Y-7330200D01*
X12406730Y-8915640D02*
X12436730Y-8945640D01*
X12436730Y-8915640D02*
X12406730Y-8945640D01*
X12450190Y-7300200D02*
X12480190Y-7330200D01*
X12480190Y-7300200D02*
X12450190Y-7330200D01*
X12456730Y-8915640D02*
X12486730Y-8945640D01*
X12486730Y-8915640D02*
X12456730Y-8945640D01*
X12500190Y-7300200D02*
X12530190Y-7330200D01*
X12530190Y-7300200D02*
X12500190Y-7330200D01*
X12506730Y-8915640D02*
X12536730Y-8945640D01*
X12536730Y-8915640D02*
X12506730Y-8945640D01*
X12550190Y-7300200D02*
X12580190Y-7330200D01*
X12580190Y-7300200D02*
X12550190Y-7330200D01*
X12556730Y-8915640D02*
X12586730Y-8945640D01*
X12586730Y-8915640D02*
X12556730Y-8945640D01*
X12600190Y-7300200D02*
X12630190Y-7330200D01*
X12630190Y-7300200D02*
X12600190Y-7330200D01*
X12606730Y-8915640D02*
X12636730Y-8945640D01*
X12636730Y-8915640D02*
X12606730Y-8945640D01*
X12650190Y-7300200D02*
X12680190Y-7330200D01*
X12680190Y-7300200D02*
X12650190Y-7330200D01*
X12656730Y-8915640D02*
X12686730Y-8945640D01*
X12686730Y-8915640D02*
X12656730Y-8945640D01*
X12700190Y-7300200D02*
X12730190Y-7330200D01*
X12730190Y-7300200D02*
X12700190Y-7330200D01*
X12706730Y-8915640D02*
X12736730Y-8945640D01*
X12736730Y-8915640D02*
X12706730Y-8945640D01*
X12750190Y-7300200D02*
X12780190Y-7330200D01*
X12780190Y-7300200D02*
X12750190Y-7330200D01*
X12756730Y-8915640D02*
X12786730Y-8945640D01*
X12786730Y-8915640D02*
X12756730Y-8945640D01*
X12800190Y-7300200D02*
X12830190Y-7330200D01*
X12830190Y-7300200D02*
X12800190Y-7330200D01*
X12806730Y-8915640D02*
X12836730Y-8945640D01*
X12836730Y-8915640D02*
X12806730Y-8945640D01*
X12850190Y-7300200D02*
X12880190Y-7330200D01*
X12880190Y-7300200D02*
X12850190Y-7330200D01*
X12856730Y-8915640D02*
X12886730Y-8945640D01*
X12886730Y-8915640D02*
X12856730Y-8945640D01*
X13473416Y-8915894D02*
X13503416Y-8945894D01*
X13503416Y-8915894D02*
X13473416Y-8945894D01*
X13630642Y-8915640D02*
X13660642Y-8945640D01*
X13660642Y-8915640D02*
X13630642Y-8945640D01*
X13681010Y-8915640D02*
X13711010Y-8945640D01*
X13711010Y-8915640D02*
X13681010Y-8945640D01*
X13731010Y-8915640D02*
X13761010Y-8945640D01*
X13761010Y-8915640D02*
X13731010Y-8945640D01*
X13781010Y-8915640D02*
X13811010Y-8945640D01*
X13811010Y-8915640D02*
X13781010Y-8945640D01*
X13831010Y-8915640D02*
X13861010Y-8945640D01*
X13861010Y-8915640D02*
X13831010Y-8945640D01*
X13881010Y-8915640D02*
X13911010Y-8945640D01*
X13911010Y-8915640D02*
X13881010Y-8945640D01*
X13931010Y-8915640D02*
X13961010Y-8945640D01*
X13961010Y-8915640D02*
X13931010Y-8945640D01*
X13981924Y-8915640D02*
X14011924Y-8945640D01*
X14011924Y-8915640D02*
X13981924Y-8945640D01*
X14032216Y-8915640D02*
X14062216Y-8945640D01*
X14062216Y-8915640D02*
X14032216Y-8945640D01*
X14153882Y-8915894D02*
X14183882Y-8945894D01*
X14183882Y-8915894D02*
X14153882Y-8945894D01*
X15456330Y-7300200D02*
X15486330Y-7330200D01*
X15486330Y-7300200D02*
X15456330Y-7330200D01*
X15461410Y-8915640D02*
X15491410Y-8945640D01*
X15491410Y-8915640D02*
X15461410Y-8945640D01*
X15506330Y-7300200D02*
X15536330Y-7330200D01*
X15536330Y-7300200D02*
X15506330Y-7330200D01*
X15511410Y-8915640D02*
X15541410Y-8945640D01*
X15541410Y-8915640D02*
X15511410Y-8945640D01*
X15556330Y-7300200D02*
X15586330Y-7330200D01*
X15586330Y-7300200D02*
X15556330Y-7330200D01*
X15561410Y-8915640D02*
X15591410Y-8945640D01*
X15591410Y-8915640D02*
X15561410Y-8945640D01*
X15606330Y-7300200D02*
X15636330Y-7330200D01*
X15636330Y-7300200D02*
X15606330Y-7330200D01*
X15611410Y-8915640D02*
X15641410Y-8945640D01*
X15641410Y-8915640D02*
X15611410Y-8945640D01*
X15656330Y-7300200D02*
X15686330Y-7330200D01*
X15686330Y-7300200D02*
X15656330Y-7330200D01*
X15661410Y-8915640D02*
X15691410Y-8945640D01*
X15691410Y-8915640D02*
X15661410Y-8945640D01*
X15706330Y-7300200D02*
X15736330Y-7330200D01*
X15736330Y-7300200D02*
X15706330Y-7330200D01*
X15711410Y-8915640D02*
X15741410Y-8945640D01*
X15741410Y-8915640D02*
X15711410Y-8945640D01*
X15756330Y-7300200D02*
X15786330Y-7330200D01*
X15786330Y-7300200D02*
X15756330Y-7330200D01*
X15761410Y-8915640D02*
X15791410Y-8945640D01*
X15791410Y-8915640D02*
X15761410Y-8945640D01*
X15806330Y-7300200D02*
X15836330Y-7330200D01*
X15836330Y-7300200D02*
X15806330Y-7330200D01*
X15811410Y-8915640D02*
X15841410Y-8945640D01*
X15841410Y-8915640D02*
X15811410Y-8945640D01*
X15856330Y-7300200D02*
X15886330Y-7330200D01*
X15886330Y-7300200D02*
X15856330Y-7330200D01*
X15861410Y-8915640D02*
X15891410Y-8945640D01*
X15891410Y-8915640D02*
X15861410Y-8945640D01*
X15906330Y-7300200D02*
X15936330Y-7330200D01*
X15936330Y-7300200D02*
X15906330Y-7330200D01*
X15911410Y-8915640D02*
X15941410Y-8945640D01*
X15941410Y-8915640D02*
X15911410Y-8945640D01*
X15956330Y-7300200D02*
X15986330Y-7330200D01*
X15986330Y-7300200D02*
X15956330Y-7330200D01*
X15961410Y-8915640D02*
X15991410Y-8945640D01*
X15991410Y-8915640D02*
X15961410Y-8945640D01*
X16006330Y-7300200D02*
X16036330Y-7330200D01*
X16036330Y-7300200D02*
X16006330Y-7330200D01*
X16011410Y-8915640D02*
X16041410Y-8945640D01*
X16041410Y-8915640D02*
X16011410Y-8945640D01*
D13*
X12761908Y-7834228D02*
G75*
G03*
X12761908Y-7834228I-32500J0D01*
G01*
X12761908Y-8412228D02*
G75*
G03*
X12761908Y-8412228I-32500J0D01*
G01*
D14*
X12583200Y-6672800D02*
X12583200Y-7042800D01*
X12398200Y-6857800D02*
X12768200Y-6857800D01*
X12583200Y-9212800D02*
X12583200Y-9582800D01*
X12398200Y-9397800D02*
X12768200Y-9397800D01*
X15758200Y-6672800D02*
X15758200Y-7042800D01*
X15573200Y-6857800D02*
X15943200Y-6857800D01*
X15758200Y-9212800D02*
X15758200Y-9582800D01*
X15573200Y-9397800D02*
X15943200Y-9397800D01*
D11*
X12536019Y-10018076D02*
X12536019Y-9818076D01*
X12583638Y-9818076D01*
X12612209Y-9827600D01*
X12631257Y-9846648D01*
X12640781Y-9865695D01*
X12650305Y-9903790D01*
X12650305Y-9932362D01*
X12640781Y-9970457D01*
X12631257Y-9989505D01*
X12612209Y-10008552D01*
X12583638Y-10018076D01*
X12536019Y-10018076D01*
X12736019Y-10018076D02*
X12736019Y-9884743D01*
X12736019Y-9922838D02*
X12745543Y-9903790D01*
X12755067Y-9894267D01*
X12774114Y-9884743D01*
X12793162Y-9884743D01*
X12859828Y-10018076D02*
X12859828Y-9884743D01*
X12859828Y-9818076D02*
X12850305Y-9827600D01*
X12859828Y-9837124D01*
X12869352Y-9827600D01*
X12859828Y-9818076D01*
X12859828Y-9837124D01*
X12983638Y-10018076D02*
X12964590Y-10008552D01*
X12955067Y-9989505D01*
X12955067Y-9818076D01*
X13088400Y-10018076D02*
X13069352Y-10008552D01*
X13059828Y-9989505D01*
X13059828Y-9818076D01*
X13316971Y-10018076D02*
X13316971Y-9818076D01*
X13383638Y-9960933D01*
X13450305Y-9818076D01*
X13450305Y-10018076D01*
X13631257Y-10018076D02*
X13631257Y-9913314D01*
X13621733Y-9894267D01*
X13602686Y-9884743D01*
X13564590Y-9884743D01*
X13545543Y-9894267D01*
X13631257Y-10008552D02*
X13612209Y-10018076D01*
X13564590Y-10018076D01*
X13545543Y-10008552D01*
X13536019Y-9989505D01*
X13536019Y-9970457D01*
X13545543Y-9951410D01*
X13564590Y-9941886D01*
X13612209Y-9941886D01*
X13631257Y-9932362D01*
X13726495Y-9884743D02*
X13726495Y-10084743D01*
X13726495Y-9894267D02*
X13745543Y-9884743D01*
X13783638Y-9884743D01*
X13802686Y-9894267D01*
X13812209Y-9903790D01*
X13821733Y-9922838D01*
X13821733Y-9979981D01*
X13812209Y-9999029D01*
X13802686Y-10008552D01*
X13783638Y-10018076D01*
X13745543Y-10018076D01*
X13726495Y-10008552D01*
X13907448Y-9999029D02*
X13916971Y-10008552D01*
X13907448Y-10018076D01*
X13897924Y-10008552D01*
X13907448Y-9999029D01*
X13907448Y-10018076D01*
X13907448Y-9894267D02*
X13916971Y-9903790D01*
X13907448Y-9913314D01*
X13897924Y-9903790D01*
X13907448Y-9894267D01*
X13907448Y-9913314D01*
D12*
X12248400Y-10332600D02*
X12278400Y-10362600D01*
X12278400Y-10332600D02*
X12248400Y-10362600D01*
D11*
X12574114Y-10238076D02*
X12593162Y-10238076D01*
X12612209Y-10247600D01*
X12621733Y-10257124D01*
X12631257Y-10276171D01*
X12640781Y-10314267D01*
X12640781Y-10361886D01*
X12631257Y-10399981D01*
X12621733Y-10419029D01*
X12612209Y-10428552D01*
X12593162Y-10438076D01*
X12574114Y-10438076D01*
X12555067Y-10428552D01*
X12545543Y-10419029D01*
X12536019Y-10399981D01*
X12526495Y-10361886D01*
X12526495Y-10314267D01*
X12536019Y-10276171D01*
X12545543Y-10257124D01*
X12555067Y-10247600D01*
X12574114Y-10238076D01*
X12726495Y-10419029D02*
X12736019Y-10428552D01*
X12726495Y-10438076D01*
X12716971Y-10428552D01*
X12726495Y-10419029D01*
X12726495Y-10438076D01*
X12802686Y-10238076D02*
X12926495Y-10238076D01*
X12859828Y-10314267D01*
X12888400Y-10314267D01*
X12907448Y-10323790D01*
X12916971Y-10333314D01*
X12926495Y-10352362D01*
X12926495Y-10399981D01*
X12916971Y-10419029D01*
X12907448Y-10428552D01*
X12888400Y-10438076D01*
X12831257Y-10438076D01*
X12812209Y-10428552D01*
X12802686Y-10419029D01*
X13050305Y-10238076D02*
X13069352Y-10238076D01*
X13088400Y-10247600D01*
X13097924Y-10257124D01*
X13107448Y-10276171D01*
X13116971Y-10314267D01*
X13116971Y-10361886D01*
X13107448Y-10399981D01*
X13097924Y-10419029D01*
X13088400Y-10428552D01*
X13069352Y-10438076D01*
X13050305Y-10438076D01*
X13031257Y-10428552D01*
X13021733Y-10419029D01*
X13012209Y-10399981D01*
X13002686Y-10361886D01*
X13002686Y-10314267D01*
X13012209Y-10276171D01*
X13021733Y-10257124D01*
X13031257Y-10247600D01*
X13050305Y-10238076D01*
X13240781Y-10238076D02*
X13259828Y-10238076D01*
X13278876Y-10247600D01*
X13288400Y-10257124D01*
X13297924Y-10276171D01*
X13307448Y-10314267D01*
X13307448Y-10361886D01*
X13297924Y-10399981D01*
X13288400Y-10419029D01*
X13278876Y-10428552D01*
X13259828Y-10438076D01*
X13240781Y-10438076D01*
X13221733Y-10428552D01*
X13212209Y-10419029D01*
X13202686Y-10399981D01*
X13193162Y-10361886D01*
X13193162Y-10314267D01*
X13202686Y-10276171D01*
X13212209Y-10257124D01*
X13221733Y-10247600D01*
X13240781Y-10238076D01*
X13393162Y-10438076D02*
X13393162Y-10304743D01*
X13393162Y-10323790D02*
X13402686Y-10314267D01*
X13421733Y-10304743D01*
X13450305Y-10304743D01*
X13469352Y-10314267D01*
X13478876Y-10333314D01*
X13478876Y-10438076D01*
X13478876Y-10333314D02*
X13488400Y-10314267D01*
X13507448Y-10304743D01*
X13536019Y-10304743D01*
X13555067Y-10314267D01*
X13564590Y-10333314D01*
X13564590Y-10438076D01*
X13659828Y-10438076D02*
X13659828Y-10304743D01*
X13659828Y-10323790D02*
X13669352Y-10314267D01*
X13688400Y-10304743D01*
X13716971Y-10304743D01*
X13736019Y-10314267D01*
X13745543Y-10333314D01*
X13745543Y-10438076D01*
X13745543Y-10333314D02*
X13755067Y-10314267D01*
X13774114Y-10304743D01*
X13802686Y-10304743D01*
X13821733Y-10314267D01*
X13831257Y-10333314D01*
X13831257Y-10438076D01*
X14221733Y-10228552D02*
X14050305Y-10485695D01*
X14478876Y-10238076D02*
X14497924Y-10238076D01*
X14516971Y-10247600D01*
X14526495Y-10257124D01*
X14536019Y-10276171D01*
X14545543Y-10314267D01*
X14545543Y-10361886D01*
X14536019Y-10399981D01*
X14526495Y-10419029D01*
X14516971Y-10428552D01*
X14497924Y-10438076D01*
X14478876Y-10438076D01*
X14459828Y-10428552D01*
X14450305Y-10419029D01*
X14440781Y-10399981D01*
X14431257Y-10361886D01*
X14431257Y-10314267D01*
X14440781Y-10276171D01*
X14450305Y-10257124D01*
X14459828Y-10247600D01*
X14478876Y-10238076D01*
X14631257Y-10419029D02*
X14640781Y-10428552D01*
X14631257Y-10438076D01*
X14621733Y-10428552D01*
X14631257Y-10419029D01*
X14631257Y-10438076D01*
X14764590Y-10238076D02*
X14783638Y-10238076D01*
X14802686Y-10247600D01*
X14812209Y-10257124D01*
X14821733Y-10276171D01*
X14831257Y-10314267D01*
X14831257Y-10361886D01*
X14821733Y-10399981D01*
X14812209Y-10419029D01*
X14802686Y-10428552D01*
X14783638Y-10438076D01*
X14764590Y-10438076D01*
X14745543Y-10428552D01*
X14736019Y-10419029D01*
X14726495Y-10399981D01*
X14716971Y-10361886D01*
X14716971Y-10314267D01*
X14726495Y-10276171D01*
X14736019Y-10257124D01*
X14745543Y-10247600D01*
X14764590Y-10238076D01*
X15021733Y-10438076D02*
X14907448Y-10438076D01*
X14964590Y-10438076D02*
X14964590Y-10238076D01*
X14945543Y-10266648D01*
X14926495Y-10285695D01*
X14907448Y-10295219D01*
X15212209Y-10438076D02*
X15097924Y-10438076D01*
X15155067Y-10438076D02*
X15155067Y-10238076D01*
X15136019Y-10266648D01*
X15116971Y-10285695D01*
X15097924Y-10295219D01*
X15326495Y-10323790D02*
X15307448Y-10314267D01*
X15297924Y-10304743D01*
X15288400Y-10285695D01*
X15288400Y-10276171D01*
X15297924Y-10257124D01*
X15307448Y-10247600D01*
X15326495Y-10238076D01*
X15364590Y-10238076D01*
X15383638Y-10247600D01*
X15393162Y-10257124D01*
X15402686Y-10276171D01*
X15402686Y-10285695D01*
X15393162Y-10304743D01*
X15383638Y-10314267D01*
X15364590Y-10323790D01*
X15326495Y-10323790D01*
X15307448Y-10333314D01*
X15297924Y-10342838D01*
X15288400Y-10361886D01*
X15288400Y-10399981D01*
X15297924Y-10419029D01*
X15307448Y-10428552D01*
X15326495Y-10438076D01*
X15364590Y-10438076D01*
X15383638Y-10428552D01*
X15393162Y-10419029D01*
X15402686Y-10399981D01*
X15402686Y-10361886D01*
X15393162Y-10342838D01*
X15383638Y-10333314D01*
X15364590Y-10323790D01*
X15478876Y-10238076D02*
X15478876Y-10276171D01*
X15555067Y-10238076D02*
X15555067Y-10276171D01*
X15850305Y-10514267D02*
X15840781Y-10504743D01*
X15821733Y-10476171D01*
X15812209Y-10457124D01*
X15802686Y-10428552D01*
X15793162Y-10380933D01*
X15793162Y-10342838D01*
X15802686Y-10295219D01*
X15812209Y-10266648D01*
X15821733Y-10247600D01*
X15840781Y-10219029D01*
X15850305Y-10209505D01*
X16021733Y-10238076D02*
X15926495Y-10238076D01*
X15916971Y-10333314D01*
X15926495Y-10323790D01*
X15945543Y-10314267D01*
X15993162Y-10314267D01*
X16012209Y-10323790D01*
X16021733Y-10333314D01*
X16031257Y-10352362D01*
X16031257Y-10399981D01*
X16021733Y-10419029D01*
X16012209Y-10428552D01*
X15993162Y-10438076D01*
X15945543Y-10438076D01*
X15926495Y-10428552D01*
X15916971Y-10419029D01*
X16126495Y-10438076D02*
X16164590Y-10438076D01*
X16183638Y-10428552D01*
X16193162Y-10419029D01*
X16212209Y-10390457D01*
X16221733Y-10352362D01*
X16221733Y-10276171D01*
X16212209Y-10257124D01*
X16202686Y-10247600D01*
X16183638Y-10238076D01*
X16145543Y-10238076D01*
X16126495Y-10247600D01*
X16116971Y-10257124D01*
X16107448Y-10276171D01*
X16107448Y-10323790D01*
X16116971Y-10342838D01*
X16126495Y-10352362D01*
X16145543Y-10361886D01*
X16183638Y-10361886D01*
X16202686Y-10352362D01*
X16212209Y-10342838D01*
X16221733Y-10323790D01*
X16459828Y-10438076D02*
X16459828Y-10238076D01*
X16545543Y-10438076D02*
X16545543Y-10333314D01*
X16536019Y-10314267D01*
X16516971Y-10304743D01*
X16488400Y-10304743D01*
X16469352Y-10314267D01*
X16459828Y-10323790D01*
X16669352Y-10438076D02*
X16650305Y-10428552D01*
X16640781Y-10419029D01*
X16631257Y-10399981D01*
X16631257Y-10342838D01*
X16640781Y-10323790D01*
X16650305Y-10314267D01*
X16669352Y-10304743D01*
X16697924Y-10304743D01*
X16716971Y-10314267D01*
X16726495Y-10323790D01*
X16736019Y-10342838D01*
X16736019Y-10399981D01*
X16726495Y-10419029D01*
X16716971Y-10428552D01*
X16697924Y-10438076D01*
X16669352Y-10438076D01*
X16850305Y-10438076D02*
X16831257Y-10428552D01*
X16821733Y-10409505D01*
X16821733Y-10238076D01*
X17002686Y-10428552D02*
X16983638Y-10438076D01*
X16945543Y-10438076D01*
X16926495Y-10428552D01*
X16916971Y-10409505D01*
X16916971Y-10333314D01*
X16926495Y-10314267D01*
X16945543Y-10304743D01*
X16983638Y-10304743D01*
X17002686Y-10314267D01*
X17012210Y-10333314D01*
X17012210Y-10352362D01*
X16916971Y-10371410D01*
X17088400Y-10428552D02*
X17107448Y-10438076D01*
X17145543Y-10438076D01*
X17164590Y-10428552D01*
X17174114Y-10409505D01*
X17174114Y-10399981D01*
X17164590Y-10380933D01*
X17145543Y-10371410D01*
X17116971Y-10371410D01*
X17097924Y-10361886D01*
X17088400Y-10342838D01*
X17088400Y-10333314D01*
X17097924Y-10314267D01*
X17116971Y-10304743D01*
X17145543Y-10304743D01*
X17164590Y-10314267D01*
X17240781Y-10514267D02*
X17250305Y-10504743D01*
X17269352Y-10476171D01*
X17278876Y-10457124D01*
X17288400Y-10428552D01*
X17297924Y-10380933D01*
X17297924Y-10342838D01*
X17288400Y-10295219D01*
X17278876Y-10266648D01*
X17269352Y-10247600D01*
X17250305Y-10219029D01*
X17240781Y-10209505D01*
X17602686Y-10514267D02*
X17593162Y-10504743D01*
X17574114Y-10476171D01*
X17564590Y-10457124D01*
X17555067Y-10428552D01*
X17545543Y-10380933D01*
X17545543Y-10342838D01*
X17555067Y-10295219D01*
X17564590Y-10266648D01*
X17574114Y-10247600D01*
X17593162Y-10219029D01*
X17602686Y-10209505D01*
X17678876Y-10304743D02*
X17678876Y-10438076D01*
X17678876Y-10323790D02*
X17688400Y-10314267D01*
X17707448Y-10304743D01*
X17736019Y-10304743D01*
X17755067Y-10314267D01*
X17764590Y-10333314D01*
X17764590Y-10438076D01*
X17888400Y-10438076D02*
X17869352Y-10428552D01*
X17859829Y-10419029D01*
X17850305Y-10399981D01*
X17850305Y-10342838D01*
X17859829Y-10323790D01*
X17869352Y-10314267D01*
X17888400Y-10304743D01*
X17916971Y-10304743D01*
X17936019Y-10314267D01*
X17945543Y-10323790D01*
X17955067Y-10342838D01*
X17955067Y-10399981D01*
X17945543Y-10419029D01*
X17936019Y-10428552D01*
X17916971Y-10438076D01*
X17888400Y-10438076D01*
X18012210Y-10304743D02*
X18088400Y-10304743D01*
X18040781Y-10238076D02*
X18040781Y-10409505D01*
X18050305Y-10428552D01*
X18069352Y-10438076D01*
X18088400Y-10438076D01*
X18307448Y-10304743D02*
X18307448Y-10504743D01*
X18307448Y-10314267D02*
X18326495Y-10304743D01*
X18364590Y-10304743D01*
X18383638Y-10314267D01*
X18393162Y-10323790D01*
X18402686Y-10342838D01*
X18402686Y-10399981D01*
X18393162Y-10419029D01*
X18383638Y-10428552D01*
X18364590Y-10438076D01*
X18326495Y-10438076D01*
X18307448Y-10428552D01*
X18516971Y-10438076D02*
X18497924Y-10428552D01*
X18488400Y-10409505D01*
X18488400Y-10238076D01*
X18678876Y-10438076D02*
X18678876Y-10333314D01*
X18669352Y-10314267D01*
X18650305Y-10304743D01*
X18612210Y-10304743D01*
X18593162Y-10314267D01*
X18678876Y-10428552D02*
X18659829Y-10438076D01*
X18612210Y-10438076D01*
X18593162Y-10428552D01*
X18583638Y-10409505D01*
X18583638Y-10390457D01*
X18593162Y-10371410D01*
X18612210Y-10361886D01*
X18659829Y-10361886D01*
X18678876Y-10352362D01*
X18745543Y-10304743D02*
X18821733Y-10304743D01*
X18774114Y-10238076D02*
X18774114Y-10409505D01*
X18783638Y-10428552D01*
X18802686Y-10438076D01*
X18821733Y-10438076D01*
X18964590Y-10428552D02*
X18945543Y-10438076D01*
X18907448Y-10438076D01*
X18888400Y-10428552D01*
X18878876Y-10409505D01*
X18878876Y-10333314D01*
X18888400Y-10314267D01*
X18907448Y-10304743D01*
X18945543Y-10304743D01*
X18964590Y-10314267D01*
X18974114Y-10333314D01*
X18974114Y-10352362D01*
X18878876Y-10371410D01*
X19145543Y-10438076D02*
X19145543Y-10238076D01*
X19145543Y-10428552D02*
X19126495Y-10438076D01*
X19088400Y-10438076D01*
X19069352Y-10428552D01*
X19059829Y-10419029D01*
X19050305Y-10399981D01*
X19050305Y-10342838D01*
X19059829Y-10323790D01*
X19069352Y-10314267D01*
X19088400Y-10304743D01*
X19126495Y-10304743D01*
X19145543Y-10314267D01*
X19221733Y-10514267D02*
X19231257Y-10504743D01*
X19250305Y-10476171D01*
X19259829Y-10457124D01*
X19269352Y-10428552D01*
X19278876Y-10380933D01*
X19278876Y-10342838D01*
X19269352Y-10295219D01*
X19259829Y-10266648D01*
X19250305Y-10247600D01*
X19231257Y-10219029D01*
X19221733Y-10209505D01*
D13*
X12278400Y-10611600D02*
G75*
G03*
X12278400Y-10611600I-32500J0D01*
G01*
D11*
X12574114Y-10502076D02*
X12593162Y-10502076D01*
X12612209Y-10511600D01*
X12621733Y-10521124D01*
X12631257Y-10540171D01*
X12640781Y-10578267D01*
X12640781Y-10625886D01*
X12631257Y-10663981D01*
X12621733Y-10683029D01*
X12612209Y-10692552D01*
X12593162Y-10702076D01*
X12574114Y-10702076D01*
X12555067Y-10692552D01*
X12545543Y-10683029D01*
X12536019Y-10663981D01*
X12526495Y-10625886D01*
X12526495Y-10578267D01*
X12536019Y-10540171D01*
X12545543Y-10521124D01*
X12555067Y-10511600D01*
X12574114Y-10502076D01*
X12726495Y-10683029D02*
X12736019Y-10692552D01*
X12726495Y-10702076D01*
X12716971Y-10692552D01*
X12726495Y-10683029D01*
X12726495Y-10702076D01*
X12907448Y-10502076D02*
X12869352Y-10502076D01*
X12850305Y-10511600D01*
X12840781Y-10521124D01*
X12821733Y-10549695D01*
X12812209Y-10587790D01*
X12812209Y-10663981D01*
X12821733Y-10683029D01*
X12831257Y-10692552D01*
X12850305Y-10702076D01*
X12888400Y-10702076D01*
X12907448Y-10692552D01*
X12916971Y-10683029D01*
X12926495Y-10663981D01*
X12926495Y-10616362D01*
X12916971Y-10597314D01*
X12907448Y-10587790D01*
X12888400Y-10578267D01*
X12850305Y-10578267D01*
X12831257Y-10587790D01*
X12821733Y-10597314D01*
X12812209Y-10616362D01*
X13107448Y-10502076D02*
X13012209Y-10502076D01*
X13002686Y-10597314D01*
X13012209Y-10587790D01*
X13031257Y-10578267D01*
X13078876Y-10578267D01*
X13097924Y-10587790D01*
X13107448Y-10597314D01*
X13116971Y-10616362D01*
X13116971Y-10663981D01*
X13107448Y-10683029D01*
X13097924Y-10692552D01*
X13078876Y-10702076D01*
X13031257Y-10702076D01*
X13012209Y-10692552D01*
X13002686Y-10683029D01*
X13240781Y-10502076D02*
X13259828Y-10502076D01*
X13278876Y-10511600D01*
X13288400Y-10521124D01*
X13297924Y-10540171D01*
X13307448Y-10578267D01*
X13307448Y-10625886D01*
X13297924Y-10663981D01*
X13288400Y-10683029D01*
X13278876Y-10692552D01*
X13259828Y-10702076D01*
X13240781Y-10702076D01*
X13221733Y-10692552D01*
X13212209Y-10683029D01*
X13202686Y-10663981D01*
X13193162Y-10625886D01*
X13193162Y-10578267D01*
X13202686Y-10540171D01*
X13212209Y-10521124D01*
X13221733Y-10511600D01*
X13240781Y-10502076D01*
X13393162Y-10702076D02*
X13393162Y-10568743D01*
X13393162Y-10587790D02*
X13402686Y-10578267D01*
X13421733Y-10568743D01*
X13450305Y-10568743D01*
X13469352Y-10578267D01*
X13478876Y-10597314D01*
X13478876Y-10702076D01*
X13478876Y-10597314D02*
X13488400Y-10578267D01*
X13507448Y-10568743D01*
X13536019Y-10568743D01*
X13555067Y-10578267D01*
X13564590Y-10597314D01*
X13564590Y-10702076D01*
X13659828Y-10702076D02*
X13659828Y-10568743D01*
X13659828Y-10587790D02*
X13669352Y-10578267D01*
X13688400Y-10568743D01*
X13716971Y-10568743D01*
X13736019Y-10578267D01*
X13745543Y-10597314D01*
X13745543Y-10702076D01*
X13745543Y-10597314D02*
X13755067Y-10578267D01*
X13774114Y-10568743D01*
X13802686Y-10568743D01*
X13821733Y-10578267D01*
X13831257Y-10597314D01*
X13831257Y-10702076D01*
X14221733Y-10492552D02*
X14050305Y-10749695D01*
X14478876Y-10502076D02*
X14497924Y-10502076D01*
X14516971Y-10511600D01*
X14526495Y-10521124D01*
X14536019Y-10540171D01*
X14545543Y-10578267D01*
X14545543Y-10625886D01*
X14536019Y-10663981D01*
X14526495Y-10683029D01*
X14516971Y-10692552D01*
X14497924Y-10702076D01*
X14478876Y-10702076D01*
X14459828Y-10692552D01*
X14450305Y-10683029D01*
X14440781Y-10663981D01*
X14431257Y-10625886D01*
X14431257Y-10578267D01*
X14440781Y-10540171D01*
X14450305Y-10521124D01*
X14459828Y-10511600D01*
X14478876Y-10502076D01*
X14631257Y-10683029D02*
X14640781Y-10692552D01*
X14631257Y-10702076D01*
X14621733Y-10692552D01*
X14631257Y-10683029D01*
X14631257Y-10702076D01*
X14764590Y-10502076D02*
X14783638Y-10502076D01*
X14802686Y-10511600D01*
X14812209Y-10521124D01*
X14821733Y-10540171D01*
X14831257Y-10578267D01*
X14831257Y-10625886D01*
X14821733Y-10663981D01*
X14812209Y-10683029D01*
X14802686Y-10692552D01*
X14783638Y-10702076D01*
X14764590Y-10702076D01*
X14745543Y-10692552D01*
X14736019Y-10683029D01*
X14726495Y-10663981D01*
X14716971Y-10625886D01*
X14716971Y-10578267D01*
X14726495Y-10540171D01*
X14736019Y-10521124D01*
X14745543Y-10511600D01*
X14764590Y-10502076D01*
X14907448Y-10521124D02*
X14916971Y-10511600D01*
X14936019Y-10502076D01*
X14983638Y-10502076D01*
X15002686Y-10511600D01*
X15012209Y-10521124D01*
X15021733Y-10540171D01*
X15021733Y-10559219D01*
X15012209Y-10587790D01*
X14897924Y-10702076D01*
X15021733Y-10702076D01*
X15202686Y-10502076D02*
X15107448Y-10502076D01*
X15097924Y-10597314D01*
X15107448Y-10587790D01*
X15126495Y-10578267D01*
X15174114Y-10578267D01*
X15193162Y-10587790D01*
X15202686Y-10597314D01*
X15212209Y-10616362D01*
X15212209Y-10663981D01*
X15202686Y-10683029D01*
X15193162Y-10692552D01*
X15174114Y-10702076D01*
X15126495Y-10702076D01*
X15107448Y-10692552D01*
X15097924Y-10683029D01*
X15383638Y-10502076D02*
X15345543Y-10502076D01*
X15326495Y-10511600D01*
X15316971Y-10521124D01*
X15297924Y-10549695D01*
X15288400Y-10587790D01*
X15288400Y-10663981D01*
X15297924Y-10683029D01*
X15307448Y-10692552D01*
X15326495Y-10702076D01*
X15364590Y-10702076D01*
X15383638Y-10692552D01*
X15393162Y-10683029D01*
X15402686Y-10663981D01*
X15402686Y-10616362D01*
X15393162Y-10597314D01*
X15383638Y-10587790D01*
X15364590Y-10578267D01*
X15326495Y-10578267D01*
X15307448Y-10587790D01*
X15297924Y-10597314D01*
X15288400Y-10616362D01*
X15478876Y-10502076D02*
X15478876Y-10540171D01*
X15555067Y-10502076D02*
X15555067Y-10540171D01*
X15850305Y-10778267D02*
X15840781Y-10768743D01*
X15821733Y-10740171D01*
X15812209Y-10721124D01*
X15802686Y-10692552D01*
X15793162Y-10644933D01*
X15793162Y-10606838D01*
X15802686Y-10559219D01*
X15812209Y-10530648D01*
X15821733Y-10511600D01*
X15840781Y-10483029D01*
X15850305Y-10473505D01*
X15916971Y-10521124D02*
X15926495Y-10511600D01*
X15945543Y-10502076D01*
X15993162Y-10502076D01*
X16012209Y-10511600D01*
X16021733Y-10521124D01*
X16031257Y-10540171D01*
X16031257Y-10559219D01*
X16021733Y-10587790D01*
X15907448Y-10702076D01*
X16031257Y-10702076D01*
X16269352Y-10702076D02*
X16269352Y-10502076D01*
X16355067Y-10702076D02*
X16355067Y-10597314D01*
X16345543Y-10578267D01*
X16326495Y-10568743D01*
X16297924Y-10568743D01*
X16278876Y-10578267D01*
X16269352Y-10587790D01*
X16478876Y-10702076D02*
X16459828Y-10692552D01*
X16450305Y-10683029D01*
X16440781Y-10663981D01*
X16440781Y-10606838D01*
X16450305Y-10587790D01*
X16459828Y-10578267D01*
X16478876Y-10568743D01*
X16507448Y-10568743D01*
X16526495Y-10578267D01*
X16536019Y-10587790D01*
X16545543Y-10606838D01*
X16545543Y-10663981D01*
X16536019Y-10683029D01*
X16526495Y-10692552D01*
X16507448Y-10702076D01*
X16478876Y-10702076D01*
X16659828Y-10702076D02*
X16640781Y-10692552D01*
X16631257Y-10673505D01*
X16631257Y-10502076D01*
X16812210Y-10692552D02*
X16793162Y-10702076D01*
X16755067Y-10702076D01*
X16736019Y-10692552D01*
X16726495Y-10673505D01*
X16726495Y-10597314D01*
X16736019Y-10578267D01*
X16755067Y-10568743D01*
X16793162Y-10568743D01*
X16812210Y-10578267D01*
X16821733Y-10597314D01*
X16821733Y-10616362D01*
X16726495Y-10635410D01*
X16897924Y-10692552D02*
X16916971Y-10702076D01*
X16955067Y-10702076D01*
X16974114Y-10692552D01*
X16983638Y-10673505D01*
X16983638Y-10663981D01*
X16974114Y-10644933D01*
X16955067Y-10635410D01*
X16926495Y-10635410D01*
X16907448Y-10625886D01*
X16897924Y-10606838D01*
X16897924Y-10597314D01*
X16907448Y-10578267D01*
X16926495Y-10568743D01*
X16955067Y-10568743D01*
X16974114Y-10578267D01*
X17050305Y-10778267D02*
X17059829Y-10768743D01*
X17078876Y-10740171D01*
X17088400Y-10721124D01*
X17097924Y-10692552D01*
X17107448Y-10644933D01*
X17107448Y-10606838D01*
X17097924Y-10559219D01*
X17088400Y-10530648D01*
X17078876Y-10511600D01*
X17059829Y-10483029D01*
X17050305Y-10473505D01*
X17412210Y-10778267D02*
X17402686Y-10768743D01*
X17383638Y-10740171D01*
X17374114Y-10721124D01*
X17364590Y-10692552D01*
X17355067Y-10644933D01*
X17355067Y-10606838D01*
X17364590Y-10559219D01*
X17374114Y-10530648D01*
X17383638Y-10511600D01*
X17402686Y-10483029D01*
X17412210Y-10473505D01*
X17488400Y-10568743D02*
X17488400Y-10702076D01*
X17488400Y-10587790D02*
X17497924Y-10578267D01*
X17516971Y-10568743D01*
X17545543Y-10568743D01*
X17564590Y-10578267D01*
X17574114Y-10597314D01*
X17574114Y-10702076D01*
X17697924Y-10702076D02*
X17678876Y-10692552D01*
X17669352Y-10683029D01*
X17659829Y-10663981D01*
X17659829Y-10606838D01*
X17669352Y-10587790D01*
X17678876Y-10578267D01*
X17697924Y-10568743D01*
X17726495Y-10568743D01*
X17745543Y-10578267D01*
X17755067Y-10587790D01*
X17764590Y-10606838D01*
X17764590Y-10663981D01*
X17755067Y-10683029D01*
X17745543Y-10692552D01*
X17726495Y-10702076D01*
X17697924Y-10702076D01*
X17821733Y-10568743D02*
X17897924Y-10568743D01*
X17850305Y-10502076D02*
X17850305Y-10673505D01*
X17859829Y-10692552D01*
X17878876Y-10702076D01*
X17897924Y-10702076D01*
X18116971Y-10568743D02*
X18116971Y-10768743D01*
X18116971Y-10578267D02*
X18136019Y-10568743D01*
X18174114Y-10568743D01*
X18193162Y-10578267D01*
X18202686Y-10587790D01*
X18212210Y-10606838D01*
X18212210Y-10663981D01*
X18202686Y-10683029D01*
X18193162Y-10692552D01*
X18174114Y-10702076D01*
X18136019Y-10702076D01*
X18116971Y-10692552D01*
X18326495Y-10702076D02*
X18307448Y-10692552D01*
X18297924Y-10673505D01*
X18297924Y-10502076D01*
X18488400Y-10702076D02*
X18488400Y-10597314D01*
X18478876Y-10578267D01*
X18459829Y-10568743D01*
X18421733Y-10568743D01*
X18402686Y-10578267D01*
X18488400Y-10692552D02*
X18469352Y-10702076D01*
X18421733Y-10702076D01*
X18402686Y-10692552D01*
X18393162Y-10673505D01*
X18393162Y-10654457D01*
X18402686Y-10635410D01*
X18421733Y-10625886D01*
X18469352Y-10625886D01*
X18488400Y-10616362D01*
X18555067Y-10568743D02*
X18631257Y-10568743D01*
X18583638Y-10502076D02*
X18583638Y-10673505D01*
X18593162Y-10692552D01*
X18612210Y-10702076D01*
X18631257Y-10702076D01*
X18774114Y-10692552D02*
X18755067Y-10702076D01*
X18716971Y-10702076D01*
X18697924Y-10692552D01*
X18688400Y-10673505D01*
X18688400Y-10597314D01*
X18697924Y-10578267D01*
X18716971Y-10568743D01*
X18755067Y-10568743D01*
X18774114Y-10578267D01*
X18783638Y-10597314D01*
X18783638Y-10616362D01*
X18688400Y-10635410D01*
X18955067Y-10702076D02*
X18955067Y-10502076D01*
X18955067Y-10692552D02*
X18936019Y-10702076D01*
X18897924Y-10702076D01*
X18878876Y-10692552D01*
X18869352Y-10683029D01*
X18859829Y-10663981D01*
X18859829Y-10606838D01*
X18869352Y-10587790D01*
X18878876Y-10578267D01*
X18897924Y-10568743D01*
X18936019Y-10568743D01*
X18955067Y-10578267D01*
X19031257Y-10778267D02*
X19040781Y-10768743D01*
X19059829Y-10740171D01*
X19069352Y-10721124D01*
X19078876Y-10692552D01*
X19088400Y-10644933D01*
X19088400Y-10606838D01*
X19078876Y-10559219D01*
X19069352Y-10530648D01*
X19059829Y-10511600D01*
X19040781Y-10483029D01*
X19031257Y-10473505D01*
X12178400Y-10775600D02*
X12178400Y-10975600D01*
X12078400Y-10875600D02*
X12278400Y-10875600D01*
X12516971Y-10766076D02*
X12640781Y-10766076D01*
X12574114Y-10842267D01*
X12602686Y-10842267D01*
X12621733Y-10851790D01*
X12631257Y-10861314D01*
X12640781Y-10880362D01*
X12640781Y-10927981D01*
X12631257Y-10947029D01*
X12621733Y-10956552D01*
X12602686Y-10966076D01*
X12545543Y-10966076D01*
X12526495Y-10956552D01*
X12516971Y-10947029D01*
X12726495Y-10947029D02*
X12736019Y-10956552D01*
X12726495Y-10966076D01*
X12716971Y-10956552D01*
X12726495Y-10947029D01*
X12726495Y-10966076D01*
X12802686Y-10766076D02*
X12936019Y-10766076D01*
X12850305Y-10966076D01*
X13050305Y-10766076D02*
X13069352Y-10766076D01*
X13088400Y-10775600D01*
X13097924Y-10785124D01*
X13107448Y-10804171D01*
X13116971Y-10842267D01*
X13116971Y-10889886D01*
X13107448Y-10927981D01*
X13097924Y-10947029D01*
X13088400Y-10956552D01*
X13069352Y-10966076D01*
X13050305Y-10966076D01*
X13031257Y-10956552D01*
X13021733Y-10947029D01*
X13012209Y-10927981D01*
X13002686Y-10889886D01*
X13002686Y-10842267D01*
X13012209Y-10804171D01*
X13021733Y-10785124D01*
X13031257Y-10775600D01*
X13050305Y-10766076D01*
X13240781Y-10766076D02*
X13259828Y-10766076D01*
X13278876Y-10775600D01*
X13288400Y-10785124D01*
X13297924Y-10804171D01*
X13307448Y-10842267D01*
X13307448Y-10889886D01*
X13297924Y-10927981D01*
X13288400Y-10947029D01*
X13278876Y-10956552D01*
X13259828Y-10966076D01*
X13240781Y-10966076D01*
X13221733Y-10956552D01*
X13212209Y-10947029D01*
X13202686Y-10927981D01*
X13193162Y-10889886D01*
X13193162Y-10842267D01*
X13202686Y-10804171D01*
X13212209Y-10785124D01*
X13221733Y-10775600D01*
X13240781Y-10766076D01*
X13393162Y-10966076D02*
X13393162Y-10832743D01*
X13393162Y-10851790D02*
X13402686Y-10842267D01*
X13421733Y-10832743D01*
X13450305Y-10832743D01*
X13469352Y-10842267D01*
X13478876Y-10861314D01*
X13478876Y-10966076D01*
X13478876Y-10861314D02*
X13488400Y-10842267D01*
X13507448Y-10832743D01*
X13536019Y-10832743D01*
X13555067Y-10842267D01*
X13564590Y-10861314D01*
X13564590Y-10966076D01*
X13659828Y-10966076D02*
X13659828Y-10832743D01*
X13659828Y-10851790D02*
X13669352Y-10842267D01*
X13688400Y-10832743D01*
X13716971Y-10832743D01*
X13736019Y-10842267D01*
X13745543Y-10861314D01*
X13745543Y-10966076D01*
X13745543Y-10861314D02*
X13755067Y-10842267D01*
X13774114Y-10832743D01*
X13802686Y-10832743D01*
X13821733Y-10842267D01*
X13831257Y-10861314D01*
X13831257Y-10966076D01*
X14221733Y-10756552D02*
X14050305Y-11013695D01*
X14478876Y-10766076D02*
X14497924Y-10766076D01*
X14516971Y-10775600D01*
X14526495Y-10785124D01*
X14536019Y-10804171D01*
X14545543Y-10842267D01*
X14545543Y-10889886D01*
X14536019Y-10927981D01*
X14526495Y-10947029D01*
X14516971Y-10956552D01*
X14497924Y-10966076D01*
X14478876Y-10966076D01*
X14459828Y-10956552D01*
X14450305Y-10947029D01*
X14440781Y-10927981D01*
X14431257Y-10889886D01*
X14431257Y-10842267D01*
X14440781Y-10804171D01*
X14450305Y-10785124D01*
X14459828Y-10775600D01*
X14478876Y-10766076D01*
X14631257Y-10947029D02*
X14640781Y-10956552D01*
X14631257Y-10966076D01*
X14621733Y-10956552D01*
X14631257Y-10947029D01*
X14631257Y-10966076D01*
X14831257Y-10966076D02*
X14716971Y-10966076D01*
X14774114Y-10966076D02*
X14774114Y-10766076D01*
X14755067Y-10794648D01*
X14736019Y-10813695D01*
X14716971Y-10823219D01*
X15002686Y-10832743D02*
X15002686Y-10966076D01*
X14955067Y-10756552D02*
X14907448Y-10899410D01*
X15031257Y-10899410D01*
X15202686Y-10766076D02*
X15107448Y-10766076D01*
X15097924Y-10861314D01*
X15107448Y-10851790D01*
X15126495Y-10842267D01*
X15174114Y-10842267D01*
X15193162Y-10851790D01*
X15202686Y-10861314D01*
X15212209Y-10880362D01*
X15212209Y-10927981D01*
X15202686Y-10947029D01*
X15193162Y-10956552D01*
X15174114Y-10966076D01*
X15126495Y-10966076D01*
X15107448Y-10956552D01*
X15097924Y-10947029D01*
X15278876Y-10766076D02*
X15412209Y-10766076D01*
X15326495Y-10966076D01*
X15478876Y-10766076D02*
X15478876Y-10804171D01*
X15555067Y-10766076D02*
X15555067Y-10804171D01*
X15850305Y-11042267D02*
X15840781Y-11032743D01*
X15821733Y-11004171D01*
X15812209Y-10985124D01*
X15802686Y-10956552D01*
X15793162Y-10908933D01*
X15793162Y-10870838D01*
X15802686Y-10823219D01*
X15812209Y-10794648D01*
X15821733Y-10775600D01*
X15840781Y-10747029D01*
X15850305Y-10737505D01*
X16012209Y-10832743D02*
X16012209Y-10966076D01*
X15964590Y-10756552D02*
X15916971Y-10899410D01*
X16040781Y-10899410D01*
X16269352Y-10966076D02*
X16269352Y-10766076D01*
X16355067Y-10966076D02*
X16355067Y-10861314D01*
X16345543Y-10842267D01*
X16326495Y-10832743D01*
X16297924Y-10832743D01*
X16278876Y-10842267D01*
X16269352Y-10851790D01*
X16478876Y-10966076D02*
X16459828Y-10956552D01*
X16450305Y-10947029D01*
X16440781Y-10927981D01*
X16440781Y-10870838D01*
X16450305Y-10851790D01*
X16459828Y-10842267D01*
X16478876Y-10832743D01*
X16507448Y-10832743D01*
X16526495Y-10842267D01*
X16536019Y-10851790D01*
X16545543Y-10870838D01*
X16545543Y-10927981D01*
X16536019Y-10947029D01*
X16526495Y-10956552D01*
X16507448Y-10966076D01*
X16478876Y-10966076D01*
X16659828Y-10966076D02*
X16640781Y-10956552D01*
X16631257Y-10937505D01*
X16631257Y-10766076D01*
X16812210Y-10956552D02*
X16793162Y-10966076D01*
X16755067Y-10966076D01*
X16736019Y-10956552D01*
X16726495Y-10937505D01*
X16726495Y-10861314D01*
X16736019Y-10842267D01*
X16755067Y-10832743D01*
X16793162Y-10832743D01*
X16812210Y-10842267D01*
X16821733Y-10861314D01*
X16821733Y-10880362D01*
X16726495Y-10899410D01*
X16897924Y-10956552D02*
X16916971Y-10966076D01*
X16955067Y-10966076D01*
X16974114Y-10956552D01*
X16983638Y-10937505D01*
X16983638Y-10927981D01*
X16974114Y-10908933D01*
X16955067Y-10899410D01*
X16926495Y-10899410D01*
X16907448Y-10889886D01*
X16897924Y-10870838D01*
X16897924Y-10861314D01*
X16907448Y-10842267D01*
X16926495Y-10832743D01*
X16955067Y-10832743D01*
X16974114Y-10842267D01*
X17050305Y-11042267D02*
X17059829Y-11032743D01*
X17078876Y-11004171D01*
X17088400Y-10985124D01*
X17097924Y-10956552D01*
X17107448Y-10908933D01*
X17107448Y-10870838D01*
X17097924Y-10823219D01*
X17088400Y-10794648D01*
X17078876Y-10775600D01*
X17059829Y-10747029D01*
X17050305Y-10737505D01*
X17412210Y-11042267D02*
X17402686Y-11032743D01*
X17383638Y-11004171D01*
X17374114Y-10985124D01*
X17364590Y-10956552D01*
X17355067Y-10908933D01*
X17355067Y-10870838D01*
X17364590Y-10823219D01*
X17374114Y-10794648D01*
X17383638Y-10775600D01*
X17402686Y-10747029D01*
X17412210Y-10737505D01*
X17488400Y-10832743D02*
X17488400Y-10966076D01*
X17488400Y-10851790D02*
X17497924Y-10842267D01*
X17516971Y-10832743D01*
X17545543Y-10832743D01*
X17564590Y-10842267D01*
X17574114Y-10861314D01*
X17574114Y-10966076D01*
X17697924Y-10966076D02*
X17678876Y-10956552D01*
X17669352Y-10947029D01*
X17659829Y-10927981D01*
X17659829Y-10870838D01*
X17669352Y-10851790D01*
X17678876Y-10842267D01*
X17697924Y-10832743D01*
X17726495Y-10832743D01*
X17745543Y-10842267D01*
X17755067Y-10851790D01*
X17764590Y-10870838D01*
X17764590Y-10927981D01*
X17755067Y-10947029D01*
X17745543Y-10956552D01*
X17726495Y-10966076D01*
X17697924Y-10966076D01*
X17821733Y-10832743D02*
X17897924Y-10832743D01*
X17850305Y-10766076D02*
X17850305Y-10937505D01*
X17859829Y-10956552D01*
X17878876Y-10966076D01*
X17897924Y-10966076D01*
X18116971Y-10832743D02*
X18116971Y-11032743D01*
X18116971Y-10842267D02*
X18136019Y-10832743D01*
X18174114Y-10832743D01*
X18193162Y-10842267D01*
X18202686Y-10851790D01*
X18212210Y-10870838D01*
X18212210Y-10927981D01*
X18202686Y-10947029D01*
X18193162Y-10956552D01*
X18174114Y-10966076D01*
X18136019Y-10966076D01*
X18116971Y-10956552D01*
X18326495Y-10966076D02*
X18307448Y-10956552D01*
X18297924Y-10937505D01*
X18297924Y-10766076D01*
X18488400Y-10966076D02*
X18488400Y-10861314D01*
X18478876Y-10842267D01*
X18459829Y-10832743D01*
X18421733Y-10832743D01*
X18402686Y-10842267D01*
X18488400Y-10956552D02*
X18469352Y-10966076D01*
X18421733Y-10966076D01*
X18402686Y-10956552D01*
X18393162Y-10937505D01*
X18393162Y-10918457D01*
X18402686Y-10899410D01*
X18421733Y-10889886D01*
X18469352Y-10889886D01*
X18488400Y-10880362D01*
X18555067Y-10832743D02*
X18631257Y-10832743D01*
X18583638Y-10766076D02*
X18583638Y-10937505D01*
X18593162Y-10956552D01*
X18612210Y-10966076D01*
X18631257Y-10966076D01*
X18774114Y-10956552D02*
X18755067Y-10966076D01*
X18716971Y-10966076D01*
X18697924Y-10956552D01*
X18688400Y-10937505D01*
X18688400Y-10861314D01*
X18697924Y-10842267D01*
X18716971Y-10832743D01*
X18755067Y-10832743D01*
X18774114Y-10842267D01*
X18783638Y-10861314D01*
X18783638Y-10880362D01*
X18688400Y-10899410D01*
X18955067Y-10966076D02*
X18955067Y-10766076D01*
X18955067Y-10956552D02*
X18936019Y-10966076D01*
X18897924Y-10966076D01*
X18878876Y-10956552D01*
X18869352Y-10947029D01*
X18859829Y-10927981D01*
X18859829Y-10870838D01*
X18869352Y-10851790D01*
X18878876Y-10842267D01*
X18897924Y-10832743D01*
X18936019Y-10832743D01*
X18955067Y-10842267D01*
X19031257Y-11042267D02*
X19040781Y-11032743D01*
X19059829Y-11004171D01*
X19069352Y-10985124D01*
X19078876Y-10956552D01*
X19088400Y-10908933D01*
X19088400Y-10870838D01*
X19078876Y-10823219D01*
X19069352Y-10794648D01*
X19059829Y-10775600D01*
X19040781Y-10747029D01*
X19031257Y-10737505D01*
M02*
