%TF.GenerationSoftware,KiCad,Pcbnew,(6.0.10)*%
%TF.CreationDate,2023-01-24T10:04:16-05:00*%
%TF.ProjectId,vulcan_portal,76756c63-616e-45f7-906f-7274616c2e6b,rev?*%
%TF.SameCoordinates,Original*%
%TF.FileFunction,Drillmap*%
%TF.FilePolarity,Positive*%
%FSLAX45Y45*%
G04 Gerber Fmt 4.5, Leading zero omitted, Abs format (unit mm)*
G04 Created by KiCad (PCBNEW (6.0.10)) date 2023-01-24 10:04:16*
%MOMM*%
%LPD*%
G01*
G04 APERTURE LIST*
%ADD10C,0.050000*%
%ADD11C,0.200000*%
%ADD12C,0.030000*%
%ADD13C,0.060000*%
%ADD14C,0.090000*%
%ADD15C,0.100000*%
%ADD16C,0.120000*%
G04 APERTURE END LIST*
D10*
X12960460Y-7340400D02*
X15350860Y-7340400D01*
X14260500Y-8915400D02*
X15350860Y-8915400D01*
X13500100Y-9015400D02*
G75*
G03*
X13400100Y-8915400I-100000J0D01*
G01*
X15450900Y-9397800D02*
G75*
G03*
X16065500Y-9397800I307300J0D01*
G01*
X12280900Y-8915400D02*
X12280900Y-7340600D01*
X12985460Y-8915400D02*
G75*
G03*
X12885460Y-9015400I0J-100000D01*
G01*
X16065500Y-8763000D02*
X16065500Y-8915400D01*
X14260500Y-8915400D02*
G75*
G03*
X14160500Y-9015400I0J-100000D01*
G01*
X16065540Y-6857800D02*
G75*
G03*
X15450860Y-6857800I-307340J0D01*
G01*
X15450860Y-6857800D02*
X15450860Y-7240400D01*
X12885460Y-7265400D02*
G75*
G03*
X12960460Y-7340400I75000J0D01*
G01*
X14160500Y-9328000D02*
X14160500Y-9015400D01*
X15350860Y-7340400D02*
G75*
G03*
X15450860Y-7240400I0J100000D01*
G01*
X16065500Y-8763000D02*
X16065500Y-7493000D01*
X15450900Y-9397800D02*
X15450860Y-9015400D01*
X16065500Y-7340600D02*
X16065540Y-6857800D01*
X15450860Y-9015400D02*
G75*
G03*
X15350860Y-8915400I-100000J0D01*
G01*
X12885500Y-9397800D02*
X12885460Y-9015400D01*
X14160500Y-9328000D02*
X13500080Y-9328000D01*
X16065500Y-8915400D02*
X16065500Y-9397800D01*
X13400100Y-8915400D02*
X12985460Y-8915400D01*
X16065500Y-7493000D02*
X16065500Y-7340600D01*
X12885500Y-6857800D02*
G75*
G03*
X12280900Y-6857800I-302300J0D01*
G01*
X12280900Y-7340600D02*
X12280900Y-6857800D01*
X12885500Y-6857800D02*
X12885460Y-7265400D01*
X12280900Y-9397800D02*
G75*
G03*
X12885500Y-9397800I302300J0D01*
G01*
X12280900Y-8915400D02*
X12280900Y-9397800D01*
X13500080Y-9328000D02*
X13500100Y-9015400D01*
D11*
D12*
X12316232Y-8660424D02*
X12346232Y-8690424D01*
X12346232Y-8660424D02*
X12316232Y-8690424D01*
X12316700Y-7373660D02*
X12346700Y-7403660D01*
X12346700Y-7373660D02*
X12316700Y-7403660D01*
X12316700Y-7553492D02*
X12346700Y-7583492D01*
X12346700Y-7553492D02*
X12316700Y-7583492D01*
X12316700Y-7998700D02*
X12346700Y-8028700D01*
X12346700Y-7998700D02*
X12316700Y-8028700D01*
X12316700Y-8201900D02*
X12346700Y-8231900D01*
X12346700Y-8201900D02*
X12316700Y-8231900D01*
X12316700Y-8849600D02*
X12346700Y-8879600D01*
X12346700Y-8849600D02*
X12316700Y-8879600D01*
X12320764Y-8408656D02*
X12350764Y-8438656D01*
X12350764Y-8408656D02*
X12320764Y-8438656D01*
X12321780Y-7808708D02*
X12351780Y-7838708D01*
X12351780Y-7808708D02*
X12321780Y-7838708D01*
X12543776Y-7674088D02*
X12573776Y-7704088D01*
X12573776Y-7674088D02*
X12543776Y-7704088D01*
X12558508Y-8537434D02*
X12588508Y-8567434D01*
X12588508Y-8537434D02*
X12558508Y-8567434D01*
X12592798Y-8109698D02*
X12622798Y-8139698D01*
X12622798Y-8109698D02*
X12592798Y-8139698D01*
X12608800Y-7373660D02*
X12638800Y-7403660D01*
X12638800Y-7373660D02*
X12608800Y-7403660D01*
X12608800Y-8849600D02*
X12638800Y-8879600D01*
X12638800Y-8849600D02*
X12608800Y-8879600D01*
X12629882Y-8337536D02*
X12659882Y-8367536D01*
X12659882Y-8337536D02*
X12629882Y-8367536D01*
X12640550Y-7883384D02*
X12670550Y-7913384D01*
X12670550Y-7883384D02*
X12640550Y-7913384D01*
X12748540Y-8032790D02*
X12778540Y-8062790D01*
X12778540Y-8032790D02*
X12748540Y-8062790D01*
X12748540Y-8133120D02*
X12778540Y-8163120D01*
X12778540Y-8133120D02*
X12748540Y-8163120D01*
X12913600Y-7373660D02*
X12943600Y-7403660D01*
X12943600Y-7373660D02*
X12913600Y-7403660D01*
X12913600Y-8849600D02*
X12943600Y-8879600D01*
X12943600Y-8849600D02*
X12913600Y-8879600D01*
X12964400Y-8709900D02*
X12994400Y-8739900D01*
X12994400Y-8709900D02*
X12964400Y-8739900D01*
X12967448Y-7428216D02*
X12997448Y-7458216D01*
X12997448Y-7428216D02*
X12967448Y-7458216D01*
X12968464Y-7578584D02*
X12998464Y-7608584D01*
X12998464Y-7578584D02*
X12968464Y-7608584D01*
X12971552Y-7759740D02*
X13001552Y-7789740D01*
X13001552Y-7759740D02*
X12971552Y-7789740D01*
X12978410Y-8075970D02*
X13008410Y-8105970D01*
X13008410Y-8075970D02*
X12978410Y-8105970D01*
X12978410Y-8188628D02*
X13008410Y-8218628D01*
X13008410Y-8188628D02*
X12978410Y-8218628D01*
X12984252Y-8439952D02*
X13014252Y-8469952D01*
X13014252Y-8439952D02*
X12984252Y-8469952D01*
X12989800Y-8621000D02*
X13019800Y-8651000D01*
X13019800Y-8621000D02*
X12989800Y-8651000D01*
X13094020Y-8619160D02*
X13124020Y-8649160D01*
X13124020Y-8619160D02*
X13094020Y-8649160D01*
X13129632Y-7804512D02*
X13159632Y-7834512D01*
X13159632Y-7804512D02*
X13129632Y-7834512D01*
X13133350Y-7509239D02*
X13163350Y-7539239D01*
X13163350Y-7509239D02*
X13133350Y-7539239D01*
X13134580Y-8847060D02*
X13164580Y-8877060D01*
X13164580Y-8847060D02*
X13134580Y-8877060D01*
X13137922Y-7950240D02*
X13167922Y-7980240D01*
X13167922Y-7950240D02*
X13137922Y-7980240D01*
X13146932Y-8308998D02*
X13176932Y-8338998D01*
X13176932Y-8308998D02*
X13146932Y-8338998D01*
X13161250Y-8619160D02*
X13191250Y-8649160D01*
X13191250Y-8619160D02*
X13161250Y-8649160D01*
X13167600Y-8709900D02*
X13197600Y-8739900D01*
X13197600Y-8709900D02*
X13167600Y-8739900D01*
X13182440Y-8052040D02*
X13212440Y-8082040D01*
X13212440Y-8052040D02*
X13182440Y-8082040D01*
X13186650Y-8162040D02*
X13216650Y-8192040D01*
X13216650Y-8162040D02*
X13186650Y-8192040D01*
X13222843Y-8619160D02*
X13252843Y-8649160D01*
X13252843Y-8619160D02*
X13222843Y-8649160D01*
X13289520Y-8847060D02*
X13319520Y-8877060D01*
X13319520Y-8847060D02*
X13289520Y-8877060D01*
X13300950Y-8416530D02*
X13330950Y-8446530D01*
X13330950Y-8416530D02*
X13300950Y-8446530D01*
X13320000Y-8176500D02*
X13350000Y-8206500D01*
X13350000Y-8176500D02*
X13320000Y-8206500D01*
X13320000Y-8252700D02*
X13350000Y-8282700D01*
X13350000Y-8252700D02*
X13320000Y-8282700D01*
X13323810Y-8331440D02*
X13353810Y-8361440D01*
X13353810Y-8331440D02*
X13323810Y-8361440D01*
X13339090Y-7792760D02*
X13369090Y-7822760D01*
X13369090Y-7792760D02*
X13339090Y-7822760D01*
X13339090Y-7901980D02*
X13369090Y-7931980D01*
X13369090Y-7901980D02*
X13339090Y-7931980D01*
X13356830Y-8026640D02*
X13386830Y-8056640D01*
X13386830Y-8026640D02*
X13356830Y-8056640D01*
X13357068Y-8106608D02*
X13387068Y-8136608D01*
X13387068Y-8106608D02*
X13357068Y-8136608D01*
X13375880Y-8453360D02*
X13405880Y-8483360D01*
X13405880Y-8453360D02*
X13375880Y-8483360D01*
X13375880Y-8514320D02*
X13405880Y-8544320D01*
X13405880Y-8514320D02*
X13375880Y-8544320D01*
X13399628Y-8335099D02*
X13429628Y-8365099D01*
X13429628Y-8335099D02*
X13399628Y-8365099D01*
X13427990Y-7509239D02*
X13457990Y-7539239D01*
X13457990Y-7509239D02*
X13427990Y-7539239D01*
X13436840Y-8453360D02*
X13466840Y-8483360D01*
X13466840Y-8453360D02*
X13436840Y-8483360D01*
X13436840Y-8514320D02*
X13466840Y-8544320D01*
X13466840Y-8514320D02*
X13436840Y-8544320D01*
X13462240Y-7767560D02*
X13492240Y-7797560D01*
X13492240Y-7767560D02*
X13462240Y-7797560D01*
X13464158Y-8851261D02*
X13494158Y-8881261D01*
X13494158Y-8851261D02*
X13464158Y-8881261D01*
X13507960Y-8513050D02*
X13537960Y-8543050D01*
X13537960Y-8513050D02*
X13507960Y-8543050D01*
X13535900Y-9265497D02*
X13565900Y-9295497D01*
X13565900Y-9265497D02*
X13535900Y-9295497D01*
X13575310Y-7684810D02*
X13605310Y-7714810D01*
X13605310Y-7684810D02*
X13575310Y-7714810D01*
X13591272Y-7373660D02*
X13621272Y-7403660D01*
X13621272Y-7373660D02*
X13591272Y-7403660D01*
X13612100Y-7503400D02*
X13642100Y-7533400D01*
X13642100Y-7503400D02*
X13612100Y-7533400D01*
X13620599Y-9129000D02*
X13650599Y-9159000D01*
X13650599Y-9129000D02*
X13620599Y-9159000D01*
X13623530Y-7928681D02*
X13653530Y-7958681D01*
X13653530Y-7928681D02*
X13623530Y-7958681D01*
X13623530Y-8303500D02*
X13653530Y-8333500D01*
X13653530Y-8303500D02*
X13623530Y-8333500D01*
X13636738Y-8525496D02*
X13666738Y-8555496D01*
X13666738Y-8525496D02*
X13636738Y-8555496D01*
X13638770Y-9240760D02*
X13668770Y-9270760D01*
X13668770Y-9240760D02*
X13638770Y-9270760D01*
X13675600Y-8851135D02*
X13705600Y-8881135D01*
X13705600Y-8851135D02*
X13675600Y-8881135D01*
X13711382Y-7682724D02*
X13741382Y-7712724D01*
X13741382Y-7682724D02*
X13711382Y-7712724D01*
X13753070Y-9004540D02*
X13783070Y-9034540D01*
X13783070Y-9004540D02*
X13753070Y-9034540D01*
X13755148Y-9242084D02*
X13785148Y-9272084D01*
X13785148Y-9242084D02*
X13755148Y-9272084D01*
X13773898Y-7431264D02*
X13803898Y-7461264D01*
X13803898Y-7431264D02*
X13773898Y-7461264D01*
X13788630Y-7632289D02*
X13818630Y-7662289D01*
X13818630Y-7632289D02*
X13788630Y-7662289D01*
X13814030Y-7373660D02*
X13844030Y-7403660D01*
X13844030Y-7373660D02*
X13814030Y-7403660D01*
X13814030Y-8113000D02*
X13844030Y-8143000D01*
X13844030Y-8113000D02*
X13814030Y-8143000D01*
X13815300Y-7509750D02*
X13845300Y-7539750D01*
X13845300Y-7509750D02*
X13815300Y-7539750D01*
X13822412Y-8664688D02*
X13852412Y-8694688D01*
X13852412Y-8664688D02*
X13822412Y-8694688D01*
X13862290Y-8849600D02*
X13892290Y-8879600D01*
X13892290Y-8849600D02*
X13862290Y-8879600D01*
X13877932Y-7629998D02*
X13907932Y-7659998D01*
X13907932Y-7629998D02*
X13877932Y-7659998D01*
X13914360Y-7375130D02*
X13944360Y-7405130D01*
X13944360Y-7375130D02*
X13914360Y-7405130D01*
X13934212Y-7678968D02*
X13964212Y-7708968D01*
X13964212Y-7678968D02*
X13934212Y-7708968D01*
X13957955Y-8548475D02*
X13987955Y-8578475D01*
X13987955Y-8548475D02*
X13957955Y-8578475D01*
X13960842Y-7431264D02*
X13990842Y-7461264D01*
X13990842Y-7431264D02*
X13960842Y-7461264D01*
X13962112Y-8851124D02*
X13992112Y-8881124D01*
X13992112Y-8851124D02*
X13962112Y-8881124D01*
X14004530Y-7928681D02*
X14034530Y-7958681D01*
X14034530Y-7928681D02*
X14004530Y-7958681D01*
X14004530Y-8303500D02*
X14034530Y-8333500D01*
X14034530Y-8303500D02*
X14004530Y-8333500D01*
X14010300Y-9240466D02*
X14040300Y-9270466D01*
X14040300Y-9240466D02*
X14010300Y-9270466D01*
X14012316Y-9020171D02*
X14042316Y-9050171D01*
X14042316Y-9020171D02*
X14012316Y-9050171D01*
X14030572Y-8545785D02*
X14060572Y-8575785D01*
X14060572Y-8545785D02*
X14030572Y-8575785D01*
X14043432Y-7680492D02*
X14073432Y-7710492D01*
X14073432Y-7680492D02*
X14043432Y-7710492D01*
X14101050Y-7516100D02*
X14131050Y-7546100D01*
X14131050Y-7516100D02*
X14101050Y-7546100D01*
X14104860Y-7373660D02*
X14134860Y-7403660D01*
X14134860Y-7373660D02*
X14104860Y-7403660D01*
X14158200Y-7757400D02*
X14188200Y-7787400D01*
X14188200Y-7757400D02*
X14158200Y-7787400D01*
X14164550Y-7624050D02*
X14194550Y-7654050D01*
X14194550Y-7624050D02*
X14164550Y-7654050D01*
X14167090Y-8849600D02*
X14197090Y-8879600D01*
X14197090Y-8849600D02*
X14167090Y-8879600D01*
X14174710Y-8453360D02*
X14204710Y-8483360D01*
X14204710Y-8453360D02*
X14174710Y-8483360D01*
X14184230Y-8676240D02*
X14214230Y-8706240D01*
X14214230Y-8676240D02*
X14184230Y-8706240D01*
X14228050Y-7732000D02*
X14258050Y-7762000D01*
X14258050Y-7732000D02*
X14228050Y-7762000D01*
X14234483Y-8098634D02*
X14264483Y-8128634D01*
X14264483Y-8098634D02*
X14234483Y-8128634D01*
X14247495Y-7928680D02*
X14277495Y-7958680D01*
X14277495Y-7928680D02*
X14247495Y-7958680D01*
X14248370Y-8314930D02*
X14278370Y-8344930D01*
X14278370Y-8314930D02*
X14248370Y-8344930D01*
X14263155Y-8019567D02*
X14293155Y-8049567D01*
X14293155Y-8019567D02*
X14263155Y-8049567D01*
X14323046Y-7373660D02*
X14353046Y-7403660D01*
X14353046Y-7373660D02*
X14323046Y-7403660D01*
X14323046Y-8849600D02*
X14353046Y-8879600D01*
X14353046Y-8849600D02*
X14323046Y-8879600D01*
X14329650Y-7585950D02*
X14359650Y-7615950D01*
X14359650Y-7585950D02*
X14329650Y-7615950D01*
X14342350Y-7833600D02*
X14372350Y-7863600D01*
X14372350Y-7833600D02*
X14342350Y-7863600D01*
X14360384Y-8765526D02*
X14390384Y-8795526D01*
X14390384Y-8765526D02*
X14360384Y-8795526D01*
X14364956Y-8572994D02*
X14394956Y-8602994D01*
X14394956Y-8572994D02*
X14364956Y-8602994D01*
X14373904Y-8696844D02*
X14403904Y-8726844D01*
X14403904Y-8696844D02*
X14373904Y-8726844D01*
X14380450Y-8316200D02*
X14410450Y-8346200D01*
X14410450Y-8316200D02*
X14380450Y-8346200D01*
X14577300Y-7585950D02*
X14607300Y-7615950D01*
X14607300Y-7585950D02*
X14577300Y-7615950D01*
X14577300Y-7782800D02*
X14607300Y-7812800D01*
X14607300Y-7782800D02*
X14577300Y-7812800D01*
X14577300Y-8849600D02*
X14607300Y-8879600D01*
X14607300Y-8849600D02*
X14577300Y-8879600D01*
X14587460Y-7375130D02*
X14617460Y-7405130D01*
X14617460Y-7375130D02*
X14587460Y-7405130D01*
X14631910Y-8505430D02*
X14661910Y-8535430D01*
X14661910Y-8505430D02*
X14631910Y-8535430D01*
X14723350Y-8506700D02*
X14753350Y-8536700D01*
X14753350Y-8506700D02*
X14723350Y-8536700D01*
X14767800Y-8227300D02*
X14797800Y-8257300D01*
X14797800Y-8227300D02*
X14767800Y-8257300D01*
X14828760Y-7375130D02*
X14858760Y-7405130D01*
X14858760Y-7375130D02*
X14828760Y-7405130D01*
X14831300Y-7592300D02*
X14861300Y-7622300D01*
X14861300Y-7592300D02*
X14831300Y-7622300D01*
X14831300Y-7789150D02*
X14861300Y-7819150D01*
X14861300Y-7789150D02*
X14831300Y-7819150D01*
X14836380Y-8767050D02*
X14866380Y-8797050D01*
X14866380Y-8767050D02*
X14836380Y-8797050D01*
X14838920Y-8506700D02*
X14868920Y-8536700D01*
X14868920Y-8506700D02*
X14838920Y-8536700D01*
X14856700Y-8849600D02*
X14886700Y-8879600D01*
X14886700Y-8849600D02*
X14856700Y-8879600D01*
X15064980Y-7376400D02*
X15094980Y-7406400D01*
X15094980Y-7376400D02*
X15064980Y-7406400D01*
X15066250Y-7585950D02*
X15096250Y-7615950D01*
X15096250Y-7585950D02*
X15066250Y-7615950D01*
X15098000Y-8367000D02*
X15128000Y-8397000D01*
X15128000Y-8367000D02*
X15098000Y-8397000D01*
X15099270Y-8622270D02*
X15129270Y-8652270D01*
X15129270Y-8622270D02*
X15099270Y-8652270D01*
X15118320Y-8849600D02*
X15148320Y-8879600D01*
X15148320Y-8849600D02*
X15118320Y-8879600D01*
X15179280Y-8702280D02*
X15209280Y-8732280D01*
X15209280Y-8702280D02*
X15179280Y-8732280D01*
X15225000Y-8240000D02*
X15255000Y-8270000D01*
X15255000Y-8240000D02*
X15225000Y-8270000D01*
X15225000Y-8367000D02*
X15255000Y-8397000D01*
X15255000Y-8367000D02*
X15225000Y-8397000D01*
X15316440Y-8560040D02*
X15346440Y-8590040D01*
X15346440Y-8560040D02*
X15316440Y-8590040D01*
X15326600Y-7376400D02*
X15356600Y-7406400D01*
X15356600Y-7376400D02*
X15326600Y-7406400D01*
X15425660Y-8829280D02*
X15455660Y-8859280D01*
X15455660Y-8829280D02*
X15425660Y-8859280D01*
X15465030Y-8454122D02*
X15495030Y-8484122D01*
X15495030Y-8454122D02*
X15465030Y-8484122D01*
X15470364Y-8109698D02*
X15500364Y-8139698D01*
X15500364Y-8109698D02*
X15470364Y-8139698D01*
X15631400Y-7376400D02*
X15661400Y-7406400D01*
X15661400Y-7376400D02*
X15631400Y-7406400D01*
X15631400Y-8849600D02*
X15661400Y-8879600D01*
X15661400Y-8849600D02*
X15631400Y-8879600D01*
X15842474Y-8108428D02*
X15872474Y-8138428D01*
X15872474Y-8108428D02*
X15842474Y-8138428D01*
X15862286Y-8440914D02*
X15892286Y-8470914D01*
X15892286Y-8440914D02*
X15862286Y-8470914D01*
X15884892Y-7839696D02*
X15914892Y-7869696D01*
X15914892Y-7839696D02*
X15884892Y-7869696D01*
X15999700Y-7376400D02*
X16029700Y-7406400D01*
X16029700Y-7376400D02*
X15999700Y-7406400D01*
X15999700Y-7782800D02*
X16029700Y-7812800D01*
X16029700Y-7782800D02*
X15999700Y-7812800D01*
X15999700Y-7998700D02*
X16029700Y-8028700D01*
X16029700Y-7998700D02*
X15999700Y-8028700D01*
X15999700Y-8201900D02*
X16029700Y-8231900D01*
X16029700Y-8201900D02*
X15999700Y-8231900D01*
X15999700Y-8443200D02*
X16029700Y-8473200D01*
X16029700Y-8443200D02*
X15999700Y-8473200D01*
X15999700Y-8849600D02*
X16029700Y-8879600D01*
X16029700Y-8849600D02*
X15999700Y-8879600D01*
D13*
X12394408Y-7691228D02*
G75*
G03*
X12394408Y-7691228I-30000J0D01*
G01*
D11*
X12394408Y-7661228D02*
X12334408Y-7661228D01*
X12394408Y-7721228D02*
X12334408Y-7721228D01*
X12334408Y-7661228D02*
G75*
G03*
X12334408Y-7721228I0J-30000D01*
G01*
X12394408Y-7721228D02*
G75*
G03*
X12394408Y-7661228I0J30000D01*
G01*
D13*
X12394408Y-8555228D02*
G75*
G03*
X12394408Y-8555228I-30000J0D01*
G01*
D11*
X12394408Y-8525228D02*
X12334408Y-8525228D01*
X12394408Y-8585228D02*
X12334408Y-8585228D01*
X12334408Y-8525228D02*
G75*
G03*
X12334408Y-8585228I0J-30000D01*
G01*
X12394408Y-8585228D02*
G75*
G03*
X12394408Y-8525228I0J30000D01*
G01*
D13*
X12812408Y-7691228D02*
G75*
G03*
X12812408Y-7691228I-30000J0D01*
G01*
D11*
X12837408Y-7661228D02*
X12727408Y-7661228D01*
X12837408Y-7721228D02*
X12727408Y-7721228D01*
X12727408Y-7661228D02*
G75*
G03*
X12727408Y-7721228I0J-30000D01*
G01*
X12837408Y-7721228D02*
G75*
G03*
X12837408Y-7661228I0J30000D01*
G01*
D13*
X12812408Y-8555228D02*
G75*
G03*
X12812408Y-8555228I-30000J0D01*
G01*
D11*
X12837408Y-8525228D02*
X12727408Y-8525228D01*
X12837408Y-8585228D02*
X12727408Y-8585228D01*
X12727408Y-8525228D02*
G75*
G03*
X12727408Y-8585228I0J-30000D01*
G01*
X12837408Y-8585228D02*
G75*
G03*
X12837408Y-8525228I0J30000D01*
G01*
D14*
X14467840Y-7392120D02*
X14467840Y-7482120D01*
X14422840Y-7437120D02*
X14512840Y-7437120D01*
X14467840Y-7722120D02*
X14467840Y-7812120D01*
X14422840Y-7767120D02*
X14512840Y-7767120D01*
X14717840Y-7392120D02*
X14717840Y-7482120D01*
X14672840Y-7437120D02*
X14762840Y-7437120D01*
X14717840Y-7722120D02*
X14717840Y-7812120D01*
X14672840Y-7767120D02*
X14762840Y-7767120D01*
X14967840Y-7392120D02*
X14967840Y-7482120D01*
X14922840Y-7437120D02*
X15012840Y-7437120D01*
X14967840Y-7722120D02*
X14967840Y-7812120D01*
X14922840Y-7767120D02*
X15012840Y-7767120D01*
D15*
X15039136Y-8036356D02*
X15039136Y-7965644D01*
X14968424Y-7965644D01*
X14968424Y-8036356D01*
X15039136Y-8036356D01*
X15039136Y-8290356D02*
X15039136Y-8219644D01*
X14968424Y-8219644D01*
X14968424Y-8290356D01*
X15039136Y-8290356D01*
X15039136Y-8544356D02*
X15039136Y-8473644D01*
X14968424Y-8473644D01*
X14968424Y-8544356D01*
X15039136Y-8544356D01*
X15039136Y-8798356D02*
X15039136Y-8727644D01*
X14968424Y-8727644D01*
X14968424Y-8798356D01*
X15039136Y-8798356D01*
D16*
X15676880Y-7664796D02*
X15736880Y-7604796D01*
X15676880Y-7544796D01*
X15616880Y-7604796D01*
X15676880Y-7664796D01*
X15676880Y-8014796D02*
X15736880Y-7954796D01*
X15676880Y-7894796D01*
X15616880Y-7954796D01*
X15676880Y-8014796D01*
X15676880Y-8364796D02*
X15736880Y-8304796D01*
X15676880Y-8244796D01*
X15616880Y-8304796D01*
X15676880Y-8364796D01*
X15676880Y-8714796D02*
X15736880Y-8654796D01*
X15676880Y-8594796D01*
X15616880Y-8654796D01*
X15676880Y-8714796D01*
D11*
X12536019Y-10018076D02*
X12536019Y-9818076D01*
X12583638Y-9818076D01*
X12612209Y-9827600D01*
X12631257Y-9846648D01*
X12640781Y-9865695D01*
X12650305Y-9903790D01*
X12650305Y-9932362D01*
X12640781Y-9970457D01*
X12631257Y-9989505D01*
X12612209Y-10008552D01*
X12583638Y-10018076D01*
X12536019Y-10018076D01*
X12736019Y-10018076D02*
X12736019Y-9884743D01*
X12736019Y-9922838D02*
X12745543Y-9903790D01*
X12755067Y-9894267D01*
X12774114Y-9884743D01*
X12793162Y-9884743D01*
X12859828Y-10018076D02*
X12859828Y-9884743D01*
X12859828Y-9818076D02*
X12850305Y-9827600D01*
X12859828Y-9837124D01*
X12869352Y-9827600D01*
X12859828Y-9818076D01*
X12859828Y-9837124D01*
X12983638Y-10018076D02*
X12964590Y-10008552D01*
X12955067Y-9989505D01*
X12955067Y-9818076D01*
X13088400Y-10018076D02*
X13069352Y-10008552D01*
X13059828Y-9989505D01*
X13059828Y-9818076D01*
X13316971Y-10018076D02*
X13316971Y-9818076D01*
X13383638Y-9960933D01*
X13450305Y-9818076D01*
X13450305Y-10018076D01*
X13631257Y-10018076D02*
X13631257Y-9913314D01*
X13621733Y-9894267D01*
X13602686Y-9884743D01*
X13564590Y-9884743D01*
X13545543Y-9894267D01*
X13631257Y-10008552D02*
X13612209Y-10018076D01*
X13564590Y-10018076D01*
X13545543Y-10008552D01*
X13536019Y-9989505D01*
X13536019Y-9970457D01*
X13545543Y-9951410D01*
X13564590Y-9941886D01*
X13612209Y-9941886D01*
X13631257Y-9932362D01*
X13726495Y-9884743D02*
X13726495Y-10084743D01*
X13726495Y-9894267D02*
X13745543Y-9884743D01*
X13783638Y-9884743D01*
X13802686Y-9894267D01*
X13812209Y-9903790D01*
X13821733Y-9922838D01*
X13821733Y-9979981D01*
X13812209Y-9999029D01*
X13802686Y-10008552D01*
X13783638Y-10018076D01*
X13745543Y-10018076D01*
X13726495Y-10008552D01*
X13907448Y-9999029D02*
X13916971Y-10008552D01*
X13907448Y-10018076D01*
X13897924Y-10008552D01*
X13907448Y-9999029D01*
X13907448Y-10018076D01*
X13907448Y-9894267D02*
X13916971Y-9903790D01*
X13907448Y-9913314D01*
X13897924Y-9903790D01*
X13907448Y-9894267D01*
X13907448Y-9913314D01*
D12*
X12248400Y-10332600D02*
X12278400Y-10362600D01*
X12278400Y-10332600D02*
X12248400Y-10362600D01*
D11*
X12574114Y-10238076D02*
X12593162Y-10238076D01*
X12612209Y-10247600D01*
X12621733Y-10257124D01*
X12631257Y-10276171D01*
X12640781Y-10314267D01*
X12640781Y-10361886D01*
X12631257Y-10399981D01*
X12621733Y-10419029D01*
X12612209Y-10428552D01*
X12593162Y-10438076D01*
X12574114Y-10438076D01*
X12555067Y-10428552D01*
X12545543Y-10419029D01*
X12536019Y-10399981D01*
X12526495Y-10361886D01*
X12526495Y-10314267D01*
X12536019Y-10276171D01*
X12545543Y-10257124D01*
X12555067Y-10247600D01*
X12574114Y-10238076D01*
X12726495Y-10419029D02*
X12736019Y-10428552D01*
X12726495Y-10438076D01*
X12716971Y-10428552D01*
X12726495Y-10419029D01*
X12726495Y-10438076D01*
X12802686Y-10238076D02*
X12926495Y-10238076D01*
X12859828Y-10314267D01*
X12888400Y-10314267D01*
X12907448Y-10323790D01*
X12916971Y-10333314D01*
X12926495Y-10352362D01*
X12926495Y-10399981D01*
X12916971Y-10419029D01*
X12907448Y-10428552D01*
X12888400Y-10438076D01*
X12831257Y-10438076D01*
X12812209Y-10428552D01*
X12802686Y-10419029D01*
X13050305Y-10238076D02*
X13069352Y-10238076D01*
X13088400Y-10247600D01*
X13097924Y-10257124D01*
X13107448Y-10276171D01*
X13116971Y-10314267D01*
X13116971Y-10361886D01*
X13107448Y-10399981D01*
X13097924Y-10419029D01*
X13088400Y-10428552D01*
X13069352Y-10438076D01*
X13050305Y-10438076D01*
X13031257Y-10428552D01*
X13021733Y-10419029D01*
X13012209Y-10399981D01*
X13002686Y-10361886D01*
X13002686Y-10314267D01*
X13012209Y-10276171D01*
X13021733Y-10257124D01*
X13031257Y-10247600D01*
X13050305Y-10238076D01*
X13240781Y-10238076D02*
X13259828Y-10238076D01*
X13278876Y-10247600D01*
X13288400Y-10257124D01*
X13297924Y-10276171D01*
X13307448Y-10314267D01*
X13307448Y-10361886D01*
X13297924Y-10399981D01*
X13288400Y-10419029D01*
X13278876Y-10428552D01*
X13259828Y-10438076D01*
X13240781Y-10438076D01*
X13221733Y-10428552D01*
X13212209Y-10419029D01*
X13202686Y-10399981D01*
X13193162Y-10361886D01*
X13193162Y-10314267D01*
X13202686Y-10276171D01*
X13212209Y-10257124D01*
X13221733Y-10247600D01*
X13240781Y-10238076D01*
X13393162Y-10438076D02*
X13393162Y-10304743D01*
X13393162Y-10323790D02*
X13402686Y-10314267D01*
X13421733Y-10304743D01*
X13450305Y-10304743D01*
X13469352Y-10314267D01*
X13478876Y-10333314D01*
X13478876Y-10438076D01*
X13478876Y-10333314D02*
X13488400Y-10314267D01*
X13507448Y-10304743D01*
X13536019Y-10304743D01*
X13555067Y-10314267D01*
X13564590Y-10333314D01*
X13564590Y-10438076D01*
X13659828Y-10438076D02*
X13659828Y-10304743D01*
X13659828Y-10323790D02*
X13669352Y-10314267D01*
X13688400Y-10304743D01*
X13716971Y-10304743D01*
X13736019Y-10314267D01*
X13745543Y-10333314D01*
X13745543Y-10438076D01*
X13745543Y-10333314D02*
X13755067Y-10314267D01*
X13774114Y-10304743D01*
X13802686Y-10304743D01*
X13821733Y-10314267D01*
X13831257Y-10333314D01*
X13831257Y-10438076D01*
X14221733Y-10228552D02*
X14050305Y-10485695D01*
X14478876Y-10238076D02*
X14497924Y-10238076D01*
X14516971Y-10247600D01*
X14526495Y-10257124D01*
X14536019Y-10276171D01*
X14545543Y-10314267D01*
X14545543Y-10361886D01*
X14536019Y-10399981D01*
X14526495Y-10419029D01*
X14516971Y-10428552D01*
X14497924Y-10438076D01*
X14478876Y-10438076D01*
X14459828Y-10428552D01*
X14450305Y-10419029D01*
X14440781Y-10399981D01*
X14431257Y-10361886D01*
X14431257Y-10314267D01*
X14440781Y-10276171D01*
X14450305Y-10257124D01*
X14459828Y-10247600D01*
X14478876Y-10238076D01*
X14631257Y-10419029D02*
X14640781Y-10428552D01*
X14631257Y-10438076D01*
X14621733Y-10428552D01*
X14631257Y-10419029D01*
X14631257Y-10438076D01*
X14764590Y-10238076D02*
X14783638Y-10238076D01*
X14802686Y-10247600D01*
X14812209Y-10257124D01*
X14821733Y-10276171D01*
X14831257Y-10314267D01*
X14831257Y-10361886D01*
X14821733Y-10399981D01*
X14812209Y-10419029D01*
X14802686Y-10428552D01*
X14783638Y-10438076D01*
X14764590Y-10438076D01*
X14745543Y-10428552D01*
X14736019Y-10419029D01*
X14726495Y-10399981D01*
X14716971Y-10361886D01*
X14716971Y-10314267D01*
X14726495Y-10276171D01*
X14736019Y-10257124D01*
X14745543Y-10247600D01*
X14764590Y-10238076D01*
X15021733Y-10438076D02*
X14907448Y-10438076D01*
X14964590Y-10438076D02*
X14964590Y-10238076D01*
X14945543Y-10266648D01*
X14926495Y-10285695D01*
X14907448Y-10295219D01*
X15212209Y-10438076D02*
X15097924Y-10438076D01*
X15155067Y-10438076D02*
X15155067Y-10238076D01*
X15136019Y-10266648D01*
X15116971Y-10285695D01*
X15097924Y-10295219D01*
X15326495Y-10323790D02*
X15307448Y-10314267D01*
X15297924Y-10304743D01*
X15288400Y-10285695D01*
X15288400Y-10276171D01*
X15297924Y-10257124D01*
X15307448Y-10247600D01*
X15326495Y-10238076D01*
X15364590Y-10238076D01*
X15383638Y-10247600D01*
X15393162Y-10257124D01*
X15402686Y-10276171D01*
X15402686Y-10285695D01*
X15393162Y-10304743D01*
X15383638Y-10314267D01*
X15364590Y-10323790D01*
X15326495Y-10323790D01*
X15307448Y-10333314D01*
X15297924Y-10342838D01*
X15288400Y-10361886D01*
X15288400Y-10399981D01*
X15297924Y-10419029D01*
X15307448Y-10428552D01*
X15326495Y-10438076D01*
X15364590Y-10438076D01*
X15383638Y-10428552D01*
X15393162Y-10419029D01*
X15402686Y-10399981D01*
X15402686Y-10361886D01*
X15393162Y-10342838D01*
X15383638Y-10333314D01*
X15364590Y-10323790D01*
X15478876Y-10238076D02*
X15478876Y-10276171D01*
X15555067Y-10238076D02*
X15555067Y-10276171D01*
X15850305Y-10514267D02*
X15840781Y-10504743D01*
X15821733Y-10476171D01*
X15812209Y-10457124D01*
X15802686Y-10428552D01*
X15793162Y-10380933D01*
X15793162Y-10342838D01*
X15802686Y-10295219D01*
X15812209Y-10266648D01*
X15821733Y-10247600D01*
X15840781Y-10219029D01*
X15850305Y-10209505D01*
X16031257Y-10438076D02*
X15916971Y-10438076D01*
X15974114Y-10438076D02*
X15974114Y-10238076D01*
X15955067Y-10266648D01*
X15936019Y-10285695D01*
X15916971Y-10295219D01*
X16202686Y-10304743D02*
X16202686Y-10438076D01*
X16155067Y-10228552D02*
X16107448Y-10371410D01*
X16231257Y-10371410D01*
X16402686Y-10238076D02*
X16307448Y-10238076D01*
X16297924Y-10333314D01*
X16307448Y-10323790D01*
X16326495Y-10314267D01*
X16374114Y-10314267D01*
X16393162Y-10323790D01*
X16402686Y-10333314D01*
X16412209Y-10352362D01*
X16412209Y-10399981D01*
X16402686Y-10419029D01*
X16393162Y-10428552D01*
X16374114Y-10438076D01*
X16326495Y-10438076D01*
X16307448Y-10428552D01*
X16297924Y-10419029D01*
X16650305Y-10438076D02*
X16650305Y-10238076D01*
X16736019Y-10438076D02*
X16736019Y-10333314D01*
X16726495Y-10314267D01*
X16707448Y-10304743D01*
X16678876Y-10304743D01*
X16659828Y-10314267D01*
X16650305Y-10323790D01*
X16859829Y-10438076D02*
X16840781Y-10428552D01*
X16831257Y-10419029D01*
X16821733Y-10399981D01*
X16821733Y-10342838D01*
X16831257Y-10323790D01*
X16840781Y-10314267D01*
X16859829Y-10304743D01*
X16888400Y-10304743D01*
X16907448Y-10314267D01*
X16916971Y-10323790D01*
X16926495Y-10342838D01*
X16926495Y-10399981D01*
X16916971Y-10419029D01*
X16907448Y-10428552D01*
X16888400Y-10438076D01*
X16859829Y-10438076D01*
X17040781Y-10438076D02*
X17021733Y-10428552D01*
X17012210Y-10409505D01*
X17012210Y-10238076D01*
X17193162Y-10428552D02*
X17174114Y-10438076D01*
X17136019Y-10438076D01*
X17116971Y-10428552D01*
X17107448Y-10409505D01*
X17107448Y-10333314D01*
X17116971Y-10314267D01*
X17136019Y-10304743D01*
X17174114Y-10304743D01*
X17193162Y-10314267D01*
X17202686Y-10333314D01*
X17202686Y-10352362D01*
X17107448Y-10371410D01*
X17278876Y-10428552D02*
X17297924Y-10438076D01*
X17336019Y-10438076D01*
X17355067Y-10428552D01*
X17364590Y-10409505D01*
X17364590Y-10399981D01*
X17355067Y-10380933D01*
X17336019Y-10371410D01*
X17307448Y-10371410D01*
X17288400Y-10361886D01*
X17278876Y-10342838D01*
X17278876Y-10333314D01*
X17288400Y-10314267D01*
X17307448Y-10304743D01*
X17336019Y-10304743D01*
X17355067Y-10314267D01*
X17431257Y-10514267D02*
X17440781Y-10504743D01*
X17459829Y-10476171D01*
X17469352Y-10457124D01*
X17478876Y-10428552D01*
X17488400Y-10380933D01*
X17488400Y-10342838D01*
X17478876Y-10295219D01*
X17469352Y-10266648D01*
X17459829Y-10247600D01*
X17440781Y-10219029D01*
X17431257Y-10209505D01*
D13*
X12278400Y-10611600D02*
G75*
G03*
X12278400Y-10611600I-30000J0D01*
G01*
D11*
X12574114Y-10502076D02*
X12593162Y-10502076D01*
X12612209Y-10511600D01*
X12621733Y-10521124D01*
X12631257Y-10540171D01*
X12640781Y-10578267D01*
X12640781Y-10625886D01*
X12631257Y-10663981D01*
X12621733Y-10683029D01*
X12612209Y-10692552D01*
X12593162Y-10702076D01*
X12574114Y-10702076D01*
X12555067Y-10692552D01*
X12545543Y-10683029D01*
X12536019Y-10663981D01*
X12526495Y-10625886D01*
X12526495Y-10578267D01*
X12536019Y-10540171D01*
X12545543Y-10521124D01*
X12555067Y-10511600D01*
X12574114Y-10502076D01*
X12726495Y-10683029D02*
X12736019Y-10692552D01*
X12726495Y-10702076D01*
X12716971Y-10692552D01*
X12726495Y-10683029D01*
X12726495Y-10702076D01*
X12907448Y-10502076D02*
X12869352Y-10502076D01*
X12850305Y-10511600D01*
X12840781Y-10521124D01*
X12821733Y-10549695D01*
X12812209Y-10587790D01*
X12812209Y-10663981D01*
X12821733Y-10683029D01*
X12831257Y-10692552D01*
X12850305Y-10702076D01*
X12888400Y-10702076D01*
X12907448Y-10692552D01*
X12916971Y-10683029D01*
X12926495Y-10663981D01*
X12926495Y-10616362D01*
X12916971Y-10597314D01*
X12907448Y-10587790D01*
X12888400Y-10578267D01*
X12850305Y-10578267D01*
X12831257Y-10587790D01*
X12821733Y-10597314D01*
X12812209Y-10616362D01*
X13050305Y-10502076D02*
X13069352Y-10502076D01*
X13088400Y-10511600D01*
X13097924Y-10521124D01*
X13107448Y-10540171D01*
X13116971Y-10578267D01*
X13116971Y-10625886D01*
X13107448Y-10663981D01*
X13097924Y-10683029D01*
X13088400Y-10692552D01*
X13069352Y-10702076D01*
X13050305Y-10702076D01*
X13031257Y-10692552D01*
X13021733Y-10683029D01*
X13012209Y-10663981D01*
X13002686Y-10625886D01*
X13002686Y-10578267D01*
X13012209Y-10540171D01*
X13021733Y-10521124D01*
X13031257Y-10511600D01*
X13050305Y-10502076D01*
X13240781Y-10502076D02*
X13259828Y-10502076D01*
X13278876Y-10511600D01*
X13288400Y-10521124D01*
X13297924Y-10540171D01*
X13307448Y-10578267D01*
X13307448Y-10625886D01*
X13297924Y-10663981D01*
X13288400Y-10683029D01*
X13278876Y-10692552D01*
X13259828Y-10702076D01*
X13240781Y-10702076D01*
X13221733Y-10692552D01*
X13212209Y-10683029D01*
X13202686Y-10663981D01*
X13193162Y-10625886D01*
X13193162Y-10578267D01*
X13202686Y-10540171D01*
X13212209Y-10521124D01*
X13221733Y-10511600D01*
X13240781Y-10502076D01*
X13393162Y-10702076D02*
X13393162Y-10568743D01*
X13393162Y-10587790D02*
X13402686Y-10578267D01*
X13421733Y-10568743D01*
X13450305Y-10568743D01*
X13469352Y-10578267D01*
X13478876Y-10597314D01*
X13478876Y-10702076D01*
X13478876Y-10597314D02*
X13488400Y-10578267D01*
X13507448Y-10568743D01*
X13536019Y-10568743D01*
X13555067Y-10578267D01*
X13564590Y-10597314D01*
X13564590Y-10702076D01*
X13659828Y-10702076D02*
X13659828Y-10568743D01*
X13659828Y-10587790D02*
X13669352Y-10578267D01*
X13688400Y-10568743D01*
X13716971Y-10568743D01*
X13736019Y-10578267D01*
X13745543Y-10597314D01*
X13745543Y-10702076D01*
X13745543Y-10597314D02*
X13755067Y-10578267D01*
X13774114Y-10568743D01*
X13802686Y-10568743D01*
X13821733Y-10578267D01*
X13831257Y-10597314D01*
X13831257Y-10702076D01*
X14221733Y-10492552D02*
X14050305Y-10749695D01*
X14478876Y-10502076D02*
X14497924Y-10502076D01*
X14516971Y-10511600D01*
X14526495Y-10521124D01*
X14536019Y-10540171D01*
X14545543Y-10578267D01*
X14545543Y-10625886D01*
X14536019Y-10663981D01*
X14526495Y-10683029D01*
X14516971Y-10692552D01*
X14497924Y-10702076D01*
X14478876Y-10702076D01*
X14459828Y-10692552D01*
X14450305Y-10683029D01*
X14440781Y-10663981D01*
X14431257Y-10625886D01*
X14431257Y-10578267D01*
X14440781Y-10540171D01*
X14450305Y-10521124D01*
X14459828Y-10511600D01*
X14478876Y-10502076D01*
X14631257Y-10683029D02*
X14640781Y-10692552D01*
X14631257Y-10702076D01*
X14621733Y-10692552D01*
X14631257Y-10683029D01*
X14631257Y-10702076D01*
X14764590Y-10502076D02*
X14783638Y-10502076D01*
X14802686Y-10511600D01*
X14812209Y-10521124D01*
X14821733Y-10540171D01*
X14831257Y-10578267D01*
X14831257Y-10625886D01*
X14821733Y-10663981D01*
X14812209Y-10683029D01*
X14802686Y-10692552D01*
X14783638Y-10702076D01*
X14764590Y-10702076D01*
X14745543Y-10692552D01*
X14736019Y-10683029D01*
X14726495Y-10663981D01*
X14716971Y-10625886D01*
X14716971Y-10578267D01*
X14726495Y-10540171D01*
X14736019Y-10521124D01*
X14745543Y-10511600D01*
X14764590Y-10502076D01*
X14907448Y-10521124D02*
X14916971Y-10511600D01*
X14936019Y-10502076D01*
X14983638Y-10502076D01*
X15002686Y-10511600D01*
X15012209Y-10521124D01*
X15021733Y-10540171D01*
X15021733Y-10559219D01*
X15012209Y-10587790D01*
X14897924Y-10702076D01*
X15021733Y-10702076D01*
X15088400Y-10502076D02*
X15212209Y-10502076D01*
X15145543Y-10578267D01*
X15174114Y-10578267D01*
X15193162Y-10587790D01*
X15202686Y-10597314D01*
X15212209Y-10616362D01*
X15212209Y-10663981D01*
X15202686Y-10683029D01*
X15193162Y-10692552D01*
X15174114Y-10702076D01*
X15116971Y-10702076D01*
X15097924Y-10692552D01*
X15088400Y-10683029D01*
X15383638Y-10502076D02*
X15345543Y-10502076D01*
X15326495Y-10511600D01*
X15316971Y-10521124D01*
X15297924Y-10549695D01*
X15288400Y-10587790D01*
X15288400Y-10663981D01*
X15297924Y-10683029D01*
X15307448Y-10692552D01*
X15326495Y-10702076D01*
X15364590Y-10702076D01*
X15383638Y-10692552D01*
X15393162Y-10683029D01*
X15402686Y-10663981D01*
X15402686Y-10616362D01*
X15393162Y-10597314D01*
X15383638Y-10587790D01*
X15364590Y-10578267D01*
X15326495Y-10578267D01*
X15307448Y-10587790D01*
X15297924Y-10597314D01*
X15288400Y-10616362D01*
X15478876Y-10502076D02*
X15478876Y-10540171D01*
X15555067Y-10502076D02*
X15555067Y-10540171D01*
X15850305Y-10778267D02*
X15840781Y-10768743D01*
X15821733Y-10740171D01*
X15812209Y-10721124D01*
X15802686Y-10692552D01*
X15793162Y-10644933D01*
X15793162Y-10606838D01*
X15802686Y-10559219D01*
X15812209Y-10530648D01*
X15821733Y-10511600D01*
X15840781Y-10483029D01*
X15850305Y-10473505D01*
X15964590Y-10502076D02*
X15983638Y-10502076D01*
X16002686Y-10511600D01*
X16012209Y-10521124D01*
X16021733Y-10540171D01*
X16031257Y-10578267D01*
X16031257Y-10625886D01*
X16021733Y-10663981D01*
X16012209Y-10683029D01*
X16002686Y-10692552D01*
X15983638Y-10702076D01*
X15964590Y-10702076D01*
X15945543Y-10692552D01*
X15936019Y-10683029D01*
X15926495Y-10663981D01*
X15916971Y-10625886D01*
X15916971Y-10578267D01*
X15926495Y-10540171D01*
X15936019Y-10521124D01*
X15945543Y-10511600D01*
X15964590Y-10502076D01*
X16269352Y-10702076D02*
X16269352Y-10502076D01*
X16355067Y-10702076D02*
X16355067Y-10597314D01*
X16345543Y-10578267D01*
X16326495Y-10568743D01*
X16297924Y-10568743D01*
X16278876Y-10578267D01*
X16269352Y-10587790D01*
X16478876Y-10702076D02*
X16459828Y-10692552D01*
X16450305Y-10683029D01*
X16440781Y-10663981D01*
X16440781Y-10606838D01*
X16450305Y-10587790D01*
X16459828Y-10578267D01*
X16478876Y-10568743D01*
X16507448Y-10568743D01*
X16526495Y-10578267D01*
X16536019Y-10587790D01*
X16545543Y-10606838D01*
X16545543Y-10663981D01*
X16536019Y-10683029D01*
X16526495Y-10692552D01*
X16507448Y-10702076D01*
X16478876Y-10702076D01*
X16659828Y-10702076D02*
X16640781Y-10692552D01*
X16631257Y-10673505D01*
X16631257Y-10502076D01*
X16812210Y-10692552D02*
X16793162Y-10702076D01*
X16755067Y-10702076D01*
X16736019Y-10692552D01*
X16726495Y-10673505D01*
X16726495Y-10597314D01*
X16736019Y-10578267D01*
X16755067Y-10568743D01*
X16793162Y-10568743D01*
X16812210Y-10578267D01*
X16821733Y-10597314D01*
X16821733Y-10616362D01*
X16726495Y-10635410D01*
X16897924Y-10692552D02*
X16916971Y-10702076D01*
X16955067Y-10702076D01*
X16974114Y-10692552D01*
X16983638Y-10673505D01*
X16983638Y-10663981D01*
X16974114Y-10644933D01*
X16955067Y-10635410D01*
X16926495Y-10635410D01*
X16907448Y-10625886D01*
X16897924Y-10606838D01*
X16897924Y-10597314D01*
X16907448Y-10578267D01*
X16926495Y-10568743D01*
X16955067Y-10568743D01*
X16974114Y-10578267D01*
X17221733Y-10625886D02*
X17374114Y-10625886D01*
X17297924Y-10702076D02*
X17297924Y-10549695D01*
X17707448Y-10568743D02*
X17707448Y-10702076D01*
X17659829Y-10492552D02*
X17612210Y-10635410D01*
X17736019Y-10635410D01*
X17955067Y-10692552D02*
X17974114Y-10702076D01*
X18012210Y-10702076D01*
X18031257Y-10692552D01*
X18040781Y-10673505D01*
X18040781Y-10663981D01*
X18031257Y-10644933D01*
X18012210Y-10635410D01*
X17983638Y-10635410D01*
X17964590Y-10625886D01*
X17955067Y-10606838D01*
X17955067Y-10597314D01*
X17964590Y-10578267D01*
X17983638Y-10568743D01*
X18012210Y-10568743D01*
X18031257Y-10578267D01*
X18155067Y-10702076D02*
X18136019Y-10692552D01*
X18126495Y-10673505D01*
X18126495Y-10502076D01*
X18259829Y-10702076D02*
X18240781Y-10692552D01*
X18231257Y-10683029D01*
X18221733Y-10663981D01*
X18221733Y-10606838D01*
X18231257Y-10587790D01*
X18240781Y-10578267D01*
X18259829Y-10568743D01*
X18288400Y-10568743D01*
X18307448Y-10578267D01*
X18316971Y-10587790D01*
X18326495Y-10606838D01*
X18326495Y-10663981D01*
X18316971Y-10683029D01*
X18307448Y-10692552D01*
X18288400Y-10702076D01*
X18259829Y-10702076D01*
X18383638Y-10568743D02*
X18459829Y-10568743D01*
X18412210Y-10502076D02*
X18412210Y-10673505D01*
X18421733Y-10692552D01*
X18440781Y-10702076D01*
X18459829Y-10702076D01*
X18516971Y-10692552D02*
X18536019Y-10702076D01*
X18574114Y-10702076D01*
X18593162Y-10692552D01*
X18602686Y-10673505D01*
X18602686Y-10663981D01*
X18593162Y-10644933D01*
X18574114Y-10635410D01*
X18545543Y-10635410D01*
X18526495Y-10625886D01*
X18516971Y-10606838D01*
X18516971Y-10597314D01*
X18526495Y-10578267D01*
X18545543Y-10568743D01*
X18574114Y-10568743D01*
X18593162Y-10578267D01*
X18669352Y-10778267D02*
X18678876Y-10768743D01*
X18697924Y-10740171D01*
X18707448Y-10721124D01*
X18716971Y-10692552D01*
X18726495Y-10644933D01*
X18726495Y-10606838D01*
X18716971Y-10559219D01*
X18707448Y-10530648D01*
X18697924Y-10511600D01*
X18678876Y-10483029D01*
X18669352Y-10473505D01*
D14*
X12233400Y-10830600D02*
X12233400Y-10920600D01*
X12188400Y-10875600D02*
X12278400Y-10875600D01*
D11*
X12574114Y-10766076D02*
X12593162Y-10766076D01*
X12612209Y-10775600D01*
X12621733Y-10785124D01*
X12631257Y-10804171D01*
X12640781Y-10842267D01*
X12640781Y-10889886D01*
X12631257Y-10927981D01*
X12621733Y-10947029D01*
X12612209Y-10956552D01*
X12593162Y-10966076D01*
X12574114Y-10966076D01*
X12555067Y-10956552D01*
X12545543Y-10947029D01*
X12536019Y-10927981D01*
X12526495Y-10889886D01*
X12526495Y-10842267D01*
X12536019Y-10804171D01*
X12545543Y-10785124D01*
X12555067Y-10775600D01*
X12574114Y-10766076D01*
X12726495Y-10947029D02*
X12736019Y-10956552D01*
X12726495Y-10966076D01*
X12716971Y-10956552D01*
X12726495Y-10947029D01*
X12726495Y-10966076D01*
X12831257Y-10966076D02*
X12869352Y-10966076D01*
X12888400Y-10956552D01*
X12897924Y-10947029D01*
X12916971Y-10918457D01*
X12926495Y-10880362D01*
X12926495Y-10804171D01*
X12916971Y-10785124D01*
X12907448Y-10775600D01*
X12888400Y-10766076D01*
X12850305Y-10766076D01*
X12831257Y-10775600D01*
X12821733Y-10785124D01*
X12812209Y-10804171D01*
X12812209Y-10851790D01*
X12821733Y-10870838D01*
X12831257Y-10880362D01*
X12850305Y-10889886D01*
X12888400Y-10889886D01*
X12907448Y-10880362D01*
X12916971Y-10870838D01*
X12926495Y-10851790D01*
X13050305Y-10766076D02*
X13069352Y-10766076D01*
X13088400Y-10775600D01*
X13097924Y-10785124D01*
X13107448Y-10804171D01*
X13116971Y-10842267D01*
X13116971Y-10889886D01*
X13107448Y-10927981D01*
X13097924Y-10947029D01*
X13088400Y-10956552D01*
X13069352Y-10966076D01*
X13050305Y-10966076D01*
X13031257Y-10956552D01*
X13021733Y-10947029D01*
X13012209Y-10927981D01*
X13002686Y-10889886D01*
X13002686Y-10842267D01*
X13012209Y-10804171D01*
X13021733Y-10785124D01*
X13031257Y-10775600D01*
X13050305Y-10766076D01*
X13240781Y-10766076D02*
X13259828Y-10766076D01*
X13278876Y-10775600D01*
X13288400Y-10785124D01*
X13297924Y-10804171D01*
X13307448Y-10842267D01*
X13307448Y-10889886D01*
X13297924Y-10927981D01*
X13288400Y-10947029D01*
X13278876Y-10956552D01*
X13259828Y-10966076D01*
X13240781Y-10966076D01*
X13221733Y-10956552D01*
X13212209Y-10947029D01*
X13202686Y-10927981D01*
X13193162Y-10889886D01*
X13193162Y-10842267D01*
X13202686Y-10804171D01*
X13212209Y-10785124D01*
X13221733Y-10775600D01*
X13240781Y-10766076D01*
X13393162Y-10966076D02*
X13393162Y-10832743D01*
X13393162Y-10851790D02*
X13402686Y-10842267D01*
X13421733Y-10832743D01*
X13450305Y-10832743D01*
X13469352Y-10842267D01*
X13478876Y-10861314D01*
X13478876Y-10966076D01*
X13478876Y-10861314D02*
X13488400Y-10842267D01*
X13507448Y-10832743D01*
X13536019Y-10832743D01*
X13555067Y-10842267D01*
X13564590Y-10861314D01*
X13564590Y-10966076D01*
X13659828Y-10966076D02*
X13659828Y-10832743D01*
X13659828Y-10851790D02*
X13669352Y-10842267D01*
X13688400Y-10832743D01*
X13716971Y-10832743D01*
X13736019Y-10842267D01*
X13745543Y-10861314D01*
X13745543Y-10966076D01*
X13745543Y-10861314D02*
X13755067Y-10842267D01*
X13774114Y-10832743D01*
X13802686Y-10832743D01*
X13821733Y-10842267D01*
X13831257Y-10861314D01*
X13831257Y-10966076D01*
X14221733Y-10756552D02*
X14050305Y-11013695D01*
X14478876Y-10766076D02*
X14497924Y-10766076D01*
X14516971Y-10775600D01*
X14526495Y-10785124D01*
X14536019Y-10804171D01*
X14545543Y-10842267D01*
X14545543Y-10889886D01*
X14536019Y-10927981D01*
X14526495Y-10947029D01*
X14516971Y-10956552D01*
X14497924Y-10966076D01*
X14478876Y-10966076D01*
X14459828Y-10956552D01*
X14450305Y-10947029D01*
X14440781Y-10927981D01*
X14431257Y-10889886D01*
X14431257Y-10842267D01*
X14440781Y-10804171D01*
X14450305Y-10785124D01*
X14459828Y-10775600D01*
X14478876Y-10766076D01*
X14631257Y-10947029D02*
X14640781Y-10956552D01*
X14631257Y-10966076D01*
X14621733Y-10956552D01*
X14631257Y-10947029D01*
X14631257Y-10966076D01*
X14764590Y-10766076D02*
X14783638Y-10766076D01*
X14802686Y-10775600D01*
X14812209Y-10785124D01*
X14821733Y-10804171D01*
X14831257Y-10842267D01*
X14831257Y-10889886D01*
X14821733Y-10927981D01*
X14812209Y-10947029D01*
X14802686Y-10956552D01*
X14783638Y-10966076D01*
X14764590Y-10966076D01*
X14745543Y-10956552D01*
X14736019Y-10947029D01*
X14726495Y-10927981D01*
X14716971Y-10889886D01*
X14716971Y-10842267D01*
X14726495Y-10804171D01*
X14736019Y-10785124D01*
X14745543Y-10775600D01*
X14764590Y-10766076D01*
X14897924Y-10766076D02*
X15021733Y-10766076D01*
X14955067Y-10842267D01*
X14983638Y-10842267D01*
X15002686Y-10851790D01*
X15012209Y-10861314D01*
X15021733Y-10880362D01*
X15021733Y-10927981D01*
X15012209Y-10947029D01*
X15002686Y-10956552D01*
X14983638Y-10966076D01*
X14926495Y-10966076D01*
X14907448Y-10956552D01*
X14897924Y-10947029D01*
X15202686Y-10766076D02*
X15107448Y-10766076D01*
X15097924Y-10861314D01*
X15107448Y-10851790D01*
X15126495Y-10842267D01*
X15174114Y-10842267D01*
X15193162Y-10851790D01*
X15202686Y-10861314D01*
X15212209Y-10880362D01*
X15212209Y-10927981D01*
X15202686Y-10947029D01*
X15193162Y-10956552D01*
X15174114Y-10966076D01*
X15126495Y-10966076D01*
X15107448Y-10956552D01*
X15097924Y-10947029D01*
X15383638Y-10832743D02*
X15383638Y-10966076D01*
X15336019Y-10756552D02*
X15288400Y-10899410D01*
X15412209Y-10899410D01*
X15478876Y-10766076D02*
X15478876Y-10804171D01*
X15555067Y-10766076D02*
X15555067Y-10804171D01*
X15850305Y-11042267D02*
X15840781Y-11032743D01*
X15821733Y-11004171D01*
X15812209Y-10985124D01*
X15802686Y-10956552D01*
X15793162Y-10908933D01*
X15793162Y-10870838D01*
X15802686Y-10823219D01*
X15812209Y-10794648D01*
X15821733Y-10775600D01*
X15840781Y-10747029D01*
X15850305Y-10737505D01*
X16012209Y-10766076D02*
X15974114Y-10766076D01*
X15955067Y-10775600D01*
X15945543Y-10785124D01*
X15926495Y-10813695D01*
X15916971Y-10851790D01*
X15916971Y-10927981D01*
X15926495Y-10947029D01*
X15936019Y-10956552D01*
X15955067Y-10966076D01*
X15993162Y-10966076D01*
X16012209Y-10956552D01*
X16021733Y-10947029D01*
X16031257Y-10927981D01*
X16031257Y-10880362D01*
X16021733Y-10861314D01*
X16012209Y-10851790D01*
X15993162Y-10842267D01*
X15955067Y-10842267D01*
X15936019Y-10851790D01*
X15926495Y-10861314D01*
X15916971Y-10880362D01*
X16269352Y-10966076D02*
X16269352Y-10766076D01*
X16355067Y-10966076D02*
X16355067Y-10861314D01*
X16345543Y-10842267D01*
X16326495Y-10832743D01*
X16297924Y-10832743D01*
X16278876Y-10842267D01*
X16269352Y-10851790D01*
X16478876Y-10966076D02*
X16459828Y-10956552D01*
X16450305Y-10947029D01*
X16440781Y-10927981D01*
X16440781Y-10870838D01*
X16450305Y-10851790D01*
X16459828Y-10842267D01*
X16478876Y-10832743D01*
X16507448Y-10832743D01*
X16526495Y-10842267D01*
X16536019Y-10851790D01*
X16545543Y-10870838D01*
X16545543Y-10927981D01*
X16536019Y-10947029D01*
X16526495Y-10956552D01*
X16507448Y-10966076D01*
X16478876Y-10966076D01*
X16659828Y-10966076D02*
X16640781Y-10956552D01*
X16631257Y-10937505D01*
X16631257Y-10766076D01*
X16812210Y-10956552D02*
X16793162Y-10966076D01*
X16755067Y-10966076D01*
X16736019Y-10956552D01*
X16726495Y-10937505D01*
X16726495Y-10861314D01*
X16736019Y-10842267D01*
X16755067Y-10832743D01*
X16793162Y-10832743D01*
X16812210Y-10842267D01*
X16821733Y-10861314D01*
X16821733Y-10880362D01*
X16726495Y-10899410D01*
X16897924Y-10956552D02*
X16916971Y-10966076D01*
X16955067Y-10966076D01*
X16974114Y-10956552D01*
X16983638Y-10937505D01*
X16983638Y-10927981D01*
X16974114Y-10908933D01*
X16955067Y-10899410D01*
X16926495Y-10899410D01*
X16907448Y-10889886D01*
X16897924Y-10870838D01*
X16897924Y-10861314D01*
X16907448Y-10842267D01*
X16926495Y-10832743D01*
X16955067Y-10832743D01*
X16974114Y-10842267D01*
X17050305Y-11042267D02*
X17059829Y-11032743D01*
X17078876Y-11004171D01*
X17088400Y-10985124D01*
X17097924Y-10956552D01*
X17107448Y-10908933D01*
X17107448Y-10870838D01*
X17097924Y-10823219D01*
X17088400Y-10794648D01*
X17078876Y-10775600D01*
X17059829Y-10747029D01*
X17050305Y-10737505D01*
D15*
X12263756Y-11174956D02*
X12263756Y-11104244D01*
X12193044Y-11104244D01*
X12193044Y-11174956D01*
X12263756Y-11174956D01*
D11*
X12640781Y-11230076D02*
X12526495Y-11230076D01*
X12583638Y-11230076D02*
X12583638Y-11030076D01*
X12564590Y-11058648D01*
X12545543Y-11077695D01*
X12526495Y-11087219D01*
X12726495Y-11211028D02*
X12736019Y-11220552D01*
X12726495Y-11230076D01*
X12716971Y-11220552D01*
X12726495Y-11211028D01*
X12726495Y-11230076D01*
X12859828Y-11030076D02*
X12878876Y-11030076D01*
X12897924Y-11039600D01*
X12907448Y-11049124D01*
X12916971Y-11068171D01*
X12926495Y-11106267D01*
X12926495Y-11153886D01*
X12916971Y-11191981D01*
X12907448Y-11211028D01*
X12897924Y-11220552D01*
X12878876Y-11230076D01*
X12859828Y-11230076D01*
X12840781Y-11220552D01*
X12831257Y-11211028D01*
X12821733Y-11191981D01*
X12812209Y-11153886D01*
X12812209Y-11106267D01*
X12821733Y-11068171D01*
X12831257Y-11049124D01*
X12840781Y-11039600D01*
X12859828Y-11030076D01*
X13050305Y-11030076D02*
X13069352Y-11030076D01*
X13088400Y-11039600D01*
X13097924Y-11049124D01*
X13107448Y-11068171D01*
X13116971Y-11106267D01*
X13116971Y-11153886D01*
X13107448Y-11191981D01*
X13097924Y-11211028D01*
X13088400Y-11220552D01*
X13069352Y-11230076D01*
X13050305Y-11230076D01*
X13031257Y-11220552D01*
X13021733Y-11211028D01*
X13012209Y-11191981D01*
X13002686Y-11153886D01*
X13002686Y-11106267D01*
X13012209Y-11068171D01*
X13021733Y-11049124D01*
X13031257Y-11039600D01*
X13050305Y-11030076D01*
X13240781Y-11030076D02*
X13259828Y-11030076D01*
X13278876Y-11039600D01*
X13288400Y-11049124D01*
X13297924Y-11068171D01*
X13307448Y-11106267D01*
X13307448Y-11153886D01*
X13297924Y-11191981D01*
X13288400Y-11211028D01*
X13278876Y-11220552D01*
X13259828Y-11230076D01*
X13240781Y-11230076D01*
X13221733Y-11220552D01*
X13212209Y-11211028D01*
X13202686Y-11191981D01*
X13193162Y-11153886D01*
X13193162Y-11106267D01*
X13202686Y-11068171D01*
X13212209Y-11049124D01*
X13221733Y-11039600D01*
X13240781Y-11030076D01*
X13393162Y-11230076D02*
X13393162Y-11096743D01*
X13393162Y-11115790D02*
X13402686Y-11106267D01*
X13421733Y-11096743D01*
X13450305Y-11096743D01*
X13469352Y-11106267D01*
X13478876Y-11125314D01*
X13478876Y-11230076D01*
X13478876Y-11125314D02*
X13488400Y-11106267D01*
X13507448Y-11096743D01*
X13536019Y-11096743D01*
X13555067Y-11106267D01*
X13564590Y-11125314D01*
X13564590Y-11230076D01*
X13659828Y-11230076D02*
X13659828Y-11096743D01*
X13659828Y-11115790D02*
X13669352Y-11106267D01*
X13688400Y-11096743D01*
X13716971Y-11096743D01*
X13736019Y-11106267D01*
X13745543Y-11125314D01*
X13745543Y-11230076D01*
X13745543Y-11125314D02*
X13755067Y-11106267D01*
X13774114Y-11096743D01*
X13802686Y-11096743D01*
X13821733Y-11106267D01*
X13831257Y-11125314D01*
X13831257Y-11230076D01*
X14221733Y-11020552D02*
X14050305Y-11277695D01*
X14478876Y-11030076D02*
X14497924Y-11030076D01*
X14516971Y-11039600D01*
X14526495Y-11049124D01*
X14536019Y-11068171D01*
X14545543Y-11106267D01*
X14545543Y-11153886D01*
X14536019Y-11191981D01*
X14526495Y-11211028D01*
X14516971Y-11220552D01*
X14497924Y-11230076D01*
X14478876Y-11230076D01*
X14459828Y-11220552D01*
X14450305Y-11211028D01*
X14440781Y-11191981D01*
X14431257Y-11153886D01*
X14431257Y-11106267D01*
X14440781Y-11068171D01*
X14450305Y-11049124D01*
X14459828Y-11039600D01*
X14478876Y-11030076D01*
X14631257Y-11211028D02*
X14640781Y-11220552D01*
X14631257Y-11230076D01*
X14621733Y-11220552D01*
X14631257Y-11211028D01*
X14631257Y-11230076D01*
X14764590Y-11030076D02*
X14783638Y-11030076D01*
X14802686Y-11039600D01*
X14812209Y-11049124D01*
X14821733Y-11068171D01*
X14831257Y-11106267D01*
X14831257Y-11153886D01*
X14821733Y-11191981D01*
X14812209Y-11211028D01*
X14802686Y-11220552D01*
X14783638Y-11230076D01*
X14764590Y-11230076D01*
X14745543Y-11220552D01*
X14736019Y-11211028D01*
X14726495Y-11191981D01*
X14716971Y-11153886D01*
X14716971Y-11106267D01*
X14726495Y-11068171D01*
X14736019Y-11049124D01*
X14745543Y-11039600D01*
X14764590Y-11030076D01*
X14897924Y-11030076D02*
X15021733Y-11030076D01*
X14955067Y-11106267D01*
X14983638Y-11106267D01*
X15002686Y-11115790D01*
X15012209Y-11125314D01*
X15021733Y-11144362D01*
X15021733Y-11191981D01*
X15012209Y-11211028D01*
X15002686Y-11220552D01*
X14983638Y-11230076D01*
X14926495Y-11230076D01*
X14907448Y-11220552D01*
X14897924Y-11211028D01*
X15116971Y-11230076D02*
X15155067Y-11230076D01*
X15174114Y-11220552D01*
X15183638Y-11211028D01*
X15202686Y-11182457D01*
X15212209Y-11144362D01*
X15212209Y-11068171D01*
X15202686Y-11049124D01*
X15193162Y-11039600D01*
X15174114Y-11030076D01*
X15136019Y-11030076D01*
X15116971Y-11039600D01*
X15107448Y-11049124D01*
X15097924Y-11068171D01*
X15097924Y-11115790D01*
X15107448Y-11134838D01*
X15116971Y-11144362D01*
X15136019Y-11153886D01*
X15174114Y-11153886D01*
X15193162Y-11144362D01*
X15202686Y-11134838D01*
X15212209Y-11115790D01*
X15383638Y-11096743D02*
X15383638Y-11230076D01*
X15336019Y-11020552D02*
X15288400Y-11163410D01*
X15412209Y-11163410D01*
X15478876Y-11030076D02*
X15478876Y-11068171D01*
X15555067Y-11030076D02*
X15555067Y-11068171D01*
X15850305Y-11306267D02*
X15840781Y-11296743D01*
X15821733Y-11268171D01*
X15812209Y-11249124D01*
X15802686Y-11220552D01*
X15793162Y-11172933D01*
X15793162Y-11134838D01*
X15802686Y-11087219D01*
X15812209Y-11058648D01*
X15821733Y-11039600D01*
X15840781Y-11011029D01*
X15850305Y-11001505D01*
X16012209Y-11096743D02*
X16012209Y-11230076D01*
X15964590Y-11020552D02*
X15916971Y-11163410D01*
X16040781Y-11163410D01*
X16269352Y-11230076D02*
X16269352Y-11030076D01*
X16355067Y-11230076D02*
X16355067Y-11125314D01*
X16345543Y-11106267D01*
X16326495Y-11096743D01*
X16297924Y-11096743D01*
X16278876Y-11106267D01*
X16269352Y-11115790D01*
X16478876Y-11230076D02*
X16459828Y-11220552D01*
X16450305Y-11211028D01*
X16440781Y-11191981D01*
X16440781Y-11134838D01*
X16450305Y-11115790D01*
X16459828Y-11106267D01*
X16478876Y-11096743D01*
X16507448Y-11096743D01*
X16526495Y-11106267D01*
X16536019Y-11115790D01*
X16545543Y-11134838D01*
X16545543Y-11191981D01*
X16536019Y-11211028D01*
X16526495Y-11220552D01*
X16507448Y-11230076D01*
X16478876Y-11230076D01*
X16659828Y-11230076D02*
X16640781Y-11220552D01*
X16631257Y-11201505D01*
X16631257Y-11030076D01*
X16812210Y-11220552D02*
X16793162Y-11230076D01*
X16755067Y-11230076D01*
X16736019Y-11220552D01*
X16726495Y-11201505D01*
X16726495Y-11125314D01*
X16736019Y-11106267D01*
X16755067Y-11096743D01*
X16793162Y-11096743D01*
X16812210Y-11106267D01*
X16821733Y-11125314D01*
X16821733Y-11144362D01*
X16726495Y-11163410D01*
X16897924Y-11220552D02*
X16916971Y-11230076D01*
X16955067Y-11230076D01*
X16974114Y-11220552D01*
X16983638Y-11201505D01*
X16983638Y-11191981D01*
X16974114Y-11172933D01*
X16955067Y-11163410D01*
X16926495Y-11163410D01*
X16907448Y-11153886D01*
X16897924Y-11134838D01*
X16897924Y-11125314D01*
X16907448Y-11106267D01*
X16926495Y-11096743D01*
X16955067Y-11096743D01*
X16974114Y-11106267D01*
X17050305Y-11306267D02*
X17059829Y-11296743D01*
X17078876Y-11268171D01*
X17088400Y-11249124D01*
X17097924Y-11220552D01*
X17107448Y-11172933D01*
X17107448Y-11134838D01*
X17097924Y-11087219D01*
X17088400Y-11058648D01*
X17078876Y-11039600D01*
X17059829Y-11011029D01*
X17050305Y-11001505D01*
D16*
X12218400Y-11463600D02*
X12278400Y-11403600D01*
X12218400Y-11343600D01*
X12158400Y-11403600D01*
X12218400Y-11463600D01*
D11*
X12640781Y-11494076D02*
X12526495Y-11494076D01*
X12583638Y-11494076D02*
X12583638Y-11294076D01*
X12564590Y-11322648D01*
X12545543Y-11341695D01*
X12526495Y-11351219D01*
X12726495Y-11475028D02*
X12736019Y-11484552D01*
X12726495Y-11494076D01*
X12716971Y-11484552D01*
X12726495Y-11475028D01*
X12726495Y-11494076D01*
X12812209Y-11313124D02*
X12821733Y-11303600D01*
X12840781Y-11294076D01*
X12888400Y-11294076D01*
X12907448Y-11303600D01*
X12916971Y-11313124D01*
X12926495Y-11332171D01*
X12926495Y-11351219D01*
X12916971Y-11379790D01*
X12802686Y-11494076D01*
X12926495Y-11494076D01*
X13050305Y-11294076D02*
X13069352Y-11294076D01*
X13088400Y-11303600D01*
X13097924Y-11313124D01*
X13107448Y-11332171D01*
X13116971Y-11370267D01*
X13116971Y-11417886D01*
X13107448Y-11455981D01*
X13097924Y-11475028D01*
X13088400Y-11484552D01*
X13069352Y-11494076D01*
X13050305Y-11494076D01*
X13031257Y-11484552D01*
X13021733Y-11475028D01*
X13012209Y-11455981D01*
X13002686Y-11417886D01*
X13002686Y-11370267D01*
X13012209Y-11332171D01*
X13021733Y-11313124D01*
X13031257Y-11303600D01*
X13050305Y-11294076D01*
X13240781Y-11294076D02*
X13259828Y-11294076D01*
X13278876Y-11303600D01*
X13288400Y-11313124D01*
X13297924Y-11332171D01*
X13307448Y-11370267D01*
X13307448Y-11417886D01*
X13297924Y-11455981D01*
X13288400Y-11475028D01*
X13278876Y-11484552D01*
X13259828Y-11494076D01*
X13240781Y-11494076D01*
X13221733Y-11484552D01*
X13212209Y-11475028D01*
X13202686Y-11455981D01*
X13193162Y-11417886D01*
X13193162Y-11370267D01*
X13202686Y-11332171D01*
X13212209Y-11313124D01*
X13221733Y-11303600D01*
X13240781Y-11294076D01*
X13393162Y-11494076D02*
X13393162Y-11360743D01*
X13393162Y-11379790D02*
X13402686Y-11370267D01*
X13421733Y-11360743D01*
X13450305Y-11360743D01*
X13469352Y-11370267D01*
X13478876Y-11389314D01*
X13478876Y-11494076D01*
X13478876Y-11389314D02*
X13488400Y-11370267D01*
X13507448Y-11360743D01*
X13536019Y-11360743D01*
X13555067Y-11370267D01*
X13564590Y-11389314D01*
X13564590Y-11494076D01*
X13659828Y-11494076D02*
X13659828Y-11360743D01*
X13659828Y-11379790D02*
X13669352Y-11370267D01*
X13688400Y-11360743D01*
X13716971Y-11360743D01*
X13736019Y-11370267D01*
X13745543Y-11389314D01*
X13745543Y-11494076D01*
X13745543Y-11389314D02*
X13755067Y-11370267D01*
X13774114Y-11360743D01*
X13802686Y-11360743D01*
X13821733Y-11370267D01*
X13831257Y-11389314D01*
X13831257Y-11494076D01*
X14221733Y-11284552D02*
X14050305Y-11541695D01*
X14478876Y-11294076D02*
X14497924Y-11294076D01*
X14516971Y-11303600D01*
X14526495Y-11313124D01*
X14536019Y-11332171D01*
X14545543Y-11370267D01*
X14545543Y-11417886D01*
X14536019Y-11455981D01*
X14526495Y-11475028D01*
X14516971Y-11484552D01*
X14497924Y-11494076D01*
X14478876Y-11494076D01*
X14459828Y-11484552D01*
X14450305Y-11475028D01*
X14440781Y-11455981D01*
X14431257Y-11417886D01*
X14431257Y-11370267D01*
X14440781Y-11332171D01*
X14450305Y-11313124D01*
X14459828Y-11303600D01*
X14478876Y-11294076D01*
X14631257Y-11475028D02*
X14640781Y-11484552D01*
X14631257Y-11494076D01*
X14621733Y-11484552D01*
X14631257Y-11475028D01*
X14631257Y-11494076D01*
X14764590Y-11294076D02*
X14783638Y-11294076D01*
X14802686Y-11303600D01*
X14812209Y-11313124D01*
X14821733Y-11332171D01*
X14831257Y-11370267D01*
X14831257Y-11417886D01*
X14821733Y-11455981D01*
X14812209Y-11475028D01*
X14802686Y-11484552D01*
X14783638Y-11494076D01*
X14764590Y-11494076D01*
X14745543Y-11484552D01*
X14736019Y-11475028D01*
X14726495Y-11455981D01*
X14716971Y-11417886D01*
X14716971Y-11370267D01*
X14726495Y-11332171D01*
X14736019Y-11313124D01*
X14745543Y-11303600D01*
X14764590Y-11294076D01*
X15002686Y-11360743D02*
X15002686Y-11494076D01*
X14955067Y-11284552D02*
X14907448Y-11427409D01*
X15031257Y-11427409D01*
X15088400Y-11294076D02*
X15221733Y-11294076D01*
X15136019Y-11494076D01*
X15288400Y-11313124D02*
X15297924Y-11303600D01*
X15316971Y-11294076D01*
X15364590Y-11294076D01*
X15383638Y-11303600D01*
X15393162Y-11313124D01*
X15402686Y-11332171D01*
X15402686Y-11351219D01*
X15393162Y-11379790D01*
X15278876Y-11494076D01*
X15402686Y-11494076D01*
X15478876Y-11294076D02*
X15478876Y-11332171D01*
X15555067Y-11294076D02*
X15555067Y-11332171D01*
X15850305Y-11570267D02*
X15840781Y-11560743D01*
X15821733Y-11532171D01*
X15812209Y-11513124D01*
X15802686Y-11484552D01*
X15793162Y-11436933D01*
X15793162Y-11398838D01*
X15802686Y-11351219D01*
X15812209Y-11322648D01*
X15821733Y-11303600D01*
X15840781Y-11275028D01*
X15850305Y-11265505D01*
X16012209Y-11360743D02*
X16012209Y-11494076D01*
X15964590Y-11284552D02*
X15916971Y-11427409D01*
X16040781Y-11427409D01*
X16269352Y-11494076D02*
X16269352Y-11294076D01*
X16355067Y-11494076D02*
X16355067Y-11389314D01*
X16345543Y-11370267D01*
X16326495Y-11360743D01*
X16297924Y-11360743D01*
X16278876Y-11370267D01*
X16269352Y-11379790D01*
X16478876Y-11494076D02*
X16459828Y-11484552D01*
X16450305Y-11475028D01*
X16440781Y-11455981D01*
X16440781Y-11398838D01*
X16450305Y-11379790D01*
X16459828Y-11370267D01*
X16478876Y-11360743D01*
X16507448Y-11360743D01*
X16526495Y-11370267D01*
X16536019Y-11379790D01*
X16545543Y-11398838D01*
X16545543Y-11455981D01*
X16536019Y-11475028D01*
X16526495Y-11484552D01*
X16507448Y-11494076D01*
X16478876Y-11494076D01*
X16659828Y-11494076D02*
X16640781Y-11484552D01*
X16631257Y-11465505D01*
X16631257Y-11294076D01*
X16812210Y-11484552D02*
X16793162Y-11494076D01*
X16755067Y-11494076D01*
X16736019Y-11484552D01*
X16726495Y-11465505D01*
X16726495Y-11389314D01*
X16736019Y-11370267D01*
X16755067Y-11360743D01*
X16793162Y-11360743D01*
X16812210Y-11370267D01*
X16821733Y-11389314D01*
X16821733Y-11408362D01*
X16726495Y-11427409D01*
X16897924Y-11484552D02*
X16916971Y-11494076D01*
X16955067Y-11494076D01*
X16974114Y-11484552D01*
X16983638Y-11465505D01*
X16983638Y-11455981D01*
X16974114Y-11436933D01*
X16955067Y-11427409D01*
X16926495Y-11427409D01*
X16907448Y-11417886D01*
X16897924Y-11398838D01*
X16897924Y-11389314D01*
X16907448Y-11370267D01*
X16926495Y-11360743D01*
X16955067Y-11360743D01*
X16974114Y-11370267D01*
X17050305Y-11570267D02*
X17059829Y-11560743D01*
X17078876Y-11532171D01*
X17088400Y-11513124D01*
X17097924Y-11484552D01*
X17107448Y-11436933D01*
X17107448Y-11398838D01*
X17097924Y-11351219D01*
X17088400Y-11322648D01*
X17078876Y-11303600D01*
X17059829Y-11275028D01*
X17050305Y-11265505D01*
M02*
