(module Molex_PicoLock-20533804_04x2.00mm_Horizontal (layer F.Cu) (tedit 5E95F989)
  (descr "Molex PicoLock series connector, 2.00mm pitch, side entry SMT, P/N: 20533804")
  (tags "conn molex pico lock")
  (attr smd)
  (fp_text reference REF** (at 0 -5.7) (layer F.SilkS)
    (effects (font (size 1 1) (thickness 0.15)))
  )
  (fp_text value Molex_PicoLock-20533804_04x2.00mm_Horizontal (at 0 4.8) (layer F.Fab)
    (effects (font (size 1 1) (thickness 0.15)))
  )
  (fp_line (start -4.05 -3.3) (end -6.35 -3.3) (layer F.SilkS) (width 0.15))
  (fp_line (start -6.35 -3.3) (end -6.35 1.65) (layer F.SilkS) (width 0.15))
  (fp_line (start 4.05 -3.3) (end 6.35 -3.3) (layer F.SilkS) (width 0.15))
  (fp_line (start 6.35 -3.3) (end 6.35 1.65) (layer F.SilkS) (width 0.15))
  (fp_line (start -4.3 5.15) (end -3.35 5.15) (layer F.SilkS) (width 0.15))
  (fp_line (start -3.35 5.15) (end -3.35 2.65) (layer F.SilkS) (width 0.15))
  (fp_line (start -3.35 2.65) (end 3.35 2.65) (layer F.SilkS) (width 0.15))
  (fp_line (start 3.35 2.65) (end 3.35 5.15) (layer F.SilkS) (width 0.15))
  (fp_line (start 3.35 5.15) (end 4.3 5.15) (layer F.SilkS) (width 0.15))
  (fp_line (start -3 -4) (end -2.7 -4.6) (layer F.SilkS) (width 0.15))
  (fp_line (start -2.7 -4.6) (end -3.3 -4.6) (layer F.SilkS) (width 0.15))
  (fp_line (start -3.3 -4.6) (end -3 -4) (layer F.SilkS) (width 0.15))
  (fp_line (start -7.45 -4) (end -7.45 4.3) (layer F.CrtYd) (width 0.05))
  (fp_line (start -7.45 4.3) (end 7.45 4.3) (layer F.CrtYd) (width 0.05))
  (fp_line (start 7.45 4.3) (end 7.45 -4) (layer F.CrtYd) (width 0.05))
  (fp_line (start 7.45 -4) (end -7.45 -4) (layer F.CrtYd) (width 0.05))
  (pad 1 smd rect (at -3 -2.8) (size 1.1 1.45) (drill 0) (layers F.Cu F.Paste F.Mask))
  (pad 2 smd rect (at -1 -2.8) (size 1.1 1.45) (drill 0) (layers F.Cu F.Paste F.Mask))
  (pad 3 smd rect (at 1 -2.8) (size 1.1 1.45) (drill 0) (layers F.Cu F.Paste F.Mask))
  (pad 4 smd rect (at 3 -2.8) (size 1.1 1.45) (drill 0) (layers F.Cu F.Paste F.Mask))
  (pad "" smd rect (at 5.475 3.6) (size 1.35 2.9) (drill 0) (layers F.Cu F.Paste F.Mask))
  (pad "" smd rect (at -5.475 3.6) (size 1.35 2.9) (drill 0) (layers F.Cu F.Paste F.Mask))
)