module AD-25

go 1.18

require (
	github.com/aws/aws-lambda-go v1.34.1
	github.com/aws/aws-sdk-go-v2/config v1.17.1
	github.com/aws/aws-sdk-go-v2/feature/dynamodb/attributevalue v1.9.11
	github.com/aws/aws-sdk-go-v2/service/dynamodb v1.15.13
	github.com/sirupsen/logrus v1.9.0
)

require (
	github.com/aws/aws-sdk-go-v2 v1.16.11 // indirect
	github.com/aws/aws-sdk-go-v2/credentials v1.12.14 // indirect
	github.com/aws/aws-sdk-go-v2/feature/ec2/imds v1.12.12 // indirect
	github.com/aws/aws-sdk-go-v2/internal/configsources v1.1.18 // indirect
	github.com/aws/aws-sdk-go-v2/internal/endpoints/v2 v2.4.12 // indirect
	github.com/aws/aws-sdk-go-v2/internal/ini v1.3.19 // indirect
	github.com/aws/aws-sdk-go-v2/service/dynamodbstreams v1.13.14 // indirect
	github.com/aws/aws-sdk-go-v2/service/internal/accept-encoding v1.9.5 // indirect
	github.com/aws/aws-sdk-go-v2/service/internal/endpoint-discovery v1.7.12 // indirect
	github.com/aws/aws-sdk-go-v2/service/internal/presigned-url v1.9.12 // indirect
	github.com/aws/aws-sdk-go-v2/service/sso v1.11.17 // indirect
	github.com/aws/aws-sdk-go-v2/service/sts v1.16.13 // indirect
	github.com/aws/smithy-go v1.12.1 // indirect
	github.com/jmespath/go-jmespath v0.4.0 // indirect
	golang.org/x/sys v0.0.0-20220715151400-c0bba94af5f8 // indirect
)
