# Blender v2.78 (sub 0) OBJ File: ''
# www.blender.org
mtllib sphere.mtl
o Sphere
v -0.674848 0.631572 -0.482068
v -0.674848 0.574666 -0.669661
v -0.674848 -1.349213 -0.286978
v -0.624355 0.631572 -0.475421
v -0.575802 0.574666 -0.656622
v -0.531056 0.482256 -0.823618
v -0.491835 0.357894 -0.969991
v -0.459648 0.206357 -1.090116
v -0.435730 0.033470 -1.179377
v -0.421002 -0.154123 -1.234344
v -0.416029 -0.349213 -1.252904
v -0.421002 -0.544303 -1.234344
v -0.435730 -0.731896 -1.179377
v -0.459648 -0.904783 -1.090116
v -0.491835 -1.056320 -0.969991
v -0.531056 -1.180683 -0.823617
v -0.575802 -1.273093 -0.656622
v -0.624355 -1.329998 -0.475420
v -0.577303 0.631572 -0.455931
v -0.483506 0.574666 -0.618391
v -0.397063 0.482256 -0.768116
v -0.321294 0.357894 -0.899350
v -0.259113 0.206357 -1.007052
v -0.212908 0.033470 -1.087081
v -0.184455 -0.154123 -1.136363
v -0.174848 -0.349213 -1.153003
v -0.184455 -0.544303 -1.136363
v -0.212908 -0.731896 -1.087081
v -0.259113 -0.904783 -1.007052
v -0.321294 -1.056320 -0.899350
v -0.397063 -1.180683 -0.768116
v -0.483506 -1.273093 -0.618391
v -0.577303 -1.329998 -0.455931
v -0.536898 0.631572 -0.424927
v -0.404250 0.574666 -0.557576
v -0.282000 0.482256 -0.679825
v -0.174848 0.357894 -0.786978
v -0.086910 0.206357 -0.874916
v -0.021566 0.033470 -0.940259
v 0.018672 -0.154123 -0.980498
v 0.032259 -0.349213 -0.994085
v 0.018672 -0.544303 -0.980498
v -0.021566 -0.731896 -0.940259
v -0.086910 -0.904783 -0.874916
v -0.174848 -1.056320 -0.786978
v -0.282000 -1.180683 -0.679825
v -0.404250 -1.273093 -0.557576
v -0.536898 -1.329998 -0.424927
v -0.505894 0.631572 -0.384523
v -0.343434 0.574666 -0.478319
v -0.193710 0.482256 -0.564763
v -0.062475 0.357894 -0.640531
v 0.045226 0.206357 -0.702713
v 0.125255 0.033470 -0.748917
v 0.174537 -0.154123 -0.777370
v 0.191178 -0.349213 -0.786978
v 0.174537 -0.544303 -0.777370
v 0.125256 -0.731896 -0.748918
v 0.045226 -0.904783 -0.702713
v -0.062475 -1.056320 -0.640531
v -0.193710 -1.180683 -0.564763
v -0.343434 -1.273093 -0.478319
v -0.505895 -1.329998 -0.384523
v -0.486405 0.631572 -0.337471
v -0.305204 0.574666 -0.386023
v -0.138208 0.482256 -0.430770
v 0.008165 0.357894 -0.469990
v 0.128290 0.206357 -0.502178
v 0.217551 0.033470 -0.526095
v 0.272518 -0.154123 -0.540824
v 0.291078 -0.349213 -0.545797
v 0.272518 -0.544303 -0.540824
v 0.217551 -0.731896 -0.526095
v 0.128290 -0.904783 -0.502178
v 0.008165 -1.056320 -0.469990
v -0.138208 -1.180683 -0.430770
v -0.305204 -1.273093 -0.386023
v -0.486405 -1.329998 -0.337471
v -0.479757 0.631572 -0.286978
v -0.292164 0.574666 -0.286978
v -0.119277 0.482256 -0.286978
v 0.032259 0.357894 -0.286978
v 0.156622 0.206357 -0.286978
v 0.249032 0.033470 -0.286978
v 0.305938 -0.154123 -0.286978
v 0.325152 -0.349213 -0.286978
v 0.305938 -0.544303 -0.286978
v 0.249032 -0.731896 -0.286978
v 0.156622 -0.904783 -0.286978
v 0.032259 -1.056320 -0.286978
v -0.119277 -1.180683 -0.286978
v -0.292164 -1.273093 -0.286978
v -0.479757 -1.329998 -0.286978
v -0.486405 0.631572 -0.236484
v -0.305204 0.574666 -0.187932
v -0.138208 0.482256 -0.143185
v 0.008165 0.357894 -0.103965
v 0.128290 0.206357 -0.071777
v 0.217551 0.033470 -0.047860
v 0.272518 -0.154123 -0.033132
v 0.291078 -0.349213 -0.028158
v 0.272518 -0.544303 -0.033132
v 0.217551 -0.731896 -0.047860
v 0.128290 -0.904783 -0.071777
v 0.008165 -1.056320 -0.103965
v -0.138208 -1.180683 -0.143185
v -0.305204 -1.273093 -0.187932
v -0.486405 -1.329998 -0.236484
v -0.505894 0.631572 -0.189432
v -0.343434 0.574666 -0.095636
v -0.193710 0.482256 -0.009192
v -0.062475 0.357894 0.066576
v 0.045226 0.206357 0.128757
v 0.125255 0.033470 0.174962
v 0.174537 -0.154123 0.203415
v 0.191178 -0.349213 0.213022
v 0.174537 -0.544303 0.203415
v 0.125255 -0.731896 0.174962
v 0.045226 -0.904783 0.128757
v -0.062475 -1.056320 0.066576
v -0.193710 -1.180683 -0.009192
v -0.343434 -1.273093 -0.095636
v -0.505895 -1.329998 -0.189432
v -0.536898 0.631572 -0.149028
v -0.404250 0.574666 -0.016379
v -0.282000 0.482256 0.105870
v -0.174848 0.357894 0.213022
v -0.086910 0.206357 0.300960
v -0.021566 0.033470 0.366304
v 0.018672 -0.154123 0.406542
v 0.032259 -0.349213 0.420129
v 0.018672 -0.544303 0.406542
v -0.021566 -0.731896 0.366304
v -0.086910 -0.904783 0.300960
v -0.174848 -1.056320 0.213022
v -0.282000 -1.180683 0.105870
v -0.404250 -1.273093 -0.016379
v -0.536898 -1.329998 -0.149028
v -0.577303 0.631572 -0.118024
v -0.483506 0.574666 0.044436
v -0.397063 0.482256 0.194160
v -0.321294 0.357894 0.325395
v -0.259113 0.206357 0.433096
v -0.212908 0.033470 0.513125
v -0.184455 -0.154123 0.562407
v -0.174848 -0.349213 0.579048
v -0.184455 -0.544303 0.562407
v -0.212908 -0.731896 0.513126
v -0.259113 -0.904783 0.433096
v -0.321294 -1.056320 0.325395
v -0.397063 -1.180683 0.194160
v -0.483506 -1.273093 0.044436
v -0.577303 -1.329998 -0.118024
v -0.624355 0.631572 -0.098534
v -0.575802 0.574666 0.082667
v -0.531056 0.482256 0.249662
v -0.491835 0.357894 0.396035
v -0.459648 0.206357 0.516160
v -0.435730 0.033470 0.605421
v -0.421002 -0.154123 0.660388
v -0.416029 -0.349213 0.678948
v -0.421002 -0.544303 0.660388
v -0.435730 -0.731896 0.605422
v -0.459648 -0.904783 0.516160
v -0.491835 -1.056320 0.396035
v -0.531056 -1.180683 0.249662
v -0.575802 -1.273093 0.082666
v -0.624355 -1.329998 -0.098535
v -0.674848 0.631572 -0.091887
v -0.674848 0.574666 0.095706
v -0.674848 0.482256 0.268593
v -0.674848 0.357894 0.420129
v -0.674848 0.206357 0.544492
v -0.674848 0.033470 0.636902
v -0.674848 -0.154123 0.693808
v -0.674848 -0.349213 0.713022
v -0.674848 -0.544303 0.693808
v -0.674848 -0.731896 0.636902
v -0.674848 -0.904783 0.544492
v -0.674848 -1.056320 0.420129
v -0.674848 -1.180683 0.268593
v -0.674848 -1.273093 0.095706
v -0.674848 -1.329998 -0.091887
v -0.725341 0.631572 -0.098534
v -0.773894 0.574666 0.082667
v -0.818640 0.482256 0.249662
v -0.857861 0.357894 0.396035
v -0.890048 0.206357 0.516160
v -0.913965 0.033470 0.605421
v -0.928694 -0.154123 0.660388
v -0.933667 -0.349213 0.678948
v -0.928694 -0.544303 0.660388
v -0.913965 -0.731896 0.605422
v -0.890048 -0.904783 0.516160
v -0.857861 -1.056320 0.396035
v -0.818640 -1.180683 0.249662
v -0.773894 -1.273093 0.082666
v -0.725341 -1.329998 -0.098535
v -0.674848 0.650787 -0.286977
v -0.772393 0.631572 -0.118024
v -0.866190 0.574666 0.044436
v -0.952633 0.482256 0.194160
v -1.028401 0.357894 0.325395
v -1.090583 0.206357 0.433096
v -1.136787 0.033470 0.513126
v -1.165240 -0.154123 0.562407
v -1.174848 -0.349213 0.579048
v -1.165240 -0.544303 0.562407
v -1.136788 -0.731896 0.513126
v -1.090583 -0.904783 0.433096
v -1.028401 -1.056320 0.325395
v -0.952633 -1.180683 0.194160
v -0.866190 -1.273093 0.044436
v -0.772393 -1.329998 -0.118024
v -0.812798 0.631572 -0.149028
v -0.945446 0.574666 -0.016379
v -1.067695 0.482256 0.105870
v -1.174848 0.357894 0.213022
v -1.262786 0.206357 0.300960
v -1.328129 0.033470 0.366304
v -1.368368 -0.154123 0.406542
v -1.381955 -0.349213 0.420129
v -1.368368 -0.544303 0.406542
v -1.328129 -0.731896 0.366304
v -1.262786 -0.904783 0.300960
v -1.174848 -1.056320 0.213022
v -1.067695 -1.180683 0.105870
v -0.945446 -1.273093 -0.016380
v -0.812798 -1.329998 -0.149028
v -0.843801 0.631572 -0.189432
v -1.006262 0.574666 -0.095636
v -1.155986 0.482256 -0.009192
v -1.287220 0.357894 0.066576
v -1.394922 0.206357 0.128757
v -1.474951 0.033470 0.174962
v -1.524233 -0.154123 0.203415
v -1.540873 -0.349213 0.213022
v -1.524233 -0.544303 0.203415
v -1.474951 -0.731896 0.174962
v -1.394922 -0.904783 0.128757
v -1.287220 -1.056320 0.066576
v -1.155986 -1.180683 -0.009192
v -1.006261 -1.273093 -0.095636
v -0.843801 -1.329998 -0.189432
v -0.863291 0.631572 -0.236484
v -1.044492 0.574666 -0.187932
v -1.211488 0.482256 -0.143185
v -1.357861 0.357894 -0.103965
v -1.477986 0.206357 -0.071777
v -1.567247 0.033470 -0.047860
v -1.622214 -0.154123 -0.033132
v -1.640774 -0.349213 -0.028158
v -1.622213 -0.544303 -0.033132
v -1.567247 -0.731896 -0.047860
v -1.477986 -0.904783 -0.071777
v -1.357861 -1.056320 -0.103965
v -1.211488 -1.180683 -0.143185
v -1.044492 -1.273093 -0.187932
v -0.863291 -1.329998 -0.236484
v -0.869938 0.631572 -0.286978
v -1.057531 0.574666 -0.286978
v -1.230418 0.482256 -0.286978
v -1.381955 0.357894 -0.286978
v -1.506317 0.206357 -0.286978
v -1.598727 0.033470 -0.286977
v -1.655633 -0.154123 -0.286978
v -1.674848 -0.349213 -0.286978
v -1.655633 -0.544303 -0.286978
v -1.598727 -0.731896 -0.286978
v -1.506317 -0.904783 -0.286978
v -1.381955 -1.056320 -0.286978
v -1.230418 -1.180683 -0.286978
v -1.057531 -1.273093 -0.286978
v -0.869938 -1.329998 -0.286978
v -0.863291 0.631572 -0.337471
v -1.044492 0.574666 -0.386023
v -1.211488 0.482256 -0.430770
v -1.357861 0.357894 -0.469990
v -1.477986 0.206357 -0.502178
v -1.567247 0.033470 -0.526095
v -1.622213 -0.154123 -0.540824
v -1.640774 -0.349213 -0.545797
v -1.622213 -0.544303 -0.540824
v -1.567247 -0.731896 -0.526095
v -1.477986 -0.904783 -0.502178
v -1.357861 -1.056320 -0.469990
v -1.211488 -1.180683 -0.430770
v -1.044492 -1.273093 -0.386023
v -0.863291 -1.329998 -0.337471
v -0.843801 0.631572 -0.384523
v -1.006262 0.574666 -0.478319
v -1.155986 0.482256 -0.564763
v -1.287220 0.357894 -0.640531
v -1.394922 0.206357 -0.702712
v -1.474951 0.033470 -0.748917
v -1.524233 -0.154123 -0.777370
v -1.540873 -0.349213 -0.786978
v -1.524233 -0.544303 -0.777370
v -1.474951 -0.731896 -0.748917
v -1.394922 -0.904783 -0.702712
v -1.287220 -1.056320 -0.640531
v -1.155986 -1.180683 -0.564763
v -1.006261 -1.273093 -0.478319
v -0.843801 -1.329998 -0.384523
v -0.812798 0.631572 -0.424927
v -0.945446 0.574666 -0.557576
v -1.067695 0.482256 -0.679825
v -1.174848 0.357894 -0.786978
v -1.262786 0.206357 -0.874915
v -1.328129 0.033470 -0.940259
v -1.368367 -0.154123 -0.980497
v -1.381955 -0.349213 -0.994084
v -1.368367 -0.544303 -0.980497
v -1.328129 -0.731896 -0.940259
v -1.262786 -0.904783 -0.874915
v -1.174848 -1.056320 -0.786978
v -1.067695 -1.180683 -0.679825
v -0.945446 -1.273093 -0.557576
v -0.812798 -1.329998 -0.424927
v -0.772393 0.631572 -0.455931
v -0.866190 0.574666 -0.618391
v -0.952633 0.482256 -0.768115
v -1.028401 0.357894 -0.899350
v -1.090583 0.206357 -1.007051
v -1.136788 0.033470 -1.087081
v -1.165240 -0.154123 -1.136362
v -1.174848 -0.349213 -1.153003
v -1.165240 -0.544303 -1.136363
v -1.136788 -0.731896 -1.087081
v -1.090583 -0.904783 -1.007051
v -1.028401 -1.056320 -0.899350
v -0.952633 -1.180683 -0.768115
v -0.866189 -1.273093 -0.618391
v -0.772393 -1.329998 -0.455931
v -0.725341 0.631572 -0.475421
v -0.773894 0.574666 -0.656622
v -0.818640 0.482256 -0.823617
v -0.857861 0.357894 -0.969990
v -0.890048 0.206357 -1.090116
v -0.913966 0.033470 -1.179377
v -0.928694 -0.154123 -1.234343
v -0.933667 -0.349213 -1.252903
v -0.928694 -0.544303 -1.234343
v -0.913965 -0.731896 -1.179377
v -0.890048 -0.904783 -1.090116
v -0.857861 -1.056320 -0.969990
v -0.818640 -1.180683 -0.823617
v -0.773894 -1.273093 -0.656621
v -0.725341 -1.329998 -0.475420
v -0.674848 0.482256 -0.842548
v -0.674848 0.357894 -0.994084
v -0.674848 0.206357 -1.118447
v -0.674848 0.033470 -1.210857
v -0.674848 -0.154123 -1.267763
v -0.674848 -0.349213 -1.286977
v -0.674848 -0.544303 -1.267763
v -0.674848 -0.731896 -1.210857
v -0.674848 -0.904783 -1.118447
v -0.674848 -1.056320 -0.994084
v -0.674848 -1.180683 -0.842548
v -0.674848 -1.273093 -0.669661
v -0.674848 -1.329998 -0.482068
vt 0.0906 0.8041
vt 0.1142 0.7494
vt 0.1628 0.7678
vt 0.1578 0.8300
vt 0.6957 0.6621
vt 0.7100 0.7200
vt 0.6805 0.7312
vt 0.6778 0.6689
vt 0.0529 0.8535
vt 0.1477 0.8920
vt 0.6841 0.6033
vt 0.6757 0.6065
vt 0.9872 0.8901
vt 1.0529 0.8535
vt 1.1477 0.8920
vt 1.1128 0.9525
vt 0.1642 0.5154
vt 0.1739 0.4559
vt 0.1722 0.5183
vt 0.6739 0.5441
vt 0.8908 0.8987
vt 0.7939 0.9746
vt 0.1543 0.5747
vt 0.1704 0.5807
vt 0.8078 0.8736
vt 0.7059 0.9173
vt 0.1435 0.6338
vt 0.1684 0.6431
vt 0.7585 0.8289
vt 0.6907 0.8556
vt 0.1307 0.6922
vt 0.1660 0.7055
vt 0.7293 0.7762
vt 0.6843 0.7935
vt 0.6149 0.8443
vt 0.6365 0.7864
vt 0.2025 0.7001
vt 0.2139 0.7602
vt 0.6499 0.7266
vt 0.2310 0.8191
vt 0.6595 0.6661
vt 0.2618 0.8750
vt 0.6672 0.6052
vt 0.1128 0.9525
vt 0.3310 0.9211
vt 0.1803 0.5171
vt 0.4706 0.9327
vt 0.1868 0.5783
vt 0.5721 0.8974
vt 0.1939 0.6393
vt 0.6591 0.5996
vt 0.3815 0.8451
vt 0.4497 0.8520
vt 0.1879 0.5118
vt 0.2021 0.5676
vt 0.5141 0.8355
vt 0.2175 0.6228
vt 0.5629 0.8014
vt 0.2351 0.6769
vt 0.5976 0.7571
vt 0.2569 0.7287
vt 0.6229 0.7072
vt 0.2856 0.7767
vt 0.6426 0.6542
vt 0.3256 0.8175
vt 0.5714 0.7127
vt 0.6022 0.6759
vt 0.2880 0.6805
vt 0.3195 0.7166
vt 0.6288 0.6345
vt 0.3566 0.7455
vt 0.6523 0.5901
vt 0.3995 0.7643
vt 0.1946 0.5028
vt 0.4462 0.7704
vt 0.2155 0.5495
vt 0.4926 0.7627
vt 0.2372 0.5954
vt 0.5349 0.7426
vt 0.2610 0.6395
vt 0.2000 0.4906
vt 0.2259 0.5255
vt 0.4468 0.6887
vt 0.4844 0.6868
vt 0.2523 0.5597
vt 0.5211 0.6769
vt 0.2798 0.5923
vt 0.5560 0.6597
vt 0.3089 0.6221
vt 0.5885 0.6366
vt 0.3402 0.6479
vt 0.6187 0.6087
vt 0.3738 0.6684
vt 0.6470 0.5775
vt 0.4096 0.6824
vt 0.3223 0.5577
vt 0.3530 0.5748
vt 0.5810 0.5925
vt 0.6127 0.5791
vt 0.3845 0.5891
vt 0.6436 0.5627
vt 0.4167 0.6001
vt 0.2036 0.4761
vt 0.4495 0.6071
vt 0.2331 0.4971
vt 0.4826 0.6099
vt 0.2625 0.5182
vt 0.5158 0.6083
vt 0.2922 0.5386
vt 0.5487 0.6024
vt 0.4537 0.5258
vt 0.4849 0.5331
vt 0.2367 0.4661
vt 0.2678 0.4732
vt 0.5162 0.5391
vt 0.2989 0.4813
vt 0.5476 0.5436
vt 0.3299 0.4902
vt 0.5792 0.5464
vt 0.3608 0.4994
vt 0.6107 0.5475
vt 0.3917 0.5086
vt 0.6423 0.5467
vt 0.4227 0.5175
vt 0.2053 0.4602
vt 0.5824 0.5007
vt 0.6127 0.5159
vt 0.3647 0.4228
vt 0.3967 0.4275
vt 0.6432 0.5305
vt 0.4285 0.4350
vt 0.2049 0.4440
vt 0.4599 0.4450
vt 0.2364 0.4343
vt 0.4909 0.4571
vt 0.2682 0.4270
vt 0.5216 0.4707
vt 0.3002 0.4225
vt 0.5521 0.4854
vt 0.3325 0.4211
vt 0.2321 0.4035
vt 0.2632 0.3818
vt 0.5014 0.3828
vt 0.5324 0.4048
vt 0.2958 0.3643
vt 0.5620 0.4299
vt 0.3297 0.3521
vt 0.5905 0.4574
vt 0.3647 0.3459
vt 0.6184 0.4862
vt 0.4000 0.3460
vt 0.6460 0.5153
vt 0.4350 0.3526
vt 0.2025 0.4286
vt 0.4689 0.3651
vt 0.3597 0.2693
vt 0.4016 0.2643
vt 0.6275 0.4600
vt 0.6507 0.5021
vt 0.4434 0.2704
vt 0.1980 0.4149
vt 0.4828 0.2869
vt 0.2238 0.3759
vt 0.5183 0.3119
vt 0.2522 0.3401
vt 0.5498 0.3434
vt 0.2841 0.3091
vt 0.5779 0.3796
vt 0.3200 0.2848
vt 0.6035 0.4189
vt 0.5457 0.2474
vt 0.5762 0.2902
vt 0.2345 0.3049
vt 0.2629 0.2604
vt 0.6007 0.3375
vt 0.2990 0.2223
vt 0.6214 0.3876
vt 0.3453 0.1948
vt 0.6397 0.4392
vt 0.4004 0.1826
vt 0.6568 0.4916
vt 0.4570 0.1890
vt 0.1917 0.4040
vt 0.5064 0.2121
vt 0.2115 0.3533
vt 0.6543 0.4253
vt 0.6642 0.4846
vt 0.3908 0.1013
vt 0.4872 0.1099
vt 0.1841 0.3967
vt 0.5529 0.1465
vt 0.1957 0.3379
vt 0.5906 0.1959
vt 0.2100 0.2800
vt 0.6142 0.2506
vt 0.2293 0.2238
vt 0.6307 0.3078
vt 0.2585 0.1711
vt 0.6435 0.3662
vt 0.3078 0.1264
vt 0.6628 0.2322
vt 0.6660 0.2945
vt 0.1843 0.2065
vt 0.1907 0.1444
vt 0.6684 0.3569
vt 0.2059 0.0827
vt 0.6704 0.4193
vt 0.2939 0.0254
vt 0.6722 0.4817
vt 0.6128 0.0475
vt 0.1757 0.3935
vt 0.6477 0.1080
vt 0.1778 0.3311
vt 0.6578 0.1700
vt 0.1805 0.2688
vt 0.1672 0.3948
vt 0.6803 0.4829
vt 0.8310 0.0789
vt 0.7618 0.1250
vt 0.1595 0.3339
vt 0.7310 0.1809
vt 0.1499 0.2734
vt 0.7139 0.2398
vt 0.1365 0.2136
vt 0.7025 0.2999
vt 0.1149 0.1557
vt 0.6939 0.3607
vt 0.0721 0.1026
vt 0.6868 0.4217
vt 1.2939 0.0254
vt 1.2059 0.0827
vt 1.0721 0.1026
vt 0.9706 0.0673
vt 0.0976 0.2429
vt 0.0629 0.1986
vt 0.7351 0.3231
vt 0.7175 0.3772
vt 0.0141 0.1645
vt 0.7021 0.4324
vt 1.0141 0.1645
vt 0.9497 0.1480
vt 0.6879 0.4882
vt 0.8815 0.1549
vt 0.1591 0.4004
vt 0.8256 0.1825
vt 0.1426 0.3458
vt 0.7856 0.2233
vt 0.1229 0.2928
vt 0.7569 0.2713
vt 0.8995 0.2357
vt 0.8566 0.2545
vt 0.1523 0.4099
vt 0.1288 0.3655
vt 0.8195 0.2834
vt 0.1022 0.3241
vt 0.7880 0.3195
vt 0.0714 0.2873
vt 0.7610 0.3605
vt 0.0349 0.2574
vt 0.7372 0.4046
vt 1.0629 0.1986
vt 1.0349 0.2574
vt 0.9926 0.2373
vt 0.7155 0.4505
vt 0.9462 0.2296
vt 0.6946 0.4972
vt 0.7798 0.4077
vt 0.7523 0.4403
vt 1.0211 0.3231
vt 0.9844 0.3132
vt 0.7259 0.4745
vt 0.9468 0.3113
vt 0.7000 0.5094
vt 0.9096 0.3176
vt 0.1470 0.4225
vt 0.8738 0.3316
vt 0.1187 0.3913
vt 0.8402 0.3521
vt 0.0885 0.3634
vt 0.8089 0.3779
vt 0.0560 0.3403
vt 0.0211 0.3231
vt 0.1436 0.4373
vt 0.1127 0.4209
vt 0.8845 0.4109
vt 0.8530 0.4252
vt 0.0810 0.4075
vt 0.8223 0.4423
vt 0.0487 0.3976
vt 0.7922 0.4614
vt 0.0158 0.3917
vt 0.7625 0.4818
vt 1.0158 0.3917
vt 0.9826 0.3901
vt 0.7331 0.5029
vt 0.9495 0.3929
vt 0.7036 0.5239
vt 0.9167 0.3999
vt 1.0162 0.4609
vt 0.9849 0.4669
vt 0.7678 0.5268
vt 0.7367 0.5339
vt 0.9537 0.4742
vt 0.7053 0.5398
vt 0.9227 0.4825
vt 0.1423 0.4533
vt 0.8917 0.4914
vt 0.1107 0.4525
vt 0.8608 0.5006
vt 0.0792 0.4536
vt 0.8299 0.5098
vt 0.0476 0.4564
vt 0.7989 0.5187
vt 0.0162 0.4609
vt 0.8967 0.5725
vt 0.8647 0.5772
vt 0.1127 0.4841
vt 0.0824 0.4993
vt 0.8325 0.5789
vt 0.0521 0.5146
vt 0.8002 0.5775
vt 0.0216 0.5293
vt 0.7682 0.5730
vt 1.0216 0.5293
vt 0.9909 0.5429
vt 0.7364 0.5657
vt 0.9599 0.5550
vt 0.7049 0.5560
vt 0.9285 0.5650
vt 0.1432 0.4695
vt 0.7632 0.6182
vt 0.7321 0.5965
vt 1.0014 0.6172
vt 0.9689 0.6349
vt 0.7025 0.5714
vt 0.9350 0.6474
vt 0.1460 0.4847
vt 0.9000 0.6540
vt 0.1184 0.5138
vt 0.8647 0.6541
vt 0.0905 0.5426
vt 0.8297 0.6479
vt 0.0620 0.5701
vt 0.7958 0.6357
vt 0.0324 0.5952
vt 1.0324 0.5952
vt 0.8597 0.7307
vt 0.8200 0.7152
vt 0.1035 0.5811
vt 0.0779 0.6204
vt 0.7841 0.6909
vt 0.0498 0.6566
vt 0.7522 0.6599
vt 0.0014 0.6172
vt 0.0183 0.6881
vt 0.7238 0.6241
vt 1.0183 0.6881
vt 0.9828 0.7131
vt 0.6980 0.5851
vt 0.9434 0.7296
vt 0.1507 0.4979
vt 0.9016 0.7357
vt 0.1275 0.5400
vt 0.7115 0.6467
vt 0.6917 0.5960
vt 1.0064 0.7879
vt 0.9570 0.8110
vt 0.1568 0.5084
vt 0.9004 0.8174
vt 0.1397 0.5607
vt 0.8453 0.8052
vt 0.1214 0.6124
vt 0.7990 0.7777
vt 0.1007 0.6625
vt 0.7629 0.7396
vt 0.0762 0.7098
vt 0.7345 0.6951
vt 0.0457 0.7526
vt 1.0457 0.7526
vt 0.0064 0.7879
vn 0.1153 0.4683 -0.8760
vn 0.0619 -0.8802 -0.4705
vn 0.1250 0.2880 -0.9494
vn 0.0382 -0.9562 -0.2901
vn 0.1299 0.0972 -0.9868
vn 0.0129 0.9951 -0.0980
vn 0.0129 -0.9951 -0.0980
vn 0.1299 -0.0972 -0.9868
vn 0.0382 0.9562 -0.2901
vn 0.1250 -0.2880 -0.9494
vn 0.0619 0.8802 -0.4705
vn 0.1153 -0.4683 -0.8760
vn 0.0832 0.7703 -0.6322
vn 0.1012 -0.6311 -0.7690
vn 0.1012 0.6311 -0.7690
vn 0.0832 -0.7703 -0.6322
vn 0.2968 -0.6311 -0.7166
vn 0.2968 0.6311 -0.7166
vn 0.2440 -0.7703 -0.5891
vn 0.3381 0.4683 -0.8163
vn 0.1816 -0.8802 -0.4384
vn 0.3665 0.2880 -0.8847
vn 0.1120 -0.9562 -0.2703
vn 0.3809 0.0972 -0.9195
vn 0.0378 0.9951 -0.0913
vn 0.0378 -0.9951 -0.0913
vn 0.3809 -0.0972 -0.9195
vn 0.1120 0.9562 -0.2703
vn 0.3665 -0.2880 -0.8847
vn 0.1816 0.8802 -0.4384
vn 0.3381 -0.4683 -0.8163
vn 0.2440 0.7703 -0.5891
vn 0.0602 -0.9951 -0.0784
vn 0.6059 -0.0972 -0.7896
vn 0.1781 0.9562 -0.2321
vn 0.5830 -0.2880 -0.7597
vn 0.2889 0.8802 -0.3765
vn 0.5379 -0.4683 -0.7010
vn 0.3882 0.7703 -0.5059
vn 0.4722 -0.6311 -0.6154
vn 0.4722 0.6311 -0.6154
vn 0.3882 -0.7703 -0.5059
vn 0.5379 0.4683 -0.7010
vn 0.2889 -0.8802 -0.3765
vn 0.5830 0.2880 -0.7597
vn 0.1781 -0.9562 -0.2321
vn 0.6059 0.0972 -0.7896
vn 0.0602 0.9951 -0.0784
vn 0.5059 -0.7703 -0.3882
vn 0.7010 0.4683 -0.5379
vn 0.3765 -0.8802 -0.2889
vn 0.7597 0.2880 -0.5830
vn 0.2321 -0.9562 -0.1781
vn 0.7896 0.0972 -0.6059
vn 0.0784 0.9951 -0.0602
vn 0.0784 -0.9951 -0.0602
vn 0.7896 -0.0972 -0.6059
vn 0.2321 0.9562 -0.1781
vn 0.7597 -0.2880 -0.5830
vn 0.3765 0.8802 -0.2889
vn 0.7010 -0.4683 -0.5379
vn 0.5059 0.7703 -0.3882
vn 0.6154 -0.6311 -0.4722
vn 0.6154 0.6311 -0.4722
vn 0.2703 0.9562 -0.1120
vn 0.8847 -0.2880 -0.3665
vn 0.4384 0.8802 -0.1816
vn 0.8163 -0.4683 -0.3381
vn 0.5891 0.7703 -0.2440
vn 0.7166 -0.6311 -0.2968
vn 0.7166 0.6311 -0.2968
vn 0.5891 -0.7703 -0.2440
vn 0.8163 0.4683 -0.3381
vn 0.4384 -0.8802 -0.1816
vn 0.8847 0.2880 -0.3665
vn 0.2703 -0.9562 -0.1120
vn 0.9195 0.0972 -0.3809
vn 0.0913 0.9951 -0.0378
vn 0.0913 -0.9951 -0.0378
vn 0.9195 -0.0972 -0.3809
vn 0.8760 0.4683 -0.1153
vn 0.4705 -0.8802 -0.0619
vn 0.9494 0.2880 -0.1250
vn 0.2901 -0.9562 -0.0382
vn 0.9868 0.0972 -0.1299
vn 0.0980 0.9951 -0.0129
vn 0.0980 -0.9951 -0.0129
vn 0.9868 -0.0972 -0.1299
vn 0.2901 0.9562 -0.0382
vn 0.9494 -0.2880 -0.1250
vn 0.4705 0.8802 -0.0619
vn 0.8760 -0.4683 -0.1153
vn 0.6322 0.7703 -0.0832
vn 0.7690 -0.6311 -0.1012
vn 0.7690 0.6311 -0.1012
vn 0.6322 -0.7703 -0.0832
vn 0.9494 -0.2880 0.1250
vn 0.4705 0.8802 0.0619
vn 0.8760 -0.4683 0.1153
vn 0.6322 0.7703 0.0832
vn 0.7690 -0.6311 0.1012
vn 0.7690 0.6311 0.1012
vn 0.6322 -0.7703 0.0832
vn 0.8760 0.4683 0.1153
vn 0.4705 -0.8802 0.0619
vn 0.9494 0.2880 0.1250
vn 0.2901 -0.9562 0.0382
vn 0.9868 0.0972 0.1299
vn 0.0980 0.9951 0.0129
vn 0.0980 -0.9951 0.0129
vn 0.9868 -0.0972 0.1299
vn 0.2901 0.9562 0.0382
vn 0.4384 -0.8802 0.1816
vn 0.8847 0.2880 0.3665
vn 0.2703 -0.9562 0.1120
vn 0.9195 0.0972 0.3809
vn 0.0913 0.9951 0.0378
vn 0.0913 -0.9951 0.0378
vn 0.9195 -0.0972 0.3809
vn 0.2703 0.9562 0.1120
vn 0.8847 -0.2880 0.3665
vn 0.4384 0.8802 0.1816
vn 0.8163 -0.4683 0.3381
vn 0.5891 0.7703 0.2440
vn 0.7166 -0.6311 0.2968
vn 0.7166 0.6311 0.2968
vn 0.5891 -0.7703 0.2440
vn 0.8163 0.4683 0.3381
vn 0.3765 0.8802 0.2889
vn 0.7010 -0.4683 0.5379
vn 0.5059 0.7703 0.3882
vn 0.6154 -0.6311 0.4722
vn 0.6154 0.6311 0.4722
vn 0.5059 -0.7703 0.3882
vn 0.7010 0.4683 0.5379
vn 0.3765 -0.8802 0.2889
vn 0.7597 0.2880 0.5830
vn 0.2321 -0.9562 0.1781
vn 0.7896 0.0972 0.6059
vn 0.0784 0.9951 0.0602
vn 0.0784 -0.9951 0.0602
vn 0.7896 -0.0972 0.6059
vn 0.2321 0.9562 0.1781
vn 0.7597 -0.2880 0.5830
vn 0.5830 0.2880 0.7597
vn 0.1781 -0.9562 0.2321
vn 0.6059 0.0972 0.7896
vn 0.0602 0.9951 0.0784
vn 0.0602 -0.9951 0.0784
vn 0.6059 -0.0972 0.7896
vn 0.1781 0.9562 0.2321
vn 0.5830 -0.2880 0.7597
vn 0.2889 0.8802 0.3765
vn 0.5379 -0.4683 0.7010
vn 0.3882 0.7703 0.5059
vn 0.4722 -0.6311 0.6154
vn 0.4722 0.6311 0.6154
vn 0.3882 -0.7703 0.5059
vn 0.5379 0.4683 0.7010
vn 0.2889 -0.8802 0.3765
vn 0.3381 -0.4683 0.8163
vn 0.2440 0.7703 0.5891
vn 0.2968 -0.6311 0.7166
vn 0.2968 0.6311 0.7166
vn 0.2440 -0.7703 0.5891
vn 0.3381 0.4683 0.8163
vn 0.1816 -0.8802 0.4384
vn 0.3665 0.2880 0.8847
vn 0.1120 -0.9562 0.2703
vn 0.3809 0.0972 0.9195
vn 0.0378 0.9951 0.0913
vn 0.0378 -0.9951 0.0913
vn 0.3809 -0.0972 0.9195
vn 0.1120 0.9562 0.2703
vn 0.3665 -0.2880 0.8847
vn 0.1816 0.8802 0.4384
vn 0.0382 -0.9562 0.2901
vn 0.1299 0.0972 0.9868
vn 0.0129 0.9951 0.0980
vn 0.0129 -0.9951 0.0980
vn 0.1299 -0.0972 0.9868
vn 0.0382 0.9562 0.2901
vn 0.1250 -0.2880 0.9494
vn 0.0619 0.8802 0.4705
vn 0.1153 -0.4683 0.8760
vn 0.0832 0.7703 0.6322
vn 0.1012 -0.6311 0.7690
vn 0.1012 0.6311 0.7690
vn 0.0832 -0.7703 0.6322
vn 0.1153 0.4683 0.8760
vn 0.0619 -0.8802 0.4705
vn 0.1250 0.2880 0.9494
vn -0.1012 -0.6311 0.7690
vn -0.1012 0.6311 0.7690
vn -0.0832 -0.7703 0.6322
vn -0.1153 0.4683 0.8760
vn -0.0619 -0.8802 0.4705
vn -0.1250 0.2880 0.9494
vn -0.0382 -0.9562 0.2901
vn -0.1299 0.0972 0.9868
vn -0.0129 0.9951 0.0980
vn -0.0129 -0.9951 0.0980
vn -0.1299 -0.0972 0.9868
vn -0.0382 0.9562 0.2901
vn -0.1250 -0.2880 0.9494
vn -0.0619 0.8802 0.4705
vn -0.1153 -0.4683 0.8760
vn -0.0832 0.7703 0.6322
vn -0.0378 0.9951 0.0913
vn -0.0378 -0.9951 0.0913
vn -0.3809 -0.0972 0.9195
vn -0.1120 0.9562 0.2703
vn -0.3665 -0.2880 0.8847
vn -0.1816 0.8802 0.4384
vn -0.3381 -0.4683 0.8163
vn -0.2440 0.7703 0.5891
vn -0.2968 -0.6311 0.7166
vn -0.2968 0.6311 0.7166
vn -0.2440 -0.7703 0.5891
vn -0.3381 0.4683 0.8163
vn -0.1816 -0.8802 0.4384
vn -0.3665 0.2880 0.8847
vn -0.1120 -0.9562 0.2703
vn -0.3809 0.0972 0.9195
vn -0.4722 0.6311 0.6154
vn -0.3882 -0.7703 0.5059
vn -0.5379 0.4683 0.7010
vn -0.2889 -0.8802 0.3765
vn -0.5830 0.2880 0.7597
vn -0.1781 -0.9562 0.2321
vn -0.6059 0.0972 0.7896
vn -0.0602 0.9951 0.0784
vn -0.0602 -0.9951 0.0784
vn -0.6059 -0.0972 0.7896
vn -0.1781 0.9562 0.2321
vn -0.5830 -0.2880 0.7597
vn -0.2889 0.8802 0.3765
vn -0.5379 -0.4683 0.7010
vn -0.3882 0.7703 0.5059
vn -0.4722 -0.6311 0.6154
vn -0.7896 -0.0972 0.6059
vn -0.2321 0.9562 0.1781
vn -0.7597 -0.2880 0.5830
vn -0.3765 0.8802 0.2889
vn -0.7010 -0.4683 0.5379
vn -0.5059 0.7703 0.3882
vn -0.6154 -0.6311 0.4722
vn -0.6154 0.6311 0.4722
vn -0.5059 -0.7703 0.3882
vn -0.7010 0.4683 0.5379
vn -0.3765 -0.8802 0.2889
vn -0.7597 0.2880 0.5830
vn -0.2321 -0.9562 0.1781
vn -0.7896 0.0972 0.6059
vn -0.0784 0.9951 0.0602
vn -0.0784 -0.9951 0.0602
vn -0.5891 -0.7703 0.2440
vn -0.8163 0.4683 0.3381
vn -0.4384 -0.8802 0.1816
vn -0.8847 0.2880 0.3665
vn -0.2703 -0.9562 0.1120
vn -0.9195 0.0972 0.3809
vn -0.0913 0.9951 0.0378
vn -0.0913 -0.9951 0.0378
vn -0.9195 -0.0972 0.3809
vn -0.2703 0.9562 0.1120
vn -0.8847 -0.2880 0.3665
vn -0.4384 0.8802 0.1816
vn -0.8163 -0.4683 0.3381
vn -0.5891 0.7703 0.2440
vn -0.7166 -0.6311 0.2968
vn -0.7166 0.6311 0.2968
vn -0.2901 0.9562 0.0382
vn -0.9494 -0.2880 0.1250
vn -0.4705 0.8802 0.0619
vn -0.8760 -0.4683 0.1153
vn -0.6322 0.7703 0.0832
vn -0.7690 -0.6311 0.1012
vn -0.7690 0.6311 0.1012
vn -0.6322 -0.7703 0.0832
vn -0.8760 0.4683 0.1153
vn -0.4705 -0.8802 0.0619
vn -0.9494 0.2880 0.1250
vn -0.2901 -0.9562 0.0382
vn -0.9868 0.0972 0.1299
vn -0.0980 0.9951 0.0129
vn -0.0980 -0.9951 0.0129
vn -0.9868 -0.0972 0.1299
vn -0.8760 0.4683 -0.1153
vn -0.4705 -0.8802 -0.0619
vn -0.9494 0.2880 -0.1250
vn -0.2901 -0.9562 -0.0382
vn -0.9868 0.0972 -0.1299
vn -0.0980 0.9951 -0.0129
vn -0.0980 -0.9951 -0.0129
vn -0.9868 -0.0972 -0.1299
vn -0.2901 0.9562 -0.0382
vn -0.9494 -0.2880 -0.1250
vn -0.4705 0.8802 -0.0619
vn -0.8760 -0.4683 -0.1153
vn -0.6322 0.7703 -0.0832
vn -0.7690 -0.6311 -0.1012
vn -0.7690 0.6311 -0.1012
vn -0.6322 -0.7703 -0.0832
vn -0.8847 -0.2880 -0.3665
vn -0.4384 0.8802 -0.1816
vn -0.8163 -0.4683 -0.3381
vn -0.5891 0.7703 -0.2440
vn -0.7166 -0.6311 -0.2968
vn -0.7166 0.6311 -0.2968
vn -0.5891 -0.7703 -0.2440
vn -0.8163 0.4683 -0.3381
vn -0.4384 -0.8802 -0.1816
vn -0.8847 0.2880 -0.3665
vn -0.2703 -0.9562 -0.1120
vn -0.9195 0.0972 -0.3809
vn -0.0913 0.9951 -0.0378
vn -0.0913 -0.9951 -0.0378
vn -0.9195 -0.0972 -0.3809
vn -0.2703 0.9562 -0.1120
vn -0.3765 -0.8802 -0.2889
vn -0.7597 0.2880 -0.5830
vn -0.2321 -0.9562 -0.1781
vn -0.7896 0.0972 -0.6059
vn -0.0784 0.9951 -0.0602
vn -0.0784 -0.9951 -0.0602
vn -0.7896 -0.0972 -0.6059
vn -0.2321 0.9562 -0.1781
vn -0.7597 -0.2880 -0.5830
vn -0.3765 0.8802 -0.2889
vn -0.7010 -0.4683 -0.5379
vn -0.5059 0.7703 -0.3882
vn -0.6154 -0.6311 -0.4722
vn -0.6154 0.6311 -0.4722
vn -0.5059 -0.7703 -0.3882
vn -0.7010 0.4683 -0.5379
vn -0.5379 -0.4683 -0.7010
vn -0.3882 0.7703 -0.5059
vn -0.4722 -0.6311 -0.6154
vn -0.4722 0.6311 -0.6154
vn -0.3882 -0.7703 -0.5059
vn -0.5379 0.4683 -0.7010
vn -0.2889 -0.8802 -0.3765
vn -0.5830 0.2880 -0.7597
vn -0.1781 -0.9562 -0.2321
vn -0.6059 0.0972 -0.7896
vn -0.0602 0.9951 -0.0784
vn -0.0602 -0.9951 -0.0784
vn -0.6059 -0.0972 -0.7896
vn -0.1781 0.9562 -0.2321
vn -0.5830 -0.2880 -0.7597
vn -0.2889 0.8802 -0.3765
vn -0.1120 -0.9562 -0.2703
vn -0.3809 0.0972 -0.9195
vn -0.0378 0.9951 -0.0913
vn -0.0378 -0.9951 -0.0913
vn -0.3809 -0.0972 -0.9195
vn -0.1120 0.9562 -0.2703
vn -0.3665 -0.2880 -0.8847
vn -0.1816 0.8802 -0.4384
vn -0.3381 -0.4683 -0.8163
vn -0.2440 0.7703 -0.5891
vn -0.2968 -0.6311 -0.7166
vn -0.2968 0.6311 -0.7166
vn -0.2440 -0.7703 -0.5891
vn -0.3381 0.4683 -0.8163
vn -0.1816 -0.8802 -0.4384
vn -0.3665 0.2880 -0.8847
vn -0.0832 0.7703 -0.6322
vn -0.1012 -0.6311 -0.7690
vn -0.1012 0.6311 -0.7690
vn -0.0832 -0.7703 -0.6322
vn -0.1153 0.4683 -0.8760
vn -0.0619 -0.8802 -0.4705
vn -0.1250 0.2880 -0.9494
vn -0.0382 -0.9562 -0.2901
vn -0.1299 0.0972 -0.9868
vn -0.0129 0.9951 -0.0980
vn -0.0129 -0.9951 -0.0980
vn -0.1299 -0.0972 -0.9868
vn -0.0382 0.9562 -0.2901
vn -0.1250 -0.2880 -0.9494
vn -0.0619 0.8802 -0.4705
vn -0.1153 -0.4683 -0.8760
usemtl None
s off
f 353/1/1 352/2/1 8/3/1 9/4/1
f 361/5/2 360/6/2 16/7/2 17/8/2
f 354/9/3 353/1/3 9/4/3 10/10/3
f 362/11/4 361/5/4 17/8/4 18/12/4
f 355/13/5 354/14/5 10/15/5 11/16/5
f 1/17/6 199/18/6 4/19/6
f 3/20/7 362/11/7 18/12/7
f 356/21/8 355/13/8 11/16/8 12/22/8
f 2/23/9 1/17/9 4/19/9 5/24/9
f 357/25/10 356/21/10 12/22/10 13/26/10
f 350/27/11 2/23/11 5/24/11 6/28/11
f 358/29/12 357/25/12 13/26/12 14/30/12
f 351/31/13 350/27/13 6/28/13 7/32/13
f 359/33/14 358/29/14 14/30/14 15/34/14
f 352/2/15 351/31/15 7/32/15 8/3/15
f 360/6/16 359/33/16 15/34/16 16/7/16
f 15/34/17 14/30/17 29/35/17 30/36/17
f 8/3/18 7/32/18 22/37/18 23/38/18
f 16/7/19 15/34/19 30/36/19 31/39/19
f 9/4/20 8/3/20 23/38/20 24/40/20
f 17/8/21 16/7/21 31/39/21 32/41/21
f 10/10/22 9/4/22 24/40/22 25/42/22
f 18/12/23 17/8/23 32/41/23 33/43/23
f 11/44/24 10/10/24 25/42/24 26/45/24
f 4/19/25 199/18/25 19/46/25
f 3/20/26 18/12/26 33/43/26
f 12/22/27 11/16/27 26/45/27 27/47/27
f 5/24/28 4/19/28 19/46/28 20/48/28
f 13/26/29 12/22/29 27/47/29 28/49/29
f 6/28/30 5/24/30 20/48/30 21/50/30
f 14/30/31 13/26/31 28/49/31 29/35/31
f 7/32/32 6/28/32 21/50/32 22/37/32
f 3/20/33 33/43/33 48/51/33
f 27/47/34 26/45/34 41/52/34 42/53/34
f 20/48/35 19/46/35 34/54/35 35/55/35
f 28/49/36 27/47/36 42/53/36 43/56/36
f 21/50/37 20/48/37 35/55/37 36/57/37
f 29/35/38 28/49/38 43/56/38 44/58/38
f 22/37/39 21/50/39 36/57/39 37/59/39
f 30/36/40 29/35/40 44/58/40 45/60/40
f 23/38/41 22/37/41 37/59/41 38/61/41
f 31/39/42 30/36/42 45/60/42 46/62/42
f 24/40/43 23/38/43 38/61/43 39/63/43
f 32/41/44 31/39/44 46/62/44 47/64/44
f 25/42/45 24/40/45 39/63/45 40/65/45
f 33/43/46 32/41/46 47/64/46 48/51/46
f 26/45/47 25/42/47 40/65/47 41/52/47
f 19/46/48 199/18/48 34/54/48
f 46/62/49 45/60/49 60/66/49 61/67/49
f 39/63/50 38/61/50 53/68/50 54/69/50
f 47/64/51 46/62/51 61/67/51 62/70/51
f 40/65/52 39/63/52 54/69/52 55/71/52
f 48/51/53 47/64/53 62/70/53 63/72/53
f 41/52/54 40/65/54 55/71/54 56/73/54
f 34/54/55 199/18/55 49/74/55
f 3/20/56 48/51/56 63/72/56
f 42/53/57 41/52/57 56/73/57 57/75/57
f 35/55/58 34/54/58 49/74/58 50/76/58
f 43/56/59 42/53/59 57/75/59 58/77/59
f 36/57/60 35/55/60 50/76/60 51/78/60
f 44/58/61 43/56/61 58/77/61 59/79/61
f 37/59/62 36/57/62 51/78/62 52/80/62
f 45/60/63 44/58/63 59/79/63 60/66/63
f 38/61/64 37/59/64 52/80/64 53/68/64
f 50/76/65 49/74/65 64/81/65 65/82/65
f 58/77/66 57/75/66 72/83/66 73/84/66
f 51/78/67 50/76/67 65/82/67 66/85/67
f 59/79/68 58/77/68 73/84/68 74/86/68
f 52/80/69 51/78/69 66/85/69 67/87/69
f 60/66/70 59/79/70 74/86/70 75/88/70
f 53/68/71 52/80/71 67/87/71 68/89/71
f 61/67/72 60/66/72 75/88/72 76/90/72
f 54/69/73 53/68/73 68/89/73 69/91/73
f 62/70/74 61/67/74 76/90/74 77/92/74
f 55/71/75 54/69/75 69/91/75 70/93/75
f 63/72/76 62/70/76 77/92/76 78/94/76
f 56/73/77 55/71/77 70/93/77 71/95/77
f 49/74/78 199/18/78 64/81/78
f 3/20/79 63/72/79 78/94/79
f 57/75/80 56/73/80 71/95/80 72/83/80
f 69/91/81 68/89/81 83/96/81 84/97/81
f 77/92/82 76/90/82 91/98/82 92/99/82
f 70/93/83 69/91/83 84/97/83 85/100/83
f 78/94/84 77/92/84 92/99/84 93/101/84
f 71/95/85 70/93/85 85/100/85 86/102/85
f 64/81/86 199/18/86 79/103/86
f 3/20/87 78/94/87 93/101/87
f 72/83/88 71/95/88 86/102/88 87/104/88
f 65/82/89 64/81/89 79/103/89 80/105/89
f 73/84/90 72/83/90 87/104/90 88/106/90
f 66/85/91 65/82/91 80/105/91 81/107/91
f 74/86/92 73/84/92 88/106/92 89/108/92
f 67/87/93 66/85/93 81/107/93 82/109/93
f 75/88/94 74/86/94 89/108/94 90/110/94
f 68/89/95 67/87/95 82/109/95 83/96/95
f 76/90/96 75/88/96 90/110/96 91/98/96
f 88/106/97 87/104/97 102/111/97 103/112/97
f 81/107/98 80/105/98 95/113/98 96/114/98
f 89/108/99 88/106/99 103/112/99 104/115/99
f 82/109/100 81/107/100 96/114/100 97/116/100
f 90/110/101 89/108/101 104/115/101 105/117/101
f 83/96/102 82/109/102 97/116/102 98/118/102
f 91/98/103 90/110/103 105/117/103 106/119/103
f 84/97/104 83/96/104 98/118/104 99/120/104
f 92/99/105 91/98/105 106/119/105 107/121/105
f 85/100/106 84/97/106 99/120/106 100/122/106
f 93/101/107 92/99/107 107/121/107 108/123/107
f 86/102/108 85/100/108 100/122/108 101/124/108
f 79/103/109 199/18/109 94/125/109
f 3/20/110 93/101/110 108/123/110
f 87/104/111 86/102/111 101/124/111 102/111/111
f 80/105/112 79/103/112 94/125/112 95/113/112
f 107/121/113 106/119/113 121/126/113 122/127/113
f 100/122/114 99/120/114 114/128/114 115/129/114
f 108/123/115 107/121/115 122/127/115 123/130/115
f 101/124/116 100/122/116 115/129/116 116/131/116
f 94/125/117 199/18/117 109/132/117
f 3/20/118 108/123/118 123/130/118
f 102/111/119 101/124/119 116/131/119 117/133/119
f 95/113/120 94/125/120 109/132/120 110/134/120
f 103/112/121 102/111/121 117/133/121 118/135/121
f 96/114/122 95/113/122 110/134/122 111/136/122
f 104/115/123 103/112/123 118/135/123 119/137/123
f 97/116/124 96/114/124 111/136/124 112/138/124
f 105/117/125 104/115/125 119/137/125 120/139/125
f 98/118/126 97/116/126 112/138/126 113/140/126
f 106/119/127 105/117/127 120/139/127 121/126/127
f 99/120/128 98/118/128 113/140/128 114/128/128
f 111/136/129 110/134/129 125/141/129 126/142/129
f 119/137/130 118/135/130 133/143/130 134/144/130
f 112/138/131 111/136/131 126/142/131 127/145/131
f 120/139/132 119/137/132 134/144/132 135/146/132
f 113/140/133 112/138/133 127/145/133 128/147/133
f 121/126/134 120/139/134 135/146/134 136/148/134
f 114/128/135 113/140/135 128/147/135 129/149/135
f 122/127/136 121/126/136 136/148/136 137/150/136
f 115/129/137 114/128/137 129/149/137 130/151/137
f 123/130/138 122/127/138 137/150/138 138/152/138
f 116/131/139 115/129/139 130/151/139 131/153/139
f 109/132/140 199/18/140 124/154/140
f 3/20/141 123/130/141 138/152/141
f 117/133/142 116/131/142 131/153/142 132/155/142
f 110/134/143 109/132/143 124/154/143 125/141/143
f 118/135/144 117/133/144 132/155/144 133/143/144
f 130/151/145 129/149/145 144/156/145 145/157/145
f 138/152/146 137/150/146 152/158/146 153/159/146
f 131/153/147 130/151/147 145/157/147 146/160/147
f 124/154/148 199/18/148 139/161/148
f 3/20/149 138/152/149 153/159/149
f 132/155/150 131/153/150 146/160/150 147/162/150
f 125/141/151 124/154/151 139/161/151 140/163/151
f 133/143/152 132/155/152 147/162/152 148/164/152
f 126/142/153 125/141/153 140/163/153 141/165/153
f 134/144/154 133/143/154 148/164/154 149/166/154
f 127/145/155 126/142/155 141/165/155 142/167/155
f 135/146/156 134/144/156 149/166/156 150/168/156
f 128/147/157 127/145/157 142/167/157 143/169/157
f 136/148/158 135/146/158 150/168/158 151/170/158
f 129/149/159 128/147/159 143/169/159 144/156/159
f 137/150/160 136/148/160 151/170/160 152/158/160
f 149/166/161 148/164/161 163/171/161 164/172/161
f 142/167/162 141/165/162 156/173/162 157/174/162
f 150/168/163 149/166/163 164/172/163 165/175/163
f 143/169/164 142/167/164 157/174/164 158/176/164
f 151/170/165 150/168/165 165/175/165 166/177/165
f 144/156/166 143/169/166 158/176/166 159/178/166
f 152/158/167 151/170/167 166/177/167 167/179/167
f 145/157/168 144/156/168 159/178/168 160/180/168
f 153/159/169 152/158/169 167/179/169 168/181/169
f 146/160/170 145/157/170 160/180/170 161/182/170
f 139/161/171 199/18/171 154/183/171
f 3/20/172 153/159/172 168/181/172
f 147/162/173 146/160/173 161/182/173 162/184/173
f 140/163/174 139/161/174 154/183/174 155/185/174
f 148/164/175 147/162/175 162/184/175 163/171/175
f 141/165/176 140/163/176 155/185/176 156/173/176
f 168/181/177 167/179/177 182/186/177 183/187/177
f 161/182/178 160/180/178 175/188/178 176/189/178
f 154/183/179 199/18/179 169/190/179
f 3/20/180 168/181/180 183/187/180
f 162/184/181 161/182/181 176/189/181 177/191/181
f 155/185/182 154/183/182 169/190/182 170/192/182
f 163/171/183 162/184/183 177/191/183 178/193/183
f 156/173/184 155/185/184 170/192/184 171/194/184
f 164/172/185 163/171/185 178/193/185 179/195/185
f 157/174/186 156/173/186 171/194/186 172/196/186
f 165/175/187 164/172/187 179/195/187 180/197/187
f 158/176/188 157/174/188 172/196/188 173/198/188
f 166/177/189 165/175/189 180/197/189 181/199/189
f 159/178/190 158/176/190 173/198/190 174/200/190
f 167/179/191 166/177/191 181/199/191 182/186/191
f 160/180/192 159/178/192 174/200/192 175/188/192
f 180/197/193 179/195/193 194/201/193 195/202/193
f 173/198/194 172/196/194 187/203/194 188/204/194
f 181/199/195 180/197/195 195/202/195 196/205/195
f 174/200/196 173/198/196 188/204/196 189/206/196
f 182/186/197 181/199/197 196/205/197 197/207/197
f 175/188/198 174/200/198 189/206/198 190/208/198
f 183/187/199 182/186/199 197/207/199 198/209/199
f 176/189/200 175/188/200 190/208/200 191/210/200
f 169/190/201 199/18/201 184/211/201
f 3/20/202 183/187/202 198/209/202
f 177/191/203 176/189/203 191/210/203 192/212/203
f 170/192/204 169/190/204 184/211/204 185/213/204
f 178/193/205 177/191/205 192/212/205 193/214/205
f 171/194/206 170/192/206 185/213/206 186/215/206
f 179/195/207 178/193/207 193/214/207 194/201/207
f 172/196/208 171/194/208 186/215/208 187/203/208
f 184/211/209 199/18/209 200/216/209
f 3/20/210 198/209/210 214/217/210
f 192/212/211 191/210/211 207/218/211 208/219/211
f 185/213/212 184/211/212 200/216/212 201/220/212
f 193/214/213 192/212/213 208/219/213 209/221/213
f 186/215/214 185/213/214 201/220/214 202/222/214
f 194/201/215 193/214/215 209/221/215 210/223/215
f 187/203/216 186/215/216 202/222/216 203/224/216
f 195/202/217 194/201/217 210/223/217 211/225/217
f 188/204/218 187/203/218 203/224/218 204/226/218
f 196/205/219 195/202/219 211/225/219 212/227/219
f 189/206/220 188/204/220 204/226/220 205/228/220
f 197/207/221 196/205/221 212/227/221 213/229/221
f 190/230/222 189/231/222 205/232/222 206/233/222
f 198/209/223 197/207/223 213/229/223 214/217/223
f 191/210/224 190/230/224 206/233/224 207/218/224
f 204/226/225 203/224/225 218/234/225 219/235/225
f 212/227/226 211/225/226 226/236/226 227/237/226
f 205/228/227 204/226/227 219/235/227 220/238/227
f 213/229/228 212/227/228 227/237/228 228/239/228
f 206/233/229 205/232/229 220/240/229 221/241/229
f 214/217/230 213/229/230 228/239/230 229/242/230
f 207/218/231 206/233/231 221/241/231 222/243/231
f 200/216/232 199/18/232 215/244/232
f 3/20/233 214/217/233 229/242/233
f 208/219/234 207/218/234 222/243/234 223/245/234
f 201/220/235 200/216/235 215/244/235 216/246/235
f 209/221/236 208/219/236 223/245/236 224/247/236
f 202/222/237 201/220/237 216/246/237 217/248/237
f 210/223/238 209/221/238 224/247/238 225/249/238
f 203/224/239 202/222/239 217/248/239 218/234/239
f 211/225/240 210/223/240 225/249/240 226/236/240
f 223/245/241 222/243/241 237/250/241 238/251/241
f 216/246/242 215/244/242 230/252/242 231/253/242
f 224/247/243 223/245/243 238/251/243 239/254/243
f 217/248/244 216/246/244 231/253/244 232/255/244
f 225/249/245 224/247/245 239/254/245 240/256/245
f 218/234/246 217/248/246 232/255/246 233/257/246
f 226/236/247 225/249/247 240/256/247 241/258/247
f 219/235/248 218/234/248 233/257/248 234/259/248
f 227/237/249 226/236/249 241/258/249 242/260/249
f 220/240/250 219/261/250 234/262/250 235/263/250
f 228/239/251 227/237/251 242/260/251 243/264/251
f 221/241/252 220/240/252 235/263/252 236/265/252
f 229/242/253 228/239/253 243/264/253 244/266/253
f 222/243/254 221/241/254 236/265/254 237/250/254
f 215/244/255 199/18/255 230/252/255
f 3/20/256 229/242/256 244/266/256
f 242/260/257 241/258/257 256/267/257 257/268/257
f 235/263/258 234/262/258 249/269/258 250/270/258
f 243/264/259 242/260/259 257/268/259 258/271/259
f 236/265/260 235/263/260 250/270/260 251/272/260
f 244/266/261 243/264/261 258/271/261 259/273/261
f 237/250/262 236/265/262 251/272/262 252/274/262
f 230/252/263 199/18/263 245/275/263
f 3/20/264 244/266/264 259/273/264
f 238/251/265 237/250/265 252/274/265 253/276/265
f 231/253/266 230/252/266 245/275/266 246/277/266
f 239/254/267 238/251/267 253/276/267 254/278/267
f 232/255/268 231/253/268 246/277/268 247/279/268
f 240/256/269 239/254/269 254/278/269 255/280/269
f 233/257/270 232/255/270 247/279/270 248/281/270
f 241/258/271 240/256/271 255/280/271 256/267/271
f 234/259/272 233/257/272 248/281/272 249/282/272
f 246/277/273 245/275/273 260/283/273 261/284/273
f 254/278/274 253/276/274 268/285/274 269/286/274
f 247/279/275 246/277/275 261/284/275 262/287/275
f 255/280/276 254/278/276 269/286/276 270/288/276
f 248/281/277 247/279/277 262/287/277 263/289/277
f 256/267/278 255/280/278 270/288/278 271/290/278
f 249/282/279 248/281/279 263/289/279 264/291/279
f 257/268/280 256/267/280 271/290/280 272/292/280
f 250/270/281 249/269/281 264/293/281 265/294/281
f 258/271/282 257/268/282 272/292/282 273/295/282
f 251/272/283 250/270/283 265/294/283 266/296/283
f 259/273/284 258/271/284 273/295/284 274/297/284
f 252/274/285 251/272/285 266/296/285 267/298/285
f 245/275/286 199/18/286 260/283/286
f 3/20/287 259/273/287 274/297/287
f 253/276/288 252/274/288 267/298/288 268/285/288
f 265/294/289 264/293/289 279/299/289 280/300/289
f 273/295/290 272/292/290 287/301/290 288/302/290
f 266/296/291 265/294/291 280/300/291 281/303/291
f 274/297/292 273/295/292 288/302/292 289/304/292
f 267/298/293 266/296/293 281/303/293 282/305/293
f 260/283/294 199/18/294 275/306/294
f 3/20/295 274/297/295 289/304/295
f 268/285/296 267/298/296 282/305/296 283/307/296
f 261/284/297 260/283/297 275/306/297 276/308/297
f 269/286/298 268/285/298 283/307/298 284/309/298
f 262/287/299 261/284/299 276/308/299 277/310/299
f 270/288/300 269/286/300 284/309/300 285/311/300
f 263/289/301 262/287/301 277/310/301 278/312/301
f 271/290/302 270/288/302 285/311/302 286/313/302
f 264/291/303 263/289/303 278/312/303 279/314/303
f 272/292/304 271/290/304 286/313/304 287/301/304
f 284/309/305 283/307/305 298/315/305 299/316/305
f 277/310/306 276/308/306 291/317/306 292/318/306
f 285/311/307 284/309/307 299/316/307 300/319/307
f 278/312/308 277/310/308 292/318/308 293/320/308
f 286/313/309 285/311/309 300/319/309 301/321/309
f 279/314/310 278/312/310 293/320/310 294/322/310
f 287/301/311 286/313/311 301/321/311 302/323/311
f 280/300/312 279/299/312 294/324/312 295/325/312
f 288/302/313 287/301/313 302/323/313 303/326/313
f 281/303/314 280/300/314 295/325/314 296/327/314
f 289/304/315 288/302/315 303/326/315 304/328/315
f 282/305/316 281/303/316 296/327/316 297/329/316
f 275/306/317 199/18/317 290/330/317
f 3/20/318 289/304/318 304/328/318
f 283/307/319 282/305/319 297/329/319 298/315/319
f 276/308/320 275/306/320 290/330/320 291/317/320
f 303/326/321 302/323/321 317/331/321 318/332/321
f 296/327/322 295/325/322 310/333/322 311/334/322
f 304/328/323 303/326/323 318/332/323 319/335/323
f 297/329/324 296/327/324 311/334/324 312/336/324
f 290/330/325 199/18/325 305/337/325
f 3/20/326 304/328/326 319/335/326
f 298/315/327 297/329/327 312/336/327 313/338/327
f 291/317/328 290/330/328 305/337/328 306/339/328
f 299/316/329 298/315/329 313/338/329 314/340/329
f 292/318/330 291/317/330 306/339/330 307/341/330
f 300/319/331 299/316/331 314/340/331 315/342/331
f 293/320/332 292/318/332 307/341/332 308/343/332
f 301/321/333 300/319/333 315/342/333 316/344/333
f 294/322/334 293/320/334 308/343/334 309/345/334
f 302/323/335 301/321/335 316/344/335 317/331/335
f 295/325/336 294/324/336 309/346/336 310/333/336
f 315/342/337 314/340/337 329/347/337 330/348/337
f 308/343/338 307/341/338 322/349/338 323/350/338
f 316/344/339 315/342/339 330/348/339 331/351/339
f 309/345/340 308/343/340 323/350/340 324/352/340
f 317/331/341 316/344/341 331/351/341 332/353/341
f 310/354/342 309/345/342 324/352/342 325/355/342
f 318/332/343 317/331/343 332/353/343 333/356/343
f 311/334/344 310/333/344 325/357/344 326/358/344
f 319/335/345 318/332/345 333/356/345 334/359/345
f 312/336/346 311/334/346 326/358/346 327/360/346
f 305/337/347 199/18/347 320/361/347
f 3/20/348 319/335/348 334/359/348
f 313/338/349 312/336/349 327/360/349 328/362/349
f 306/339/350 305/337/350 320/361/350 321/363/350
f 314/340/351 313/338/351 328/362/351 329/347/351
f 307/341/352 306/339/352 321/363/352 322/349/352
f 334/359/353 333/356/353 348/364/353 349/365/353
f 327/360/354 326/358/354 341/366/354 342/367/354
f 320/361/355 199/18/355 335/368/355
f 3/20/356 334/359/356 349/365/356
f 328/362/357 327/360/357 342/367/357 343/369/357
f 321/363/358 320/361/358 335/368/358 336/370/358
f 329/347/359 328/362/359 343/369/359 344/371/359
f 322/349/360 321/363/360 336/370/360 337/372/360
f 330/348/361 329/347/361 344/371/361 345/373/361
f 323/350/362 322/349/362 337/372/362 338/374/362
f 331/351/363 330/348/363 345/373/363 346/375/363
f 324/352/364 323/350/364 338/374/364 339/376/364
f 332/353/365 331/351/365 346/375/365 347/377/365
f 325/355/366 324/352/366 339/376/366 340/378/366
f 333/356/367 332/353/367 347/377/367 348/364/367
f 326/358/368 325/357/368 340/379/368 341/366/368
f 338/374/369 337/372/369 350/27/369 351/31/369
f 346/375/370 345/373/370 358/29/370 359/33/370
f 339/376/371 338/374/371 351/31/371 352/2/371
f 347/377/372 346/375/372 359/33/372 360/6/372
f 340/378/373 339/376/373 352/2/373 353/1/373
f 348/364/374 347/377/374 360/6/374 361/5/374
f 341/380/375 340/378/375 353/1/375 354/9/375
f 349/365/376 348/364/376 361/5/376 362/11/376
f 342/367/377 341/366/377 354/14/377 355/13/377
f 335/368/378 199/18/378 1/17/378
f 3/20/379 349/365/379 362/11/379
f 343/369/380 342/367/380 355/13/380 356/21/380
f 336/370/381 335/368/381 1/17/381 2/23/381
f 344/371/382 343/369/382 356/21/382 357/25/382
f 337/372/383 336/370/383 2/23/383 350/27/383
f 345/373/384 344/371/384 357/25/384 358/29/384
