{
  "classifierPath" : "meta::pure::metamodel::type::Class",
  "content" : {
    "_type" : "class",
    "constraints" : [ {
      "functionDefinition" : {
        "_type" : "lambda",
        "body" : [ {
          "_type" : "func",
          "function" : "or",
          "parameters" : [ {
            "_type" : "func",
            "function" : "and",
            "parameters" : [ {
              "_type" : "func",
              "function" : "isNotEmpty",
              "parameters" : [ {
                "_type" : "property",
                "parameters" : [ {
                  "_type" : "var",
                  "name" : "this",
                  "sourceInformation" : {
                    "endColumn" : 19,
                    "endLine" : 5792,
                    "sourceId" : "",
                    "startColumn" : 15,
                    "startLine" : 5792
                  }
                } ],
                "property" : "adjustableDates",
                "sourceInformation" : {
                  "endColumn" : 35,
                  "endLine" : 5792,
                  "sourceId" : "",
                  "startColumn" : 21,
                  "startLine" : 5792
                }
              } ],
              "sourceInformation" : {
                "endColumn" : 47,
                "endLine" : 5792,
                "sourceId" : "",
                "startColumn" : 38,
                "startLine" : 5792
              }
            }, {
              "_type" : "func",
              "function" : "isEmpty",
              "parameters" : [ {
                "_type" : "property",
                "parameters" : [ {
                  "_type" : "var",
                  "name" : "this",
                  "sourceInformation" : {
                    "endColumn" : 58,
                    "endLine" : 5792,
                    "sourceId" : "",
                    "startColumn" : 54,
                    "startLine" : 5792
                  }
                } ],
                "property" : "relativeDates",
                "sourceInformation" : {
                  "endColumn" : 72,
                  "endLine" : 5792,
                  "sourceId" : "",
                  "startColumn" : 60,
                  "startLine" : 5792
                }
              } ],
              "sourceInformation" : {
                "endColumn" : 81,
                "endLine" : 5792,
                "sourceId" : "",
                "startColumn" : 75,
                "startLine" : 5792
              }
            } ],
            "sourceInformation" : {
              "endColumn" : 52,
              "endLine" : 5792,
              "sourceId" : "",
              "startColumn" : 51,
              "startLine" : 5792
            }
          }, {
            "_type" : "func",
            "function" : "and",
            "parameters" : [ {
              "_type" : "func",
              "function" : "isEmpty",
              "parameters" : [ {
                "_type" : "property",
                "parameters" : [ {
                  "_type" : "var",
                  "name" : "this",
                  "sourceInformation" : {
                    "endColumn" : 94,
                    "endLine" : 5792,
                    "sourceId" : "",
                    "startColumn" : 90,
                    "startLine" : 5792
                  }
                } ],
                "property" : "adjustableDates",
                "sourceInformation" : {
                  "endColumn" : 110,
                  "endLine" : 5792,
                  "sourceId" : "",
                  "startColumn" : 96,
                  "startLine" : 5792
                }
              } ],
              "sourceInformation" : {
                "endColumn" : 119,
                "endLine" : 5792,
                "sourceId" : "",
                "startColumn" : 113,
                "startLine" : 5792
              }
            }, {
              "_type" : "func",
              "function" : "isNotEmpty",
              "parameters" : [ {
                "_type" : "property",
                "parameters" : [ {
                  "_type" : "var",
                  "name" : "this",
                  "sourceInformation" : {
                    "endColumn" : 130,
                    "endLine" : 5792,
                    "sourceId" : "",
                    "startColumn" : 126,
                    "startLine" : 5792
                  }
                } ],
                "property" : "relativeDates",
                "sourceInformation" : {
                  "endColumn" : 144,
                  "endLine" : 5792,
                  "sourceId" : "",
                  "startColumn" : 132,
                  "startLine" : 5792
                }
              } ],
              "sourceInformation" : {
                "endColumn" : 156,
                "endLine" : 5792,
                "sourceId" : "",
                "startColumn" : 147,
                "startLine" : 5792
              }
            } ],
            "sourceInformation" : {
              "endColumn" : 124,
              "endLine" : 5792,
              "sourceId" : "",
              "startColumn" : 123,
              "startLine" : 5792
            }
          } ],
          "sourceInformation" : {
            "endColumn" : 87,
            "endLine" : 5792,
            "sourceId" : "",
            "startColumn" : 86,
            "startLine" : 5792
          }
        } ],
        "parameters" : [ ]
      },
      "name" : "c1_choice"
    } ],
    "name" : "AdjustableOrRelativeDates",
    "package" : "FpML::model",
    "properties" : [ {
      "multiplicity" : {
        "lowerBound" : 0,
        "upperBound" : 1
      },
      "name" : "adjustableDates",
      "taggedValues" : [ {
        "tag" : {
          "profile" : "meta::pure::profiles::doc",
          "value" : "doc"
        },
        "value" : "A series of dates that shall be subject to adjustment if they would otherwise fall on a day that is not a business day in the specified business centers, together with the convention for adjusting the date."
      } ],
      "type" : "FpML::model::AdjustableDates"
    }, {
      "multiplicity" : {
        "lowerBound" : 0,
        "upperBound" : 1
      },
      "name" : "relativeDates",
      "taggedValues" : [ {
        "tag" : {
          "profile" : "meta::pure::profiles::doc",
          "value" : "doc"
        },
        "value" : "A series of dates specified as some offset to another series of dates (the anchor dates)."
      } ],
      "type" : "FpML::model::RelativeDates"
    }, {
      "multiplicity" : {
        "lowerBound" : 0,
        "upperBound" : 1
      },
      "name" : "id",
      "type" : "String"
    } ],
    "taggedValues" : [ {
      "tag" : {
        "profile" : "meta::pure::profiles::doc",
        "value" : "doc"
      },
      "value" : "A type giving the choice between defining a series of dates as an explicit list of dates together with applicable adjustments or as relative to some other series of (anchor) dates."
    } ]
  }
}