{
  "classifierPath" : "meta::pure::metamodel::type::Class",
  "content" : {
    "_type" : "class",
    "constraints" : [ {
      "functionDefinition" : {
        "_type" : "lambda",
        "body" : [ {
          "_type" : "func",
          "function" : "or",
          "parameters" : [ {
            "_type" : "func",
            "function" : "and",
            "parameters" : [ {
              "_type" : "func",
              "function" : "isNotEmpty",
              "parameters" : [ {
                "_type" : "property",
                "parameters" : [ {
                  "_type" : "var",
                  "name" : "this",
                  "sourceInformation" : {
                    "endColumn" : 19,
                    "endLine" : 9356,
                    "sourceId" : "",
                    "startColumn" : 15,
                    "startLine" : 9356
                  }
                } ],
                "property" : "floatingRate",
                "sourceInformation" : {
                  "endColumn" : 32,
                  "endLine" : 9356,
                  "sourceId" : "",
                  "startColumn" : 21,
                  "startLine" : 9356
                }
              } ],
              "sourceInformation" : {
                "endColumn" : 44,
                "endLine" : 9356,
                "sourceId" : "",
                "startColumn" : 35,
                "startLine" : 9356
              }
            }, {
              "_type" : "func",
              "function" : "and",
              "parameters" : [ {
                "_type" : "func",
                "function" : "isEmpty",
                "parameters" : [ {
                  "_type" : "property",
                  "parameters" : [ {
                    "_type" : "var",
                    "name" : "this",
                    "sourceInformation" : {
                      "endColumn" : 56,
                      "endLine" : 9356,
                      "sourceId" : "",
                      "startColumn" : 52,
                      "startLine" : 9356
                    }
                  } ],
                  "property" : "stubRate",
                  "sourceInformation" : {
                    "endColumn" : 65,
                    "endLine" : 9356,
                    "sourceId" : "",
                    "startColumn" : 58,
                    "startLine" : 9356
                  }
                } ],
                "sourceInformation" : {
                  "endColumn" : 74,
                  "endLine" : 9356,
                  "sourceId" : "",
                  "startColumn" : 68,
                  "startLine" : 9356
                }
              }, {
                "_type" : "func",
                "function" : "isEmpty",
                "parameters" : [ {
                  "_type" : "property",
                  "parameters" : [ {
                    "_type" : "var",
                    "name" : "this",
                    "sourceInformation" : {
                      "endColumn" : 85,
                      "endLine" : 9356,
                      "sourceId" : "",
                      "startColumn" : 81,
                      "startLine" : 9356
                    }
                  } ],
                  "property" : "stubAmount",
                  "sourceInformation" : {
                    "endColumn" : 96,
                    "endLine" : 9356,
                    "sourceId" : "",
                    "startColumn" : 87,
                    "startLine" : 9356
                  }
                } ],
                "sourceInformation" : {
                  "endColumn" : 105,
                  "endLine" : 9356,
                  "sourceId" : "",
                  "startColumn" : 99,
                  "startLine" : 9356
                }
              } ],
              "sourceInformation" : {
                "endColumn" : 79,
                "endLine" : 9356,
                "sourceId" : "",
                "startColumn" : 78,
                "startLine" : 9356
              }
            } ],
            "sourceInformation" : {
              "endColumn" : 49,
              "endLine" : 9356,
              "sourceId" : "",
              "startColumn" : 48,
              "startLine" : 9356
            }
          }, {
            "_type" : "func",
            "function" : "or",
            "parameters" : [ {
              "_type" : "func",
              "function" : "and",
              "parameters" : [ {
                "_type" : "func",
                "function" : "isEmpty",
                "parameters" : [ {
                  "_type" : "property",
                  "parameters" : [ {
                    "_type" : "var",
                    "name" : "this",
                    "sourceInformation" : {
                      "endColumn" : 120,
                      "endLine" : 9356,
                      "sourceId" : "",
                      "startColumn" : 116,
                      "startLine" : 9356
                    }
                  } ],
                  "property" : "floatingRate",
                  "sourceInformation" : {
                    "endColumn" : 133,
                    "endLine" : 9356,
                    "sourceId" : "",
                    "startColumn" : 122,
                    "startLine" : 9356
                  }
                } ],
                "sourceInformation" : {
                  "endColumn" : 142,
                  "endLine" : 9356,
                  "sourceId" : "",
                  "startColumn" : 136,
                  "startLine" : 9356
                }
              }, {
                "_type" : "func",
                "function" : "and",
                "parameters" : [ {
                  "_type" : "func",
                  "function" : "isNotEmpty",
                  "parameters" : [ {
                    "_type" : "property",
                    "parameters" : [ {
                      "_type" : "var",
                      "name" : "this",
                      "sourceInformation" : {
                        "endColumn" : 154,
                        "endLine" : 9356,
                        "sourceId" : "",
                        "startColumn" : 150,
                        "startLine" : 9356
                      }
                    } ],
                    "property" : "stubRate",
                    "sourceInformation" : {
                      "endColumn" : 163,
                      "endLine" : 9356,
                      "sourceId" : "",
                      "startColumn" : 156,
                      "startLine" : 9356
                    }
                  } ],
                  "sourceInformation" : {
                    "endColumn" : 175,
                    "endLine" : 9356,
                    "sourceId" : "",
                    "startColumn" : 166,
                    "startLine" : 9356
                  }
                }, {
                  "_type" : "func",
                  "function" : "isEmpty",
                  "parameters" : [ {
                    "_type" : "property",
                    "parameters" : [ {
                      "_type" : "var",
                      "name" : "this",
                      "sourceInformation" : {
                        "endColumn" : 186,
                        "endLine" : 9356,
                        "sourceId" : "",
                        "startColumn" : 182,
                        "startLine" : 9356
                      }
                    } ],
                    "property" : "stubAmount",
                    "sourceInformation" : {
                      "endColumn" : 197,
                      "endLine" : 9356,
                      "sourceId" : "",
                      "startColumn" : 188,
                      "startLine" : 9356
                    }
                  } ],
                  "sourceInformation" : {
                    "endColumn" : 206,
                    "endLine" : 9356,
                    "sourceId" : "",
                    "startColumn" : 200,
                    "startLine" : 9356
                  }
                } ],
                "sourceInformation" : {
                  "endColumn" : 180,
                  "endLine" : 9356,
                  "sourceId" : "",
                  "startColumn" : 179,
                  "startLine" : 9356
                }
              } ],
              "sourceInformation" : {
                "endColumn" : 147,
                "endLine" : 9356,
                "sourceId" : "",
                "startColumn" : 146,
                "startLine" : 9356
              }
            }, {
              "_type" : "func",
              "function" : "and",
              "parameters" : [ {
                "_type" : "func",
                "function" : "isEmpty",
                "parameters" : [ {
                  "_type" : "property",
                  "parameters" : [ {
                    "_type" : "var",
                    "name" : "this",
                    "sourceInformation" : {
                      "endColumn" : 220,
                      "endLine" : 9356,
                      "sourceId" : "",
                      "startColumn" : 216,
                      "startLine" : 9356
                    }
                  } ],
                  "property" : "floatingRate",
                  "sourceInformation" : {
                    "endColumn" : 233,
                    "endLine" : 9356,
                    "sourceId" : "",
                    "startColumn" : 222,
                    "startLine" : 9356
                  }
                } ],
                "sourceInformation" : {
                  "endColumn" : 242,
                  "endLine" : 9356,
                  "sourceId" : "",
                  "startColumn" : 236,
                  "startLine" : 9356
                }
              }, {
                "_type" : "func",
                "function" : "and",
                "parameters" : [ {
                  "_type" : "func",
                  "function" : "isEmpty",
                  "parameters" : [ {
                    "_type" : "property",
                    "parameters" : [ {
                      "_type" : "var",
                      "name" : "this",
                      "sourceInformation" : {
                        "endColumn" : 254,
                        "endLine" : 9356,
                        "sourceId" : "",
                        "startColumn" : 250,
                        "startLine" : 9356
                      }
                    } ],
                    "property" : "stubRate",
                    "sourceInformation" : {
                      "endColumn" : 263,
                      "endLine" : 9356,
                      "sourceId" : "",
                      "startColumn" : 256,
                      "startLine" : 9356
                    }
                  } ],
                  "sourceInformation" : {
                    "endColumn" : 272,
                    "endLine" : 9356,
                    "sourceId" : "",
                    "startColumn" : 266,
                    "startLine" : 9356
                  }
                }, {
                  "_type" : "func",
                  "function" : "isNotEmpty",
                  "parameters" : [ {
                    "_type" : "property",
                    "parameters" : [ {
                      "_type" : "var",
                      "name" : "this",
                      "sourceInformation" : {
                        "endColumn" : 283,
                        "endLine" : 9356,
                        "sourceId" : "",
                        "startColumn" : 279,
                        "startLine" : 9356
                      }
                    } ],
                    "property" : "stubAmount",
                    "sourceInformation" : {
                      "endColumn" : 294,
                      "endLine" : 9356,
                      "sourceId" : "",
                      "startColumn" : 285,
                      "startLine" : 9356
                    }
                  } ],
                  "sourceInformation" : {
                    "endColumn" : 306,
                    "endLine" : 9356,
                    "sourceId" : "",
                    "startColumn" : 297,
                    "startLine" : 9356
                  }
                } ],
                "sourceInformation" : {
                  "endColumn" : 277,
                  "endLine" : 9356,
                  "sourceId" : "",
                  "startColumn" : 276,
                  "startLine" : 9356
                }
              } ],
              "sourceInformation" : {
                "endColumn" : 247,
                "endLine" : 9356,
                "sourceId" : "",
                "startColumn" : 246,
                "startLine" : 9356
              }
            } ],
            "sourceInformation" : {
              "endColumn" : 213,
              "endLine" : 9356,
              "sourceId" : "",
              "startColumn" : 212,
              "startLine" : 9356
            }
          } ],
          "sourceInformation" : {
            "endColumn" : 112,
            "endLine" : 9356,
            "sourceId" : "",
            "startColumn" : 111,
            "startLine" : 9356
          }
        } ],
        "parameters" : [ ]
      },
      "name" : "c1_choice"
    } ],
    "name" : "StubValue",
    "package" : "FpML::model",
    "properties" : [ {
      "multiplicity" : {
        "lowerBound" : 0,
        "upperBound" : 2
      },
      "name" : "floatingRate",
      "taggedValues" : [ {
        "tag" : {
          "profile" : "meta::pure::profiles::doc",
          "value" : "doc"
        },
        "value" : "The rates to be applied to the initial or final stub may be the linear interpolation of two different rates. While the majority of the time, the rate indices will be the same as that specified in the stream and only the tenor itself will be different, it is possible to specift two different rates. For example, a 2 month stub period may use the linear interpolation of a 1 month and 3 month rate. The different rates would be specified in this component. Note that a maximum of two rates can be specified. If a stub period uses the same floating rate index, including tenor, as the regular calculation periods then this should not be specified again within this component, i.e. the stub calculation period amount component may not need to be specified even if there is an initial or final stub period. If a stub period uses a different floating rate index compared to the regular calculation periods then this should be specified within this component. If specified here, they are likely to have id attributes, allowing them to be referenced from within the cashflows component."
      } ],
      "type" : "FpML::model::StubFloatingRate"
    }, {
      "multiplicity" : {
        "lowerBound" : 0,
        "upperBound" : 1
      },
      "name" : "stubRate",
      "taggedValues" : [ {
        "tag" : {
          "profile" : "meta::pure::profiles::doc",
          "value" : "doc"
        },
        "value" : "An actual rate to apply for the initial or final stub period may have been agreed between the principal parties (in a similar way to how an initial rate may have been agreed for the first regular period). If an actual stub rate has been agreed then it would be included in this component. It will be a per annum rate, expressed as a decimal. A stub rate of 5% would be represented as 0.05."
      } ],
      "type" : "Decimal"
    }, {
      "multiplicity" : {
        "lowerBound" : 0,
        "upperBound" : 1
      },
      "name" : "stubAmount",
      "taggedValues" : [ {
        "tag" : {
          "profile" : "meta::pure::profiles::doc",
          "value" : "doc"
        },
        "value" : "An actual amount to apply for the initial or final stub period may have been agreed between th two parties. If an actual stub amount has been agreed then it would be included in this component."
      } ],
      "type" : "FpML::model::Money"
    } ],
    "taggedValues" : [ {
      "tag" : {
        "profile" : "meta::pure::profiles::doc",
        "value" : "doc"
      },
      "value" : "A type defining how a stub calculation period amount is calculated. A single floating rate tenor different to that used for the regular part of the calculation periods schedule may be specified, or two floating rate tenors many be specified. If two floating rate tenors are specified then Linear Interpolation (in accordance with the 2000 ISDA Definitions, Section 8.3 Interpolation) is assumed to apply. Alternatively, an actual known stub rate or stub amount may be specified."
    } ]
  }
}