{
  "classifierPath" : "meta::pure::metamodel::type::Enumeration",
  "content" : {
    "_type" : "Enumeration",
    "name" : "DividendDateReferenceEnum",
    "package" : "FpML::model",
    "taggedValues" : [ {
      "tag" : {
        "profile" : "meta::pure::profiles::doc",
        "value" : "doc"
      },
      "value" : "The reference to a dividend date."
    } ],
    "values" : [ {
      "value" : "ExDate"
    }, {
      "value" : "DividendPaymentDate"
    }, {
      "value" : "DividendValuationDate"
    }, {
      "value" : "RecordDate"
    }, {
      "value" : "TerminationDate"
    }, {
      "value" : "EquityPaymentDate"
    }, {
      "value" : "FollowingPaymentDate"
    }, {
      "value" : "AdHocDate"
    }, {
      "value" : "CumulativeEquityPaid"
    }, {
      "value" : "CumulativeLiborPaid"
    }, {
      "value" : "CumulativeEquityExDiv"
    }, {
      "value" : "CumulativeLiborExDiv"
    }, {
      "value" : "SharePayment"
    }, {
      "value" : "CashSettlementPaymentDate"
    }, {
      "value" : "FloatingAmountPaymentDate"
    }, {
      "value" : "CashSettlePaymentDateExDiv"
    }, {
      "value" : "CashSettlePaymentDateIssuerPayment"
    }, {
      "value" : "ExDividendPaymentDate"
    } ]
  }
}