{
  "classifierPath" : "meta::pure::metamodel::type::Enumeration",
  "content" : {
    "_type" : "Enumeration",
    "name" : "TimeTypeEnum",
    "package" : "FpML::model",
    "taggedValues" : [ {
      "tag" : {
        "profile" : "meta::pure::profiles::doc",
        "value" : "doc"
      },
      "value" : "Defines points in the day when equity option exercise and valuation can occur."
    } ],
    "values" : [ {
      "value" : "Close"
    }, {
      "value" : "Open"
    }, {
      "value" : "OSP"
    }, {
      "value" : "SpecificTime"
    }, {
      "value" : "XETRA"
    }, {
      "value" : "DerivativesClose"
    }, {
      "value" : "AsSpecifiedInMasterConfirmation"
    } ]
  }
}