{
  "classifierPath" : "meta::pure::metamodel::type::Enumeration",
  "content" : {
    "_type" : "Enumeration",
    "name" : "FxRegionLowerBoundDirectionEnum",
    "package" : "FpML::model",
    "taggedValues" : [ {
      "tag" : {
        "profile" : "meta::pure::profiles::doc",
        "value" : "doc"
      },
      "value" : "The Lower Bound Direction. It only contains the AtOrAbove and Above values."
    } ],
    "values" : [ {
      "value" : "AtOrAbove"
    }, {
      "value" : "Above"
    } ]
  }
}