{
  "classifierPath" : "meta::pure::metamodel::type::Class",
  "content" : {
    "_type" : "class",
    "constraints" : [ {
      "functionDefinition" : {
        "_type" : "lambda",
        "body" : [ {
          "_type" : "func",
          "function" : "forAll",
          "parameters" : [ {
            "_type" : "property",
            "parameters" : [ {
              "_type" : "var",
              "name" : "this",
              "sourceInformation" : {
                "endColumn" : 18,
                "endLine" : 7354,
                "sourceId" : "",
                "startColumn" : 14,
                "startLine" : 7354
              }
            } ],
            "property" : "description",
            "sourceInformation" : {
              "endColumn" : 30,
              "endLine" : 7354,
              "sourceId" : "",
              "startColumn" : 20,
              "startLine" : 7354
            }
          }, {
            "_type" : "lambda",
            "body" : [ {
              "_type" : "func",
              "function" : "greaterThanEqual",
              "parameters" : [ {
                "_type" : "func",
                "function" : "length",
                "parameters" : [ {
                  "_type" : "var",
                  "name" : "x",
                  "sourceInformation" : {
                    "endColumn" : 54,
                    "endLine" : 7354,
                    "sourceId" : "",
                    "startColumn" : 53,
                    "startLine" : 7354
                  }
                } ],
                "sourceInformation" : {
                  "endColumn" : 62,
                  "endLine" : 7354,
                  "sourceId" : "",
                  "startColumn" : 57,
                  "startLine" : 7354
                }
              }, {
                "_type" : "integer",
                "multiplicity" : {
                  "lowerBound" : 1,
                  "upperBound" : 1
                },
                "sourceInformation" : {
                  "endColumn" : 69,
                  "endLine" : 7354,
                  "sourceId" : "",
                  "startColumn" : 69,
                  "startLine" : 7354
                },
                "values" : [ 1 ]
              } ],
              "sourceInformation" : {
                "endColumn" : 69,
                "endLine" : 7354,
                "sourceId" : "",
                "startColumn" : 66,
                "startLine" : 7354
              }
            } ],
            "parameters" : [ {
              "_type" : "var",
              "class" : "String",
              "multiplicity" : {
                "lowerBound" : 1,
                "upperBound" : 1
              },
              "name" : "x",
              "sourceInformation" : {
                "endColumn" : 48,
                "endLine" : 7354,
                "sourceId" : "",
                "startColumn" : 43,
                "startLine" : 7354
              }
            } ],
            "sourceInformation" : {
              "endColumn" : 69,
              "endLine" : 7354,
              "sourceId" : "",
              "startColumn" : 52,
              "startLine" : 7354
            }
          } ],
          "sourceInformation" : {
            "endColumn" : 38,
            "endLine" : 7354,
            "sourceId" : "",
            "startColumn" : 33,
            "startLine" : 7354
          }
        } ],
        "parameters" : [ ]
      },
      "name" : "c1_length"
    } ],
    "name" : "IdentifiedAsset",
    "package" : "FpML::model",
    "properties" : [ {
      "multiplicity" : {
        "lowerBound" : 0
      },
      "name" : "instrumentId",
      "taggedValues" : [ {
        "tag" : {
          "profile" : "meta::pure::profiles::doc",
          "value" : "doc"
        },
        "value" : "Identification of the underlying asset, using public and/or private identifiers."
      } ],
      "type" : "FpML::model::InstrumentId"
    }, {
      "multiplicity" : {
        "lowerBound" : 0
      },
      "name" : "instrumentType",
      "taggedValues" : [ {
        "tag" : {
          "profile" : "meta::pure::profiles::doc",
          "value" : "doc"
        },
        "value" : "Classification of the asset, using public and/or private typologies e.g. ISO 10962 CFI code."
      } ],
      "type" : "FpML::model::InstrumentType"
    }, {
      "multiplicity" : {
        "lowerBound" : 0,
        "upperBound" : 1
      },
      "name" : "description",
      "taggedValues" : [ {
        "tag" : {
          "profile" : "meta::pure::profiles::doc",
          "value" : "doc"
        },
        "value" : "Long name of the underlying asset."
      } ],
      "type" : "String"
    } ],
    "stereotypes" : [ {
      "profile" : "meta::pure::profiles::typemodifiers",
      "value" : "abstract"
    } ],
    "superTypes" : [ "FpML::model::Asset" ],
    "taggedValues" : [ {
      "tag" : {
        "profile" : "meta::pure::profiles::doc",
        "value" : "doc"
      },
      "value" : "A generic type describing an identified asset."
    } ]
  }
}