{
  "classifierPath" : "meta::pure::metamodel::type::Class",
  "content" : {
    "_type" : "class",
    "name" : "PaymentRule",
    "package" : "FpML::model",
    "stereotypes" : [ {
      "profile" : "meta::pure::profiles::typemodifiers",
      "value" : "abstract"
    } ],
    "taggedValues" : [ {
      "tag" : {
        "profile" : "meta::pure::profiles::doc",
        "value" : "doc"
      },
      "value" : "The abstract base type from which all calculation rules of the independent amount must be derived. Users are supposed to use type substitution at PaymentRule. PaymentRule is supposed to be substituted by PercentageRule. There is the expectation that other rules will be created to model other types of independent amount payment rules in the future."
    } ]
  }
}