{
  "classifierPath" : "meta::pure::metamodel::type::Enumeration",
  "content" : {
    "_type" : "Enumeration",
    "name" : "MetalTitleEnum",
    "package" : "FpML::model",
    "taggedValues" : [ {
      "tag" : {
        "profile" : "meta::pure::profiles::doc",
        "value" : "doc"
      },
      "value" : "Describes how and when title to the commodity transfers."
    } ],
    "values" : [ {
      "value" : "TransfersWithRiskOfLoss"
    }, {
      "value" : "DoesNotTransferWithRiskOfLoss"
    } ]
  }
}