{
  "classifierPath" : "meta::pure::metamodel::type::Enumeration",
  "content" : {
    "_type" : "Enumeration",
    "name" : "OrderStatusEnum",
    "package" : "FpML::model",
    "taggedValues" : [ {
      "tag" : {
        "profile" : "meta::pure::profiles::doc",
        "value" : "doc"
      },
      "value" : "Status of order."
    } ],
    "values" : [ {
      "value" : "Cancelled"
    }, {
      "value" : "Rejected"
    }, {
      "value" : "Accepted"
    }, {
      "value" : "Working"
    }, {
      "value" : "Filled"
    }, {
      "value" : "Completed"
    } ]
  }
}