{
  "classifierPath" : "meta::pure::metamodel::type::Enumeration",
  "content" : {
    "_type" : "Enumeration",
    "name" : "WeatherSettlementLevelEnum",
    "package" : "FpML::model",
    "values" : [ {
      "value" : "Cumulative"
    }, {
      "value" : "Average"
    }, {
      "value" : "Mximum"
    }, {
      "value" : "Minimum"
    } ]
  }
}