{
  "classifierPath" : "meta::pure::metamodel::type::Enumeration",
  "content" : {
    "_type" : "Enumeration",
    "name" : "FxOffsetConventionEnum",
    "package" : "FpML::model",
    "taggedValues" : [ {
      "tag" : {
        "profile" : "meta::pure::profiles::doc",
        "value" : "doc"
      },
      "value" : "Standard FX Spot and Forward offset conventions."
    } ],
    "values" : [ {
      "value" : "FxSpot"
    }, {
      "value" : "FxForward"
    } ]
  }
}