{
  "classifierPath" : "meta::pure::metamodel::type::Class",
  "content" : {
    "_type" : "class",
    "constraints" : [ {
      "functionDefinition" : {
        "_type" : "lambda",
        "body" : [ {
          "_type" : "func",
          "function" : "or",
          "parameters" : [ {
            "_type" : "func",
            "function" : "and",
            "parameters" : [ {
              "_type" : "func",
              "function" : "isNotEmpty",
              "parameters" : [ {
                "_type" : "property",
                "parameters" : [ {
                  "_type" : "var",
                  "name" : "this",
                  "sourceInformation" : {
                    "endColumn" : 19,
                    "endLine" : 6225,
                    "sourceId" : "",
                    "startColumn" : 15,
                    "startLine" : 6225
                  }
                } ],
                "property" : "lookback",
                "sourceInformation" : {
                  "endColumn" : 28,
                  "endLine" : 6225,
                  "sourceId" : "",
                  "startColumn" : 21,
                  "startLine" : 6225
                }
              } ],
              "sourceInformation" : {
                "endColumn" : 40,
                "endLine" : 6225,
                "sourceId" : "",
                "startColumn" : 31,
                "startLine" : 6225
              }
            }, {
              "_type" : "func",
              "function" : "and",
              "parameters" : [ {
                "_type" : "func",
                "function" : "isEmpty",
                "parameters" : [ {
                  "_type" : "property",
                  "parameters" : [ {
                    "_type" : "var",
                    "name" : "this",
                    "sourceInformation" : {
                      "endColumn" : 52,
                      "endLine" : 6225,
                      "sourceId" : "",
                      "startColumn" : 48,
                      "startLine" : 6225
                    }
                  } ],
                  "property" : "observationShift",
                  "sourceInformation" : {
                    "endColumn" : 69,
                    "endLine" : 6225,
                    "sourceId" : "",
                    "startColumn" : 54,
                    "startLine" : 6225
                  }
                } ],
                "sourceInformation" : {
                  "endColumn" : 78,
                  "endLine" : 6225,
                  "sourceId" : "",
                  "startColumn" : 72,
                  "startLine" : 6225
                }
              }, {
                "_type" : "func",
                "function" : "isEmpty",
                "parameters" : [ {
                  "_type" : "property",
                  "parameters" : [ {
                    "_type" : "var",
                    "name" : "this",
                    "sourceInformation" : {
                      "endColumn" : 89,
                      "endLine" : 6225,
                      "sourceId" : "",
                      "startColumn" : 85,
                      "startLine" : 6225
                    }
                  } ],
                  "property" : "lockout",
                  "sourceInformation" : {
                    "endColumn" : 97,
                    "endLine" : 6225,
                    "sourceId" : "",
                    "startColumn" : 91,
                    "startLine" : 6225
                  }
                } ],
                "sourceInformation" : {
                  "endColumn" : 106,
                  "endLine" : 6225,
                  "sourceId" : "",
                  "startColumn" : 100,
                  "startLine" : 6225
                }
              } ],
              "sourceInformation" : {
                "endColumn" : 83,
                "endLine" : 6225,
                "sourceId" : "",
                "startColumn" : 82,
                "startLine" : 6225
              }
            } ],
            "sourceInformation" : {
              "endColumn" : 45,
              "endLine" : 6225,
              "sourceId" : "",
              "startColumn" : 44,
              "startLine" : 6225
            }
          }, {
            "_type" : "func",
            "function" : "or",
            "parameters" : [ {
              "_type" : "func",
              "function" : "and",
              "parameters" : [ {
                "_type" : "func",
                "function" : "isEmpty",
                "parameters" : [ {
                  "_type" : "property",
                  "parameters" : [ {
                    "_type" : "var",
                    "name" : "this",
                    "sourceInformation" : {
                      "endColumn" : 121,
                      "endLine" : 6225,
                      "sourceId" : "",
                      "startColumn" : 117,
                      "startLine" : 6225
                    }
                  } ],
                  "property" : "lookback",
                  "sourceInformation" : {
                    "endColumn" : 130,
                    "endLine" : 6225,
                    "sourceId" : "",
                    "startColumn" : 123,
                    "startLine" : 6225
                  }
                } ],
                "sourceInformation" : {
                  "endColumn" : 139,
                  "endLine" : 6225,
                  "sourceId" : "",
                  "startColumn" : 133,
                  "startLine" : 6225
                }
              }, {
                "_type" : "func",
                "function" : "and",
                "parameters" : [ {
                  "_type" : "func",
                  "function" : "isNotEmpty",
                  "parameters" : [ {
                    "_type" : "property",
                    "parameters" : [ {
                      "_type" : "var",
                      "name" : "this",
                      "sourceInformation" : {
                        "endColumn" : 151,
                        "endLine" : 6225,
                        "sourceId" : "",
                        "startColumn" : 147,
                        "startLine" : 6225
                      }
                    } ],
                    "property" : "observationShift",
                    "sourceInformation" : {
                      "endColumn" : 168,
                      "endLine" : 6225,
                      "sourceId" : "",
                      "startColumn" : 153,
                      "startLine" : 6225
                    }
                  } ],
                  "sourceInformation" : {
                    "endColumn" : 180,
                    "endLine" : 6225,
                    "sourceId" : "",
                    "startColumn" : 171,
                    "startLine" : 6225
                  }
                }, {
                  "_type" : "func",
                  "function" : "isEmpty",
                  "parameters" : [ {
                    "_type" : "property",
                    "parameters" : [ {
                      "_type" : "var",
                      "name" : "this",
                      "sourceInformation" : {
                        "endColumn" : 191,
                        "endLine" : 6225,
                        "sourceId" : "",
                        "startColumn" : 187,
                        "startLine" : 6225
                      }
                    } ],
                    "property" : "lockout",
                    "sourceInformation" : {
                      "endColumn" : 199,
                      "endLine" : 6225,
                      "sourceId" : "",
                      "startColumn" : 193,
                      "startLine" : 6225
                    }
                  } ],
                  "sourceInformation" : {
                    "endColumn" : 208,
                    "endLine" : 6225,
                    "sourceId" : "",
                    "startColumn" : 202,
                    "startLine" : 6225
                  }
                } ],
                "sourceInformation" : {
                  "endColumn" : 185,
                  "endLine" : 6225,
                  "sourceId" : "",
                  "startColumn" : 184,
                  "startLine" : 6225
                }
              } ],
              "sourceInformation" : {
                "endColumn" : 144,
                "endLine" : 6225,
                "sourceId" : "",
                "startColumn" : 143,
                "startLine" : 6225
              }
            }, {
              "_type" : "func",
              "function" : "and",
              "parameters" : [ {
                "_type" : "func",
                "function" : "isEmpty",
                "parameters" : [ {
                  "_type" : "property",
                  "parameters" : [ {
                    "_type" : "var",
                    "name" : "this",
                    "sourceInformation" : {
                      "endColumn" : 222,
                      "endLine" : 6225,
                      "sourceId" : "",
                      "startColumn" : 218,
                      "startLine" : 6225
                    }
                  } ],
                  "property" : "lookback",
                  "sourceInformation" : {
                    "endColumn" : 231,
                    "endLine" : 6225,
                    "sourceId" : "",
                    "startColumn" : 224,
                    "startLine" : 6225
                  }
                } ],
                "sourceInformation" : {
                  "endColumn" : 240,
                  "endLine" : 6225,
                  "sourceId" : "",
                  "startColumn" : 234,
                  "startLine" : 6225
                }
              }, {
                "_type" : "func",
                "function" : "and",
                "parameters" : [ {
                  "_type" : "func",
                  "function" : "isEmpty",
                  "parameters" : [ {
                    "_type" : "property",
                    "parameters" : [ {
                      "_type" : "var",
                      "name" : "this",
                      "sourceInformation" : {
                        "endColumn" : 252,
                        "endLine" : 6225,
                        "sourceId" : "",
                        "startColumn" : 248,
                        "startLine" : 6225
                      }
                    } ],
                    "property" : "observationShift",
                    "sourceInformation" : {
                      "endColumn" : 269,
                      "endLine" : 6225,
                      "sourceId" : "",
                      "startColumn" : 254,
                      "startLine" : 6225
                    }
                  } ],
                  "sourceInformation" : {
                    "endColumn" : 278,
                    "endLine" : 6225,
                    "sourceId" : "",
                    "startColumn" : 272,
                    "startLine" : 6225
                  }
                }, {
                  "_type" : "func",
                  "function" : "isNotEmpty",
                  "parameters" : [ {
                    "_type" : "property",
                    "parameters" : [ {
                      "_type" : "var",
                      "name" : "this",
                      "sourceInformation" : {
                        "endColumn" : 289,
                        "endLine" : 6225,
                        "sourceId" : "",
                        "startColumn" : 285,
                        "startLine" : 6225
                      }
                    } ],
                    "property" : "lockout",
                    "sourceInformation" : {
                      "endColumn" : 297,
                      "endLine" : 6225,
                      "sourceId" : "",
                      "startColumn" : 291,
                      "startLine" : 6225
                    }
                  } ],
                  "sourceInformation" : {
                    "endColumn" : 309,
                    "endLine" : 6225,
                    "sourceId" : "",
                    "startColumn" : 300,
                    "startLine" : 6225
                  }
                } ],
                "sourceInformation" : {
                  "endColumn" : 283,
                  "endLine" : 6225,
                  "sourceId" : "",
                  "startColumn" : 282,
                  "startLine" : 6225
                }
              } ],
              "sourceInformation" : {
                "endColumn" : 245,
                "endLine" : 6225,
                "sourceId" : "",
                "startColumn" : 244,
                "startLine" : 6225
              }
            } ],
            "sourceInformation" : {
              "endColumn" : 215,
              "endLine" : 6225,
              "sourceId" : "",
              "startColumn" : 214,
              "startLine" : 6225
            }
          } ],
          "sourceInformation" : {
            "endColumn" : 113,
            "endLine" : 6225,
            "sourceId" : "",
            "startColumn" : 112,
            "startLine" : 6225
          }
        } ],
        "parameters" : [ ]
      },
      "name" : "c1_choice"
    } ],
    "name" : "CalculationParameters",
    "package" : "FpML::model",
    "properties" : [ {
      "multiplicity" : {
        "lowerBound" : 1,
        "upperBound" : 1
      },
      "name" : "calculationMethod",
      "taggedValues" : [ {
        "tag" : {
          "profile" : "meta::pure::profiles::doc",
          "value" : "doc"
        },
        "value" : "Specifies the type of calculation, e.g. whether the calculation is a compounding or an averaging calculation. This element distinguishes between the applicable subsections of Section 7 (7.3, 7.4, and 7.7). If the calculationMethod is Componding or Averaging, this implies that a daily compounded calculation will be done, i.e. that the underlying rate will be observed eacy applicalbe business day during the observation period and then compounded or averaged. If it is CompoundedIndex, this means that the rate administrator is doing the compounding each day and publishing the resulting index value. In this case the calculation agent is responsible for observing the index and the start and at the end of the observation period, and then backing out the implied rate by following the formula in section 7.7. (This formula divides the index value at the end by the index value at the beginning, subtracts 1, and then scales the resulting value based on the year fraction to annualize the rate.) In other words, for CompoundedIndex the observation frequency is effectively 1T, where for Compounding and Averaging, it is 1D."
      } ],
      "type" : "FpML::model::CalculationMethodEnum"
    }, {
      "multiplicity" : {
        "lowerBound" : 0,
        "upperBound" : 1
      },
      "name" : "applicableBusinessDays",
      "taggedValues" : [ {
        "tag" : {
          "profile" : "meta::pure::profiles::doc",
          "value" : "doc"
        },
        "value" : "Specifies the applicable business days to be used for this calculation. If omitted, the business days should be defaulted from the FRO Matrix, as represented in the FRO metadata. Failing that, it should be defaulted from the default business center for the relevant currency. See the ISDA 2021 Definitions Section 7.2.1."
      } ],
      "type" : "FpML::model::BusinessCentersOrReference"
    }, {
      "multiplicity" : {
        "lowerBound" : 0,
        "upperBound" : 1
      },
      "name" : "lookback",
      "taggedValues" : [ {
        "tag" : {
          "profile" : "meta::pure::profiles::doc",
          "value" : "doc"
        },
        "value" : "Specifies that lookback calculation is in effect, and supplies parameters needed to support that. See the ISDA 2021 Definitions Section 7.3.2 and 7.4.2. This should not be used when the calculationMethod is CompoundedIndex."
      } ],
      "type" : "FpML::model::ObservationOffset"
    }, {
      "multiplicity" : {
        "lowerBound" : 0,
        "upperBound" : 1
      },
      "name" : "observationShift",
      "taggedValues" : [ {
        "tag" : {
          "profile" : "meta::pure::profiles::doc",
          "value" : "doc"
        },
        "value" : "Specifies that observation shift calculation is in effect, and supplies parameters needed to support that. See the ISDA 2021 Definitions Section 7.3.3 and 7.4.3 and 7.7.3."
      } ],
      "type" : "FpML::model::ObservationShiftParameters"
    }, {
      "multiplicity" : {
        "lowerBound" : 0,
        "upperBound" : 1
      },
      "name" : "lockout",
      "taggedValues" : [ {
        "tag" : {
          "profile" : "meta::pure::profiles::doc",
          "value" : "doc"
        },
        "value" : "Specifies that lockout calculation is in effect, and supplies parameters needed to support that. See the ISDA 2021 Definitions Section 7.3.4 and 7.4.4. This should not be used when the calculationMethod is CompoundedIndex."
      } ],
      "type" : "FpML::model::ObservationOffset"
    }, {
      "multiplicity" : {
        "lowerBound" : 0,
        "upperBound" : 1
      },
      "name" : "observationCapRate",
      "taggedValues" : [ {
        "tag" : {
          "profile" : "meta::pure::profiles::doc",
          "value" : "doc"
        },
        "value" : "A maximum rate for an rate observation; optionally applied for daily averaged rates. These are described in the 2021 ISDA Definitions in Section 7.2.4"
      } ],
      "type" : "Decimal"
    }, {
      "multiplicity" : {
        "lowerBound" : 0,
        "upperBound" : 1
      },
      "name" : "observationFloorRate",
      "taggedValues" : [ {
        "tag" : {
          "profile" : "meta::pure::profiles::doc",
          "value" : "doc"
        },
        "value" : "A minimum rate for an rate observation; optionally applied for daily averaged rates. These are described in the 2021 ISDA Definitions in Section 7.2.3"
      } ],
      "type" : "Decimal"
    } ],
    "taggedValues" : [ {
      "tag" : {
        "profile" : "meta::pure::profiles::doc",
        "value" : "doc"
      },
      "value" : "A type defining a rate that is calculated based on a number of observations of an underlying rate that are averaged or compounded using a specified method. These are sometimes called modular calculated rates. These are described in the 2021 ISDA Definitions in Section 7."
    } ]
  }
}