{
  "classifierPath" : "meta::pure::metamodel::type::Enumeration",
  "content" : {
    "_type" : "Enumeration",
    "name" : "LoanCovenantObligationMetricValueTypeEnum",
    "package" : "FpML::model",
    "taggedValues" : [ {
      "tag" : {
        "profile" : "meta::pure::profiles::doc",
        "value" : "doc"
      },
      "value" : "A list of types that a loan covenant obligation metric can be (i.e. maximum amount, minimum amount, precise amount)."
    } ],
    "values" : [ {
      "value" : "Maximum"
    }, {
      "value" : "Minimum"
    }, {
      "value" : "Precise"
    } ]
  }
}