{
  "classifierPath" : "meta::pure::metamodel::type::Class",
  "content" : {
    "_type" : "class",
    "name" : "PendingPayment",
    "package" : "FpML::model",
    "properties" : [ {
      "multiplicity" : {
        "lowerBound" : 0,
        "upperBound" : 1
      },
      "name" : "paymentDate",
      "taggedValues" : [ {
        "tag" : {
          "profile" : "meta::pure::profiles::doc",
          "value" : "doc"
        },
        "value" : "The date that the dividend or coupon is due."
      } ],
      "type" : "StrictDate"
    }, {
      "multiplicity" : {
        "lowerBound" : 0,
        "upperBound" : 1
      },
      "name" : "amount",
      "taggedValues" : [ {
        "tag" : {
          "profile" : "meta::pure::profiles::doc",
          "value" : "doc"
        },
        "value" : "The amount of the dividend or coupon payment. Value of dividends or coupon between ex and pay date. Stock: if we are between ex-date and pay-date and the dividend is payable under the swap, then this should be the ex-div amount * # of securities. Bond: regardless of where we are vis-a-vis resets: (coupon % * face of bonds on swap * (bond day count fraction using days last coupon pay date of the bond through today)."
      } ],
      "type" : "FpML::model::Money"
    }, {
      "multiplicity" : {
        "lowerBound" : 0,
        "upperBound" : 1
      },
      "name" : "accruedInterest",
      "taggedValues" : [ {
        "tag" : {
          "profile" : "meta::pure::profiles::doc",
          "value" : "doc"
        },
        "value" : "Accrued interest on the dividend or coupon payment. When the TRS is structured to pay a dividend or coupon on reset after payable date, you may earn interest on these amounts. This field indicates the interest accrued on dividend/coupon from pay date to statement date. This will only apply to a handful of agreements where dividendss are held to the next reset AND you receive/pay interest on unpaid amounts."
      } ],
      "type" : "FpML::model::Money"
    } ],
    "superTypes" : [ "FpML::model::PaymentBase" ],
    "taggedValues" : [ {
      "tag" : {
        "profile" : "meta::pure::profiles::doc",
        "value" : "doc"
      },
      "value" : "A structure representing a pending dividend or coupon payment."
    } ]
  }
}