{
  "classifierPath" : "meta::pure::metamodel::type::Enumeration",
  "content" : {
    "_type" : "Enumeration",
    "name" : "EarlyTerminationDateEnum",
    "package" : "FpML::model",
    "taggedValues" : [ {
      "tag" : {
        "profile" : "meta::pure::profiles::doc",
        "value" : "doc"
      },
      "value" : "Symbolic specification of early termination date."
    } ],
    "values" : [ {
      "value" : "AnyDay"
    }, {
      "value" : "ValuationDate"
    }, {
      "value" : "ResetDate"
    }, {
      "value" : "AfterFirstResetDate"
    }, {
      "value" : "AsSpecifiedInMCA"
    } ]
  }
}