{
  "classifierPath" : "meta::pure::metamodel::type::Class",
  "content" : {
    "_type" : "class",
    "constraints" : [ {
      "functionDefinition" : {
        "_type" : "lambda",
        "body" : [ {
          "_type" : "func",
          "function" : "or",
          "parameters" : [ {
            "_type" : "func",
            "function" : "and",
            "parameters" : [ {
              "_type" : "func",
              "function" : "isNotEmpty",
              "parameters" : [ {
                "_type" : "property",
                "parameters" : [ {
                  "_type" : "var",
                  "name" : "this",
                  "sourceInformation" : {
                    "endColumn" : 19,
                    "endLine" : 6586,
                    "sourceId" : "",
                    "startColumn" : 15,
                    "startLine" : 6586
                  }
                } ],
                "property" : "spread",
                "sourceInformation" : {
                  "endColumn" : 26,
                  "endLine" : 6586,
                  "sourceId" : "",
                  "startColumn" : 21,
                  "startLine" : 6586
                }
              } ],
              "sourceInformation" : {
                "endColumn" : 38,
                "endLine" : 6586,
                "sourceId" : "",
                "startColumn" : 29,
                "startLine" : 6586
              }
            }, {
              "_type" : "func",
              "function" : "and",
              "parameters" : [ {
                "_type" : "func",
                "function" : "isEmpty",
                "parameters" : [ {
                  "_type" : "property",
                  "parameters" : [ {
                    "_type" : "var",
                    "name" : "this",
                    "sourceInformation" : {
                      "endColumn" : 50,
                      "endLine" : 6586,
                      "sourceId" : "",
                      "startColumn" : 46,
                      "startLine" : 6586
                    }
                  } ],
                  "property" : "price",
                  "sourceInformation" : {
                    "endColumn" : 56,
                    "endLine" : 6586,
                    "sourceId" : "",
                    "startColumn" : 52,
                    "startLine" : 6586
                  }
                } ],
                "sourceInformation" : {
                  "endColumn" : 65,
                  "endLine" : 6586,
                  "sourceId" : "",
                  "startColumn" : 59,
                  "startLine" : 6586
                }
              }, {
                "_type" : "func",
                "function" : "isEmpty",
                "parameters" : [ {
                  "_type" : "property",
                  "parameters" : [ {
                    "_type" : "var",
                    "name" : "this",
                    "sourceInformation" : {
                      "endColumn" : 76,
                      "endLine" : 6586,
                      "sourceId" : "",
                      "startColumn" : 72,
                      "startLine" : 6586
                    }
                  } ],
                  "property" : "strikeReference",
                  "sourceInformation" : {
                    "endColumn" : 92,
                    "endLine" : 6586,
                    "sourceId" : "",
                    "startColumn" : 78,
                    "startLine" : 6586
                  }
                } ],
                "sourceInformation" : {
                  "endColumn" : 101,
                  "endLine" : 6586,
                  "sourceId" : "",
                  "startColumn" : 95,
                  "startLine" : 6586
                }
              } ],
              "sourceInformation" : {
                "endColumn" : 70,
                "endLine" : 6586,
                "sourceId" : "",
                "startColumn" : 69,
                "startLine" : 6586
              }
            } ],
            "sourceInformation" : {
              "endColumn" : 43,
              "endLine" : 6586,
              "sourceId" : "",
              "startColumn" : 42,
              "startLine" : 6586
            }
          }, {
            "_type" : "func",
            "function" : "or",
            "parameters" : [ {
              "_type" : "func",
              "function" : "and",
              "parameters" : [ {
                "_type" : "func",
                "function" : "isEmpty",
                "parameters" : [ {
                  "_type" : "property",
                  "parameters" : [ {
                    "_type" : "var",
                    "name" : "this",
                    "sourceInformation" : {
                      "endColumn" : 116,
                      "endLine" : 6586,
                      "sourceId" : "",
                      "startColumn" : 112,
                      "startLine" : 6586
                    }
                  } ],
                  "property" : "spread",
                  "sourceInformation" : {
                    "endColumn" : 123,
                    "endLine" : 6586,
                    "sourceId" : "",
                    "startColumn" : 118,
                    "startLine" : 6586
                  }
                } ],
                "sourceInformation" : {
                  "endColumn" : 132,
                  "endLine" : 6586,
                  "sourceId" : "",
                  "startColumn" : 126,
                  "startLine" : 6586
                }
              }, {
                "_type" : "func",
                "function" : "and",
                "parameters" : [ {
                  "_type" : "func",
                  "function" : "isNotEmpty",
                  "parameters" : [ {
                    "_type" : "property",
                    "parameters" : [ {
                      "_type" : "var",
                      "name" : "this",
                      "sourceInformation" : {
                        "endColumn" : 144,
                        "endLine" : 6586,
                        "sourceId" : "",
                        "startColumn" : 140,
                        "startLine" : 6586
                      }
                    } ],
                    "property" : "price",
                    "sourceInformation" : {
                      "endColumn" : 150,
                      "endLine" : 6586,
                      "sourceId" : "",
                      "startColumn" : 146,
                      "startLine" : 6586
                    }
                  } ],
                  "sourceInformation" : {
                    "endColumn" : 162,
                    "endLine" : 6586,
                    "sourceId" : "",
                    "startColumn" : 153,
                    "startLine" : 6586
                  }
                }, {
                  "_type" : "func",
                  "function" : "isEmpty",
                  "parameters" : [ {
                    "_type" : "property",
                    "parameters" : [ {
                      "_type" : "var",
                      "name" : "this",
                      "sourceInformation" : {
                        "endColumn" : 173,
                        "endLine" : 6586,
                        "sourceId" : "",
                        "startColumn" : 169,
                        "startLine" : 6586
                      }
                    } ],
                    "property" : "strikeReference",
                    "sourceInformation" : {
                      "endColumn" : 189,
                      "endLine" : 6586,
                      "sourceId" : "",
                      "startColumn" : 175,
                      "startLine" : 6586
                    }
                  } ],
                  "sourceInformation" : {
                    "endColumn" : 198,
                    "endLine" : 6586,
                    "sourceId" : "",
                    "startColumn" : 192,
                    "startLine" : 6586
                  }
                } ],
                "sourceInformation" : {
                  "endColumn" : 167,
                  "endLine" : 6586,
                  "sourceId" : "",
                  "startColumn" : 166,
                  "startLine" : 6586
                }
              } ],
              "sourceInformation" : {
                "endColumn" : 137,
                "endLine" : 6586,
                "sourceId" : "",
                "startColumn" : 136,
                "startLine" : 6586
              }
            }, {
              "_type" : "func",
              "function" : "and",
              "parameters" : [ {
                "_type" : "func",
                "function" : "isEmpty",
                "parameters" : [ {
                  "_type" : "property",
                  "parameters" : [ {
                    "_type" : "var",
                    "name" : "this",
                    "sourceInformation" : {
                      "endColumn" : 212,
                      "endLine" : 6586,
                      "sourceId" : "",
                      "startColumn" : 208,
                      "startLine" : 6586
                    }
                  } ],
                  "property" : "spread",
                  "sourceInformation" : {
                    "endColumn" : 219,
                    "endLine" : 6586,
                    "sourceId" : "",
                    "startColumn" : 214,
                    "startLine" : 6586
                  }
                } ],
                "sourceInformation" : {
                  "endColumn" : 228,
                  "endLine" : 6586,
                  "sourceId" : "",
                  "startColumn" : 222,
                  "startLine" : 6586
                }
              }, {
                "_type" : "func",
                "function" : "and",
                "parameters" : [ {
                  "_type" : "func",
                  "function" : "isEmpty",
                  "parameters" : [ {
                    "_type" : "property",
                    "parameters" : [ {
                      "_type" : "var",
                      "name" : "this",
                      "sourceInformation" : {
                        "endColumn" : 240,
                        "endLine" : 6586,
                        "sourceId" : "",
                        "startColumn" : 236,
                        "startLine" : 6586
                      }
                    } ],
                    "property" : "price",
                    "sourceInformation" : {
                      "endColumn" : 246,
                      "endLine" : 6586,
                      "sourceId" : "",
                      "startColumn" : 242,
                      "startLine" : 6586
                    }
                  } ],
                  "sourceInformation" : {
                    "endColumn" : 255,
                    "endLine" : 6586,
                    "sourceId" : "",
                    "startColumn" : 249,
                    "startLine" : 6586
                  }
                }, {
                  "_type" : "func",
                  "function" : "isNotEmpty",
                  "parameters" : [ {
                    "_type" : "property",
                    "parameters" : [ {
                      "_type" : "var",
                      "name" : "this",
                      "sourceInformation" : {
                        "endColumn" : 266,
                        "endLine" : 6586,
                        "sourceId" : "",
                        "startColumn" : 262,
                        "startLine" : 6586
                      }
                    } ],
                    "property" : "strikeReference",
                    "sourceInformation" : {
                      "endColumn" : 282,
                      "endLine" : 6586,
                      "sourceId" : "",
                      "startColumn" : 268,
                      "startLine" : 6586
                    }
                  } ],
                  "sourceInformation" : {
                    "endColumn" : 294,
                    "endLine" : 6586,
                    "sourceId" : "",
                    "startColumn" : 285,
                    "startLine" : 6586
                  }
                } ],
                "sourceInformation" : {
                  "endColumn" : 260,
                  "endLine" : 6586,
                  "sourceId" : "",
                  "startColumn" : 259,
                  "startLine" : 6586
                }
              } ],
              "sourceInformation" : {
                "endColumn" : 233,
                "endLine" : 6586,
                "sourceId" : "",
                "startColumn" : 232,
                "startLine" : 6586
              }
            } ],
            "sourceInformation" : {
              "endColumn" : 205,
              "endLine" : 6586,
              "sourceId" : "",
              "startColumn" : 204,
              "startLine" : 6586
            }
          } ],
          "sourceInformation" : {
            "endColumn" : 108,
            "endLine" : 6586,
            "sourceId" : "",
            "startColumn" : 107,
            "startLine" : 6586
          }
        } ],
        "parameters" : [ ]
      },
      "name" : "c1_choice"
    } ],
    "name" : "CreditOptionStrike",
    "package" : "FpML::model",
    "properties" : [ {
      "multiplicity" : {
        "lowerBound" : 0,
        "upperBound" : 1
      },
      "name" : "spread",
      "taggedValues" : [ {
        "tag" : {
          "profile" : "meta::pure::profiles::doc",
          "value" : "doc"
        },
        "value" : "The strike of a credit default swap option or credit swaption when expressed as a spread per annum."
      } ],
      "type" : "Decimal"
    }, {
      "multiplicity" : {
        "lowerBound" : 0,
        "upperBound" : 1
      },
      "name" : "price",
      "taggedValues" : [ {
        "tag" : {
          "profile" : "meta::pure::profiles::doc",
          "value" : "doc"
        },
        "value" : "The strike of a credit default swap option or credit swaption when expressed as in reference to the price of the underlying obligation(s) or index."
      } ],
      "type" : "Decimal"
    }, {
      "multiplicity" : {
        "lowerBound" : 0,
        "upperBound" : 1
      },
      "name" : "strikeReference",
      "taggedValues" : [ {
        "tag" : {
          "profile" : "meta::pure::profiles::doc",
          "value" : "doc"
        },
        "value" : "The strike of a credit default swap option or credit swaption when expressed in reference to the spread of the underlying swap (typical practice in the case of single name swaps)."
      } ],
      "type" : "FpML::model::FixedRateReference"
    } ],
    "taggedValues" : [ {
      "tag" : {
        "profile" : "meta::pure::profiles::doc",
        "value" : "doc"
      },
      "value" : "A complex type to specify the strike of a credit swaption or a credit default swap option."
    } ]
  }
}