{
  "classifierPath" : "meta::pure::metamodel::type::Enumeration",
  "content" : {
    "_type" : "Enumeration",
    "name" : "FxBarrierDirectionEnum",
    "package" : "FpML::model",
    "taggedValues" : [ {
      "tag" : {
        "profile" : "meta::pure::profiles::doc",
        "value" : "doc"
      },
      "value" : "The specification of whether the direction of a barrier within an FX OTC option is Down or Up."
    } ],
    "values" : [ {
      "value" : "Down"
    }, {
      "value" : "Up"
    } ]
  }
}