{
  "classifierPath" : "meta::pure::metamodel::type::Class",
  "content" : {
    "_type" : "class",
    "constraints" : [ {
      "functionDefinition" : {
        "_type" : "lambda",
        "body" : [ {
          "_type" : "func",
          "function" : "forAll",
          "parameters" : [ {
            "_type" : "property",
            "parameters" : [ {
              "_type" : "var",
              "name" : "this",
              "sourceInformation" : {
                "endColumn" : 17,
                "endLine" : 8182,
                "sourceId" : "",
                "startColumn" : 13,
                "startLine" : 8182
              }
            } ],
            "property" : "minimumNumberOfOptions",
            "sourceInformation" : {
              "endColumn" : 40,
              "endLine" : 8182,
              "sourceId" : "",
              "startColumn" : 19,
              "startLine" : 8182
            }
          }, {
            "_type" : "lambda",
            "body" : [ {
              "_type" : "func",
              "function" : "greaterThanEqual",
              "parameters" : [ {
                "_type" : "var",
                "name" : "x",
                "sourceInformation" : {
                  "endColumn" : 65,
                  "endLine" : 8182,
                  "sourceId" : "",
                  "startColumn" : 64,
                  "startLine" : 8182
                }
              }, {
                "_type" : "integer",
                "multiplicity" : {
                  "lowerBound" : 1,
                  "upperBound" : 1
                },
                "sourceInformation" : {
                  "endColumn" : 70,
                  "endLine" : 8182,
                  "sourceId" : "",
                  "startColumn" : 70,
                  "startLine" : 8182
                },
                "values" : [ 0 ]
              } ],
              "sourceInformation" : {
                "endColumn" : 70,
                "endLine" : 8182,
                "sourceId" : "",
                "startColumn" : 67,
                "startLine" : 8182
              }
            } ],
            "parameters" : [ {
              "_type" : "var",
              "class" : "Decimal",
              "multiplicity" : {
                "lowerBound" : 1,
                "upperBound" : 1
              },
              "name" : "x",
              "sourceInformation" : {
                "endColumn" : 59,
                "endLine" : 8182,
                "sourceId" : "",
                "startColumn" : 53,
                "startLine" : 8182
              }
            } ],
            "sourceInformation" : {
              "endColumn" : 70,
              "endLine" : 8182,
              "sourceId" : "",
              "startColumn" : 63,
              "startLine" : 8182
            }
          } ],
          "sourceInformation" : {
            "endColumn" : 48,
            "endLine" : 8182,
            "sourceId" : "",
            "startColumn" : 43,
            "startLine" : 8182
          }
        } ],
        "parameters" : [ ]
      },
      "name" : "c1_range"
    }, {
      "functionDefinition" : {
        "_type" : "lambda",
        "body" : [ {
          "_type" : "func",
          "function" : "or",
          "parameters" : [ {
            "_type" : "func",
            "function" : "and",
            "parameters" : [ {
              "_type" : "func",
              "function" : "isNotEmpty",
              "parameters" : [ {
                "_type" : "property",
                "parameters" : [ {
                  "_type" : "var",
                  "name" : "this",
                  "sourceInformation" : {
                    "endColumn" : 19,
                    "endLine" : 8183,
                    "sourceId" : "",
                    "startColumn" : 15,
                    "startLine" : 8183
                  }
                } ],
                "property" : "minimumNotionalAmount",
                "sourceInformation" : {
                  "endColumn" : 41,
                  "endLine" : 8183,
                  "sourceId" : "",
                  "startColumn" : 21,
                  "startLine" : 8183
                }
              } ],
              "sourceInformation" : {
                "endColumn" : 53,
                "endLine" : 8183,
                "sourceId" : "",
                "startColumn" : 44,
                "startLine" : 8183
              }
            }, {
              "_type" : "func",
              "function" : "isEmpty",
              "parameters" : [ {
                "_type" : "property",
                "parameters" : [ {
                  "_type" : "var",
                  "name" : "this",
                  "sourceInformation" : {
                    "endColumn" : 64,
                    "endLine" : 8183,
                    "sourceId" : "",
                    "startColumn" : 60,
                    "startLine" : 8183
                  }
                } ],
                "property" : "minimumNumberOfOptions",
                "sourceInformation" : {
                  "endColumn" : 87,
                  "endLine" : 8183,
                  "sourceId" : "",
                  "startColumn" : 66,
                  "startLine" : 8183
                }
              } ],
              "sourceInformation" : {
                "endColumn" : 96,
                "endLine" : 8183,
                "sourceId" : "",
                "startColumn" : 90,
                "startLine" : 8183
              }
            } ],
            "sourceInformation" : {
              "endColumn" : 58,
              "endLine" : 8183,
              "sourceId" : "",
              "startColumn" : 57,
              "startLine" : 8183
            }
          }, {
            "_type" : "func",
            "function" : "and",
            "parameters" : [ {
              "_type" : "func",
              "function" : "isEmpty",
              "parameters" : [ {
                "_type" : "property",
                "parameters" : [ {
                  "_type" : "var",
                  "name" : "this",
                  "sourceInformation" : {
                    "endColumn" : 109,
                    "endLine" : 8183,
                    "sourceId" : "",
                    "startColumn" : 105,
                    "startLine" : 8183
                  }
                } ],
                "property" : "minimumNotionalAmount",
                "sourceInformation" : {
                  "endColumn" : 131,
                  "endLine" : 8183,
                  "sourceId" : "",
                  "startColumn" : 111,
                  "startLine" : 8183
                }
              } ],
              "sourceInformation" : {
                "endColumn" : 140,
                "endLine" : 8183,
                "sourceId" : "",
                "startColumn" : 134,
                "startLine" : 8183
              }
            }, {
              "_type" : "func",
              "function" : "isNotEmpty",
              "parameters" : [ {
                "_type" : "property",
                "parameters" : [ {
                  "_type" : "var",
                  "name" : "this",
                  "sourceInformation" : {
                    "endColumn" : 151,
                    "endLine" : 8183,
                    "sourceId" : "",
                    "startColumn" : 147,
                    "startLine" : 8183
                  }
                } ],
                "property" : "minimumNumberOfOptions",
                "sourceInformation" : {
                  "endColumn" : 174,
                  "endLine" : 8183,
                  "sourceId" : "",
                  "startColumn" : 153,
                  "startLine" : 8183
                }
              } ],
              "sourceInformation" : {
                "endColumn" : 186,
                "endLine" : 8183,
                "sourceId" : "",
                "startColumn" : 177,
                "startLine" : 8183
              }
            } ],
            "sourceInformation" : {
              "endColumn" : 145,
              "endLine" : 8183,
              "sourceId" : "",
              "startColumn" : 144,
              "startLine" : 8183
            }
          } ],
          "sourceInformation" : {
            "endColumn" : 102,
            "endLine" : 8183,
            "sourceId" : "",
            "startColumn" : 101,
            "startLine" : 8183
          }
        } ],
        "parameters" : [ ]
      },
      "name" : "c2_choice"
    } ],
    "name" : "PartialExercise",
    "package" : "FpML::model",
    "properties" : [ {
      "multiplicity" : {
        "lowerBound" : 0
      },
      "name" : "notionalReference",
      "taggedValues" : [ {
        "tag" : {
          "profile" : "meta::pure::profiles::doc",
          "value" : "doc"
        },
        "value" : "A pointer style reference to the associated notional schedule defined elsewhere in the document. This element has been made optional as part of its integration in the OptionBaseExtended, because not required for the options on securities."
      } ],
      "type" : "FpML::model::NotionalReference"
    }, {
      "multiplicity" : {
        "lowerBound" : 0,
        "upperBound" : 1
      },
      "name" : "integralMultipleAmount",
      "taggedValues" : [ {
        "tag" : {
          "profile" : "meta::pure::profiles::doc",
          "value" : "doc"
        },
        "value" : "A notional amount which restricts the amount of notional that can be exercised when partial exercise or multiple exercise is applicable. The integral multiple amount defines a lower limit of notional that can be exercised and also defines a unit multiple of notional that can be exercised, i.e. only integer multiples of this amount can be exercised."
      } ],
      "type" : "Decimal"
    }, {
      "multiplicity" : {
        "lowerBound" : 0,
        "upperBound" : 1
      },
      "name" : "minimumNotionalAmount",
      "taggedValues" : [ {
        "tag" : {
          "profile" : "meta::pure::profiles::doc",
          "value" : "doc"
        },
        "value" : "The minimum notional amount that can be exercised on a given exercise date. See multipleExercise."
      } ],
      "type" : "Decimal"
    }, {
      "multiplicity" : {
        "lowerBound" : 0,
        "upperBound" : 1
      },
      "name" : "minimumNumberOfOptions",
      "taggedValues" : [ {
        "tag" : {
          "profile" : "meta::pure::profiles::doc",
          "value" : "doc"
        },
        "value" : "The minimum number of options that can be exercised on a given exercise date."
      } ],
      "type" : "Decimal"
    } ],
    "taggedValues" : [ {
      "tag" : {
        "profile" : "meta::pure::profiles::doc",
        "value" : "doc"
      },
      "value" : "A type defining partial exercise. As defined in the 2000 ISDA Definitions, Section 12.3 Partial Exercise, the buyer of the option may exercise all or less than all the notional amount of the underlying swap but may not be less than the minimum notional amount (if specified) and must be an integral multiple of the integral multiple amount if specified."
    } ]
  }
}