{
  "classifierPath" : "meta::pure::metamodel::type::Class",
  "content" : {
    "_type" : "class",
    "constraints" : [ {
      "functionDefinition" : {
        "_type" : "lambda",
        "body" : [ {
          "_type" : "func",
          "function" : "or",
          "parameters" : [ {
            "_type" : "func",
            "function" : "isNotEmpty",
            "parameters" : [ {
              "_type" : "property",
              "parameters" : [ {
                "_type" : "var",
                "name" : "this",
                "sourceInformation" : {
                  "endColumn" : 18,
                  "endLine" : 7638,
                  "sourceId" : "",
                  "startColumn" : 14,
                  "startLine" : 7638
                }
              } ],
              "property" : "entityName",
              "sourceInformation" : {
                "endColumn" : 29,
                "endLine" : 7638,
                "sourceId" : "",
                "startColumn" : 20,
                "startLine" : 7638
              }
            } ],
            "sourceInformation" : {
              "endColumn" : 41,
              "endLine" : 7638,
              "sourceId" : "",
              "startColumn" : 32,
              "startLine" : 7638
            }
          }, {
            "_type" : "func",
            "function" : "and",
            "parameters" : [ {
              "_type" : "func",
              "function" : "isEmpty",
              "parameters" : [ {
                "_type" : "property",
                "parameters" : [ {
                  "_type" : "var",
                  "name" : "this",
                  "sourceInformation" : {
                    "endColumn" : 53,
                    "endLine" : 7638,
                    "sourceId" : "",
                    "startColumn" : 49,
                    "startLine" : 7638
                  }
                } ],
                "property" : "entityName",
                "sourceInformation" : {
                  "endColumn" : 64,
                  "endLine" : 7638,
                  "sourceId" : "",
                  "startColumn" : 55,
                  "startLine" : 7638
                }
              } ],
              "sourceInformation" : {
                "endColumn" : 73,
                "endLine" : 7638,
                "sourceId" : "",
                "startColumn" : 67,
                "startLine" : 7638
              }
            }, {
              "_type" : "func",
              "function" : "isNotEmpty",
              "parameters" : [ {
                "_type" : "property",
                "parameters" : [ {
                  "_type" : "var",
                  "name" : "this",
                  "sourceInformation" : {
                    "endColumn" : 84,
                    "endLine" : 7638,
                    "sourceId" : "",
                    "startColumn" : 80,
                    "startLine" : 7638
                  }
                } ],
                "property" : "entityId",
                "sourceInformation" : {
                  "endColumn" : 93,
                  "endLine" : 7638,
                  "sourceId" : "",
                  "startColumn" : 86,
                  "startLine" : 7638
                }
              } ],
              "sourceInformation" : {
                "endColumn" : 105,
                "endLine" : 7638,
                "sourceId" : "",
                "startColumn" : 96,
                "startLine" : 7638
              }
            } ],
            "sourceInformation" : {
              "endColumn" : 78,
              "endLine" : 7638,
              "sourceId" : "",
              "startColumn" : 77,
              "startLine" : 7638
            }
          } ],
          "sourceInformation" : {
            "endColumn" : 46,
            "endLine" : 7638,
            "sourceId" : "",
            "startColumn" : 45,
            "startLine" : 7638
          }
        } ],
        "parameters" : [ ]
      },
      "name" : "c1_choice"
    } ],
    "name" : "LegalEntity",
    "package" : "FpML::model",
    "properties" : [ {
      "multiplicity" : {
        "lowerBound" : 0,
        "upperBound" : 1
      },
      "name" : "entityName",
      "taggedValues" : [ {
        "tag" : {
          "profile" : "meta::pure::profiles::doc",
          "value" : "doc"
        },
        "value" : "The name of the reference entity. A free format string. FpML does not define usage rules for this element."
      } ],
      "type" : "FpML::model::EntityName"
    }, {
      "multiplicity" : {
        "lowerBound" : 0
      },
      "name" : "entityId",
      "taggedValues" : [ {
        "tag" : {
          "profile" : "meta::pure::profiles::doc",
          "value" : "doc"
        },
        "value" : "A legal entity identifier (e.g. RED entity code).."
      } ],
      "type" : "FpML::model::EntityId"
    }, {
      "multiplicity" : {
        "lowerBound" : 0,
        "upperBound" : 1
      },
      "name" : "id",
      "type" : "String"
    } ],
    "taggedValues" : [ {
      "tag" : {
        "profile" : "meta::pure::profiles::doc",
        "value" : "doc"
      },
      "value" : "A type defining a legal entity."
    } ]
  }
}