{
  "classifierPath" : "meta::pure::metamodel::type::Class",
  "content" : {
    "_type" : "class",
    "constraints" : [ {
      "functionDefinition" : {
        "_type" : "lambda",
        "body" : [ {
          "_type" : "func",
          "function" : "or",
          "parameters" : [ {
            "_type" : "func",
            "function" : "and",
            "parameters" : [ {
              "_type" : "func",
              "function" : "isNotEmpty",
              "parameters" : [ {
                "_type" : "property",
                "parameters" : [ {
                  "_type" : "var",
                  "name" : "this",
                  "sourceInformation" : {
                    "endColumn" : 19,
                    "endLine" : 6168,
                    "sourceId" : "",
                    "startColumn" : 15,
                    "startLine" : 6168
                  }
                } ],
                "property" : "businessCentersReference",
                "sourceInformation" : {
                  "endColumn" : 44,
                  "endLine" : 6168,
                  "sourceId" : "",
                  "startColumn" : 21,
                  "startLine" : 6168
                }
              } ],
              "sourceInformation" : {
                "endColumn" : 56,
                "endLine" : 6168,
                "sourceId" : "",
                "startColumn" : 47,
                "startLine" : 6168
              }
            }, {
              "_type" : "func",
              "function" : "isEmpty",
              "parameters" : [ {
                "_type" : "property",
                "parameters" : [ {
                  "_type" : "var",
                  "name" : "this",
                  "sourceInformation" : {
                    "endColumn" : 67,
                    "endLine" : 6168,
                    "sourceId" : "",
                    "startColumn" : 63,
                    "startLine" : 6168
                  }
                } ],
                "property" : "businessCenters",
                "sourceInformation" : {
                  "endColumn" : 83,
                  "endLine" : 6168,
                  "sourceId" : "",
                  "startColumn" : 69,
                  "startLine" : 6168
                }
              } ],
              "sourceInformation" : {
                "endColumn" : 92,
                "endLine" : 6168,
                "sourceId" : "",
                "startColumn" : 86,
                "startLine" : 6168
              }
            } ],
            "sourceInformation" : {
              "endColumn" : 61,
              "endLine" : 6168,
              "sourceId" : "",
              "startColumn" : 60,
              "startLine" : 6168
            }
          }, {
            "_type" : "func",
            "function" : "and",
            "parameters" : [ {
              "_type" : "func",
              "function" : "isEmpty",
              "parameters" : [ {
                "_type" : "property",
                "parameters" : [ {
                  "_type" : "var",
                  "name" : "this",
                  "sourceInformation" : {
                    "endColumn" : 105,
                    "endLine" : 6168,
                    "sourceId" : "",
                    "startColumn" : 101,
                    "startLine" : 6168
                  }
                } ],
                "property" : "businessCentersReference",
                "sourceInformation" : {
                  "endColumn" : 130,
                  "endLine" : 6168,
                  "sourceId" : "",
                  "startColumn" : 107,
                  "startLine" : 6168
                }
              } ],
              "sourceInformation" : {
                "endColumn" : 139,
                "endLine" : 6168,
                "sourceId" : "",
                "startColumn" : 133,
                "startLine" : 6168
              }
            }, {
              "_type" : "func",
              "function" : "isNotEmpty",
              "parameters" : [ {
                "_type" : "property",
                "parameters" : [ {
                  "_type" : "var",
                  "name" : "this",
                  "sourceInformation" : {
                    "endColumn" : 150,
                    "endLine" : 6168,
                    "sourceId" : "",
                    "startColumn" : 146,
                    "startLine" : 6168
                  }
                } ],
                "property" : "businessCenters",
                "sourceInformation" : {
                  "endColumn" : 166,
                  "endLine" : 6168,
                  "sourceId" : "",
                  "startColumn" : 152,
                  "startLine" : 6168
                }
              } ],
              "sourceInformation" : {
                "endColumn" : 178,
                "endLine" : 6168,
                "sourceId" : "",
                "startColumn" : 169,
                "startLine" : 6168
              }
            } ],
            "sourceInformation" : {
              "endColumn" : 144,
              "endLine" : 6168,
              "sourceId" : "",
              "startColumn" : 143,
              "startLine" : 6168
            }
          } ],
          "sourceInformation" : {
            "endColumn" : 98,
            "endLine" : 6168,
            "sourceId" : "",
            "startColumn" : 97,
            "startLine" : 6168
          }
        } ],
        "parameters" : [ ]
      },
      "name" : "c1_choice"
    } ],
    "name" : "BusinessDayAdjustments",
    "package" : "FpML::model",
    "properties" : [ {
      "multiplicity" : {
        "lowerBound" : 0,
        "upperBound" : 1
      },
      "name" : "businessDayConvention",
      "taggedValues" : [ {
        "tag" : {
          "profile" : "meta::pure::profiles::doc",
          "value" : "doc"
        },
        "value" : "The convention for adjusting a date if it would otherwise fall on a day that is not a business day."
      } ],
      "type" : "FpML::model::BusinessDayConventionEnum"
    }, {
      "multiplicity" : {
        "lowerBound" : 0,
        "upperBound" : 1
      },
      "name" : "businessCentersReference",
      "taggedValues" : [ {
        "tag" : {
          "profile" : "meta::pure::profiles::doc",
          "value" : "doc"
        },
        "value" : "A pointer style reference to a set of financial business centers defined elsewhere in the document. This set of business centers is used to determine whether a particular day is a business day or not."
      } ],
      "type" : "FpML::model::BusinessCentersReference"
    }, {
      "multiplicity" : {
        "lowerBound" : 0,
        "upperBound" : 1
      },
      "name" : "businessCenters",
      "type" : "FpML::model::BusinessCenters"
    }, {
      "multiplicity" : {
        "lowerBound" : 0,
        "upperBound" : 1
      },
      "name" : "id",
      "type" : "String"
    } ],
    "taggedValues" : [ {
      "tag" : {
        "profile" : "meta::pure::profiles::doc",
        "value" : "doc"
      },
      "value" : "A type defining the business day convention and financial business centers used for adjusting any relevant date if it would otherwise fall on a day that is not a business day in the specified business centers."
    } ]
  }
}