{
  "classifierPath" : "meta::pure::metamodel::type::Class",
  "content" : {
    "_type" : "class",
    "constraints" : [ {
      "functionDefinition" : {
        "_type" : "lambda",
        "body" : [ {
          "_type" : "func",
          "function" : "or",
          "parameters" : [ {
            "_type" : "func",
            "function" : "isNotEmpty",
            "parameters" : [ {
              "_type" : "property",
              "parameters" : [ {
                "_type" : "var",
                "name" : "this",
                "sourceInformation" : {
                  "endColumn" : 18,
                  "endLine" : 9085,
                  "sourceId" : "",
                  "startColumn" : 14,
                  "startLine" : 9085
                }
              } ],
              "property" : "unadjustedDate",
              "sourceInformation" : {
                "endColumn" : 33,
                "endLine" : 9085,
                "sourceId" : "",
                "startColumn" : 20,
                "startLine" : 9085
              }
            } ],
            "sourceInformation" : {
              "endColumn" : 45,
              "endLine" : 9085,
              "sourceId" : "",
              "startColumn" : 36,
              "startLine" : 9085
            }
          }, {
            "_type" : "func",
            "function" : "and",
            "parameters" : [ {
              "_type" : "func",
              "function" : "isEmpty",
              "parameters" : [ {
                "_type" : "property",
                "parameters" : [ {
                  "_type" : "var",
                  "name" : "this",
                  "sourceInformation" : {
                    "endColumn" : 57,
                    "endLine" : 9085,
                    "sourceId" : "",
                    "startColumn" : 53,
                    "startLine" : 9085
                  }
                } ],
                "property" : "unadjustedDate",
                "sourceInformation" : {
                  "endColumn" : 72,
                  "endLine" : 9085,
                  "sourceId" : "",
                  "startColumn" : 59,
                  "startLine" : 9085
                }
              } ],
              "sourceInformation" : {
                "endColumn" : 81,
                "endLine" : 9085,
                "sourceId" : "",
                "startColumn" : 75,
                "startLine" : 9085
              }
            }, {
              "_type" : "func",
              "function" : "isNotEmpty",
              "parameters" : [ {
                "_type" : "property",
                "parameters" : [ {
                  "_type" : "var",
                  "name" : "this",
                  "sourceInformation" : {
                    "endColumn" : 92,
                    "endLine" : 9085,
                    "sourceId" : "",
                    "startColumn" : 88,
                    "startLine" : 9085
                  }
                } ],
                "property" : "adjustedDate",
                "sourceInformation" : {
                  "endColumn" : 105,
                  "endLine" : 9085,
                  "sourceId" : "",
                  "startColumn" : 94,
                  "startLine" : 9085
                }
              } ],
              "sourceInformation" : {
                "endColumn" : 117,
                "endLine" : 9085,
                "sourceId" : "",
                "startColumn" : 108,
                "startLine" : 9085
              }
            } ],
            "sourceInformation" : {
              "endColumn" : 86,
              "endLine" : 9085,
              "sourceId" : "",
              "startColumn" : 85,
              "startLine" : 9085
            }
          } ],
          "sourceInformation" : {
            "endColumn" : 50,
            "endLine" : 9085,
            "sourceId" : "",
            "startColumn" : 49,
            "startLine" : 9085
          }
        } ],
        "parameters" : [ ]
      },
      "name" : "c1_choice"
    } ],
    "name" : "ScheduledDateBase",
    "package" : "FpML::model",
    "properties" : [ {
      "multiplicity" : {
        "lowerBound" : 0,
        "upperBound" : 1
      },
      "name" : "unadjustedDate",
      "type" : "StrictDate"
    }, {
      "multiplicity" : {
        "lowerBound" : 0,
        "upperBound" : 1
      },
      "name" : "adjustedDate",
      "type" : "StrictDate"
    }, {
      "multiplicity" : {
        "lowerBound" : 0,
        "upperBound" : 1
      },
      "name" : "type",
      "taggedValues" : [ {
        "tag" : {
          "profile" : "meta::pure::profiles::doc",
          "value" : "doc"
        },
        "value" : "The type of the date, e.g. next or previous payment."
      } ],
      "type" : "FpML::model::ScheduledDateType"
    } ],
    "taggedValues" : [ {
      "tag" : {
        "profile" : "meta::pure::profiles::doc",
        "value" : "doc"
      },
      "value" : "An servicing date relevant for a trade structure, such as a payment or a reset."
    } ]
  }
}