{
  "classifierPath" : "meta::pure::metamodel::type::Class",
  "content" : {
    "_type" : "class",
    "constraints" : [ {
      "functionDefinition" : {
        "_type" : "lambda",
        "body" : [ {
          "_type" : "func",
          "function" : "forAll",
          "parameters" : [ {
            "_type" : "property",
            "parameters" : [ {
              "_type" : "var",
              "name" : "this",
              "sourceInformation" : {
                "endColumn" : 18,
                "endLine" : 8282,
                "sourceId" : "",
                "startColumn" : 14,
                "startLine" : 8282
              }
            } ],
            "property" : "partyRoleScheme",
            "sourceInformation" : {
              "endColumn" : 34,
              "endLine" : 8282,
              "sourceId" : "",
              "startColumn" : 20,
              "startLine" : 8282
            }
          }, {
            "_type" : "lambda",
            "body" : [ {
              "_type" : "func",
              "function" : "greaterThanEqual",
              "parameters" : [ {
                "_type" : "func",
                "function" : "length",
                "parameters" : [ {
                  "_type" : "var",
                  "name" : "x",
                  "sourceInformation" : {
                    "endColumn" : 58,
                    "endLine" : 8282,
                    "sourceId" : "",
                    "startColumn" : 57,
                    "startLine" : 8282
                  }
                } ],
                "sourceInformation" : {
                  "endColumn" : 66,
                  "endLine" : 8282,
                  "sourceId" : "",
                  "startColumn" : 61,
                  "startLine" : 8282
                }
              }, {
                "_type" : "integer",
                "multiplicity" : {
                  "lowerBound" : 1,
                  "upperBound" : 1
                },
                "sourceInformation" : {
                  "endColumn" : 73,
                  "endLine" : 8282,
                  "sourceId" : "",
                  "startColumn" : 73,
                  "startLine" : 8282
                },
                "values" : [ 1 ]
              } ],
              "sourceInformation" : {
                "endColumn" : 73,
                "endLine" : 8282,
                "sourceId" : "",
                "startColumn" : 70,
                "startLine" : 8282
              }
            } ],
            "parameters" : [ {
              "_type" : "var",
              "class" : "String",
              "multiplicity" : {
                "lowerBound" : 1,
                "upperBound" : 1
              },
              "name" : "x",
              "sourceInformation" : {
                "endColumn" : 52,
                "endLine" : 8282,
                "sourceId" : "",
                "startColumn" : 47,
                "startLine" : 8282
              }
            } ],
            "sourceInformation" : {
              "endColumn" : 73,
              "endLine" : 8282,
              "sourceId" : "",
              "startColumn" : 56,
              "startLine" : 8282
            }
          } ],
          "sourceInformation" : {
            "endColumn" : 42,
            "endLine" : 8282,
            "sourceId" : "",
            "startColumn" : 37,
            "startLine" : 8282
          }
        } ],
        "parameters" : [ ]
      },
      "name" : "c1_length"
    }, {
      "functionDefinition" : {
        "_type" : "lambda",
        "body" : [ {
          "_type" : "func",
          "function" : "lessThanEqual",
          "parameters" : [ {
            "_type" : "func",
            "function" : "length",
            "parameters" : [ {
              "_type" : "property",
              "parameters" : [ {
                "_type" : "var",
                "name" : "this",
                "sourceInformation" : {
                  "endColumn" : 18,
                  "endLine" : 8283,
                  "sourceId" : "",
                  "startColumn" : 14,
                  "startLine" : 8283
                }
              } ],
              "property" : "value",
              "sourceInformation" : {
                "endColumn" : 24,
                "endLine" : 8283,
                "sourceId" : "",
                "startColumn" : 20,
                "startLine" : 8283
              }
            } ],
            "sourceInformation" : {
              "endColumn" : 32,
              "endLine" : 8283,
              "sourceId" : "",
              "startColumn" : 27,
              "startLine" : 8283
            }
          }, {
            "_type" : "integer",
            "multiplicity" : {
              "lowerBound" : 1,
              "upperBound" : 1
            },
            "sourceInformation" : {
              "endColumn" : 41,
              "endLine" : 8283,
              "sourceId" : "",
              "startColumn" : 39,
              "startLine" : 8283
            },
            "values" : [ 255 ]
          } ],
          "sourceInformation" : {
            "endColumn" : 41,
            "endLine" : 8283,
            "sourceId" : "",
            "startColumn" : 36,
            "startLine" : 8283
          }
        } ],
        "parameters" : [ ]
      },
      "name" : "c2_length"
    } ],
    "name" : "PartyRole",
    "package" : "FpML::model",
    "properties" : [ {
      "multiplicity" : {
        "lowerBound" : 0,
        "upperBound" : 1
      },
      "name" : "partyRoleScheme",
      "type" : "String"
    }, {
      "multiplicity" : {
        "lowerBound" : 1,
        "upperBound" : 1
      },
      "name" : "value",
      "type" : "String"
    } ],
    "taggedValues" : [ {
      "tag" : {
        "profile" : "meta::pure::profiles::doc",
        "value" : "doc"
      },
      "value" : "A type describing a role played by a party in one or more transactions. Examples include roles such as guarantor, custodian, confirmation service provider, etc. This can be extended to provide custom roles."
    } ]
  }
}