{
  "classifierPath" : "meta::pure::metamodel::type::Enumeration",
  "content" : {
    "_type" : "Enumeration",
    "name" : "EnvironmentalAbandonmentOfSchemeEnum",
    "package" : "FpML::model",
    "taggedValues" : [ {
      "tag" : {
        "profile" : "meta::pure::profiles::doc",
        "value" : "doc"
      },
      "value" : "Upon the occurrence of an Abandonment of Scheme, as defined in clause (h)(iv) of the Emissions Annex, one of the following elections, the specific terms of which are set forth in clause (b)(iii) of the Emissions Annex, will govern the parties’ rights and obligations with respect to this Emissions Transaction. If none of the above options is selected, Option A(1) will apply."
    } ],
    "values" : [ {
      "value" : "OptionA_1_"
    }, {
      "value" : "OptionA_2_"
    }, {
      "value" : "OptionB"
    }, {
      "value" : "OptionC"
    } ]
  }
}