{
  "area": [
    {
      "xpos": 17,
      "ypos": 7,
      "width": 168,
      "height": 496,
      "type": "exclude"
    },
    {
      "xpos": 215,
      "ypos": 55,
      "width": 164,
      "height": 983,
      "type": "match",
      "match": 80,
      "click_point": {
        "xpos": 79,
        "ypos": 222,
        "id": "compose"
      }
    },
    {
      "xpos": 15,
      "ypos": 892,
      "width": 186,
      "height": 175,
      "type": "match",
      "match": 95,
      "click_point": {
        "xpos": 93,
        "ypos": 87,
        "id": "launcher"
      }
    }
  ],
  "properties": [],
  "tags": [
    "agl-msg-default-screen"
  ]
}