{
  "area": [
    {
      "xpos": 4,
      "ypos": 9,
      "width": 201,
      "height": 1065,
      "type": "exclude"
    },
    {
      "xpos": 216,
      "ypos": 4,
      "width": 162,
      "height": 1069,
      "type": "match",
      "match": 95
    },
    {
      "xpos": 416,
      "ypos": 237,
      "width": 126,
      "height": 613,
      "type": "match",
      "match": 95
    },
    {
      "xpos": 1379,
      "ypos": 228,
      "width": 173,
      "height": 640,
      "type": "match",
      "match": 95
    }
  ],
  "properties": [],
  "tags": [
    "agl-phone-dialpad-digits"
  ]
}