{
  "area": [
    {
      "xpos": 4,
      "ypos": 4,
      "width": 527,
      "height": 870,
      "type": "exclude"
    },
    {
      "xpos": 1143,
      "ypos": 11,
      "width": 44,
      "height": 229,
      "type": "match",
      "match": 95
    },
    {
      "xpos": 1141,
      "ypos": 846,
      "width": 44,
      "height": 203,
      "type": "match",
      "match": 95
    },
    {
      "xpos": 1408,
      "ypos": 174,
      "width": 139,
      "height": 247,
      "type": "match",
      "match": 95
    },
    {
      "xpos": 1577,
      "ypos": 355,
      "width": 37,
      "height": 90,
      "type": "match",
      "match": 95
    },
    {
      "xpos": 731,
      "ypos": 849,
      "width": 64,
      "height": 220,
      "type": "match",
      "match": 95
    },
    {
      "xpos": 713,
      "ypos": 2,
      "width": 88,
      "height": 245,
      "type": "match",
      "match": 95
    },
    {
      "xpos": 1652,
      "ypos": 622,
      "width": 46,
      "height": 143,
      "type": "match",
      "match": 95,
      "click_point": {
        "xpos": 23,
        "ypos": 72,
        "id": "french"
      }
    },
    {
      "xpos": 6,
      "ypos": 890,
      "width": 205,
      "height": 183,
      "type": "match",
      "match": 95,
      "click_point": {
        "xpos": 102,
        "ypos": 91,
        "id": "launcher"
      }
    }
  ],
  "properties": [],
  "tags": [
    "agl-dashboard-page-en"
  ]
}