{
  "db_name": "SQLite",
  "query": "SELECT path FROM lorries ORDER BY (max(last_attempted, last_run) + interval)",
  "describe": {
    "columns": [
      {
        "name": "path",
        "ordinal": 0,
        "type_info": "Text"
      }
    ],
    "parameters": {
      "Right": 0
    },
    "nullable": [
      false
    ]
  },
  "hash": "a81927eb4aa52c1f16670c8fc41e723116f70546b0a3a0218e10c8dc46642da7"
}
