{
  "db_name": "SQLite",
  "query": "\nSELECT \n    jobs.id, \n    jobs.path, \n    jobs.started, \n    jobs.ended, \n    jobs.exit, \n    jobs.status,\n    jobs.output,\n    jobs.kind,\n    COUNT(warnings.id) as warnings\nFROM jobs LEFT JOIN warnings on jobs.id = warnings.job_id\nWHERE jobs.id = ?\nGROUP BY jobs.id\n",
  "describe": {
    "columns": [
      {
        "name": "id",
        "ordinal": 0,
        "type_info": "Int64"
      },
      {
        "name": "path",
        "ordinal": 1,
        "type_info": "Text"
      },
      {
        "name": "started",
        "ordinal": 2,
        "type_info": "Int64"
      },
      {
        "name": "ended",
        "ordinal": 3,
        "type_info": "Int64"
      },
      {
        "name": "exit",
        "ordinal": 4,
        "type_info": "Int64"
      },
      {
        "name": "status",
        "ordinal": 5,
        "type_info": "Text"
      },
      {
        "name": "output",
        "ordinal": 6,
        "type_info": "Text"
      },
      {
        "name": "kind",
        "ordinal": 7,
        "type_info": "Text"
      },
      {
        "name": "warnings",
        "ordinal": 8,
        "type_info": "Int64"
      }
    ],
    "parameters": {
      "Right": 1
    },
    "nullable": [
      false,
      false,
      false,
      true,
      true,
      false,
      true,
      false,
      false
    ]
  },
  "hash": "4d9a9990ab1c53d5be0af8ce99a3aae0fb6dfced35c98b1fdb32d22ac22d5689"
}
