{
  "db_name": "SQLite",
  "query": "\nSELECT id, kind, message FROM warnings WHERE job_id = ?\n            ",
  "describe": {
    "columns": [
      {
        "name": "id",
        "ordinal": 0,
        "type_info": "Int64"
      },
      {
        "name": "kind",
        "ordinal": 1,
        "type_info": "Text"
      },
      {
        "name": "message",
        "ordinal": 2,
        "type_info": "Text"
      }
    ],
    "parameters": {
      "Right": 1
    },
    "nullable": [
      false,
      false,
      false
    ]
  },
  "hash": "3c42dae29ea01482bca0de1d9095062b38813aa634bf63ac01cf79bc1542afc8"
}
