{
  "db_name": "SQLite",
  "query": "\nWITH running_jobs AS (\n    SELECT running_job FROM lorries WHERE running_job IS NOT NULL\n)\nUPDATE jobs\nSET\n    exit = -1,\n    output = 'job was was not completed due to an internal error'\nWHERE id IN running_jobs;\n\nUPDATE lorries\nSET\n    running_job = NULL\nWHERE running_job IS NOT NULL;\n",
  "describe": {
    "columns": [],
    "parameters": {
      "Right": 0
    },
    "nullable": []
  },
  "hash": "bfd997956d7393feb3d73f2fa4141a83fcb2853061be93a7cd011dee51554d59"
}
