<svg version="1.1" baseProfile="full" width="716.0" height="1288.0" viewBox="0 0 716 1288" xmlns="http://www.w3.org/2000/svg" xmlns:xlink="http://www.w3.org/1999/xlink" xmlns:ev="http://www.w3.org/2001/xml-events">
	<desc >[Git Host A| [repository-a | main | 1.0 | 1.1] ]
	[Git Host B| [repository-b | main | dev] ]
	[Internet Widget Co | [file-c.tar.gz]]
	
	[Lorry |
		HTTP User Interface 
	    | 
	    Prometheus Metrics 
	    |
	    [ File System |
	    [workspace-a | 
	    	[Repository| repository-a] | [Raw Files|]
	    ]
	    [workspace-b | 
	    	[Repository| repository-b] | [Raw Files|]
	    ]
	    [workspace-c | 
	    	[Repository|] | [Raw Files| file-c.tar.gz]
	    ] ] |
	 	[&lt;database&gt; Metadata Store]   
	]
	
	[Git Host A] &lt;--&gt; [Lorry]
	[Git Host B] &lt;--&gt; [Lorry]
	[Internet Widget Co] &lt;--&gt; [Lorry]
	[Lorry] &lt;--&gt; [&quot;Downstream&quot; Git Host]
	
	[&quot;Downstream&quot; Git Host | 
		[repository-a | main | 1.0 | 1.1] 
	    [repository-b | main | dev] |
	    [internet-widget-co (LFS) | file-c.tar.gz] | 
	]</desc>
	<g stroke-width="1.0" text-align="left" font="12pt Helvetica, Arial, sans-serif" font-size="12pt" font-family="Helvetica" font-weight="normal" font-style="normal">
		<g font-family="Helvetica" font-size="12pt" font-weight="bold" font-style="normal" stroke-width="3.0" stroke-linejoin="round" stroke-linecap="round" stroke="#33322E">
			<g stroke="transparent" fill="transparent">
				<rect x="0.0" y="0.0" height="1288.0" width="716.0" stroke="none"></rect>
			</g>
			<g transform="translate(8, 8)" fill="#33322E">
				<g transform="translate(20, 20)" fill="#33322E" font-family="Helvetica" font-size="12pt" font-weight="normal" font-style="normal">
					<g stroke-dasharray="6 6">
						<path d="M124.5 222.7 L124.5 236 L133.8718302202676 250.41118418299058 L133.9 250.4 " fill="none"></path>
					</g>
					<path d="M125.8 247.7 L133.9 250.4 L134.7 241.9 L137.5 256.0 Z"></path>
					<path d="M129.8 229.3 L124.5 222.7 L119.2 229.3 L124.5 216.0 Z"></path>
					<g stroke-dasharray="6 6">
						<path d="M330.0 206.7 L330 236 L330 249.33333333333334 L330.0 249.3 " fill="none"></path>
					</g>
					<path d="M324.7 242.7 L330.0 249.3 L335.3 242.7 L330.0 256.0 Z"></path>
					<path d="M335.3 213.3 L330.0 206.7 L324.7 213.3 L330.0 200.0 Z"></path>
					<g stroke-dasharray="6 6">
						<path d="M532.0 174.7 L532 236 L522.8058541741046 250.38292119298495 L522.8 250.4 " fill="none"></path>
					</g>
					<path d="M521.9 241.9 L522.8 250.4 L530.9 247.6 L519.2 256.0 Z"></path>
					<path d="M537.3 181.3 L532.0 174.7 L526.7 181.3 L532.0 168.0 Z"></path>
					<g stroke-dasharray="6 6">
						<path d="M330.0 854.7 L330 868 L330 881.3333333333334 L330.0 881.3 " fill="none"></path>
					</g>
					<path d="M324.7 874.7 L330.0 881.3 L335.3 874.7 L330.0 888.0 Z"></path>
					<path d="M335.3 861.3 L330.0 854.7 L324.7 861.3 L330.0 848.0 Z"></path>
					<g data-name="Git Host A">
						<g fill="#eee8d5" stroke="#33322E" data-name="Git Host A">
							<rect x="42.0" y="0.0" height="216.0" width="165.0" data-name="Git Host A"></rect>
							<path d="M42.0 32.0 L207.0 32.0" fill="none" data-name="Git Host A"></path>
						</g>
						<g transform="translate(42, 0)" font-family="Helvetica" font-size="12pt" font-weight="bold" font-style="normal" data-name="Git Host A">
							<g transform="translate(8, 8)" fill="#33322E" text-align="center" data-name="Git Host A">
								<text x="74.5" y="14.1" stroke="none" text-anchor="middle" data-name="Git Host A">Git Host A</text>
								
							</g>
						</g>
						<g transform="translate(42, 32)" font-family="Helvetica" font-size="12pt" font-weight="normal" font-style="normal" data-name="Git Host A">
							<g transform="translate(8, 8)" fill="#33322E" data-name="Git Host A">
								<g transform="translate(20, 20)" data-name="Git Host A">
									<g data-name="repository-a">
										<g fill="#fdf6e3" stroke="#33322E" data-name="repository-a">
											<rect x="0.0" y="0.0" height="128.0" width="109.0" data-name="repository-a"></rect>
											<path d="M0.0 32.0 L109.0 32.0" fill="none" data-name="repository-a"></path>
											<path d="M0.0 64.0 L109.0 64.0" fill="none" data-name="repository-a"></path>
											<path d="M0.0 96.0 L109.0 96.0" fill="none" data-name="repository-a"></path>
										</g>
										<g transform="translate(0, 0)" font-family="Helvetica" font-size="12pt" font-weight="bold" font-style="normal" data-name="repository-a">
											<g transform="translate(8, 8)" fill="#33322E" text-align="center" data-name="repository-a">
												<text x="46.5" y="14.1" stroke="none" text-anchor="middle" data-name="repository-a">repository-a</text>
												
											</g>
										</g>
										<g transform="translate(0, 32)" font-family="Helvetica" font-size="12pt" font-weight="normal" font-style="normal" data-name="repository-a">
											<g transform="translate(8, 8)" fill="#33322E" text-align="left" data-name="repository-a">
												<text x="0.0" y="14.1" stroke="none" data-name="repository-a">main</text>
												
											</g>
										</g>
										<g transform="translate(0, 64)" font-family="Helvetica" font-size="12pt" font-weight="normal" font-style="normal" data-name="repository-a">
											<g transform="translate(8, 8)" fill="#33322E" text-align="left" data-name="repository-a">
												<text x="0.0" y="14.1" stroke="none" data-name="repository-a">1.0</text>
												
											</g>
										</g>
										<g transform="translate(0, 96)" font-family="Helvetica" font-size="12pt" font-weight="normal" font-style="normal" data-name="repository-a">
											<g transform="translate(8, 8)" fill="#33322E" text-align="left" data-name="repository-a">
												<text x="0.0" y="14.1" stroke="none" data-name="repository-a">1.1</text>
												
											</g>
										</g>
									</g>
								</g>
							</g>
						</g>
					</g>
					<g data-name="Git Host B">
						<g fill="#eee8d5" stroke="#33322E" data-name="Git Host B">
							<rect x="247.0" y="16.0" height="184.0" width="166.0" data-name="Git Host B"></rect>
							<path d="M247.0 48.0 L413.0 48.0" fill="none" data-name="Git Host B"></path>
						</g>
						<g transform="translate(247, 16)" font-family="Helvetica" font-size="12pt" font-weight="bold" font-style="normal" data-name="Git Host B">
							<g transform="translate(8, 8)" fill="#33322E" text-align="center" data-name="Git Host B">
								<text x="75.0" y="14.1" stroke="none" text-anchor="middle" data-name="Git Host B">Git Host B</text>
								
							</g>
						</g>
						<g transform="translate(247, 48)" font-family="Helvetica" font-size="12pt" font-weight="normal" font-style="normal" data-name="Git Host B">
							<g transform="translate(8, 8)" fill="#33322E" data-name="Git Host B">
								<g transform="translate(20, 20)" data-name="Git Host B">
									<g data-name="repository-b">
										<g fill="#fdf6e3" stroke="#33322E" data-name="repository-b">
											<rect x="0.0" y="0.0" height="96.0" width="110.0" data-name="repository-b"></rect>
											<path d="M0.0 32.0 L110.0 32.0" fill="none" data-name="repository-b"></path>
											<path d="M0.0 64.0 L110.0 64.0" fill="none" data-name="repository-b"></path>
										</g>
										<g transform="translate(0, 0)" font-family="Helvetica" font-size="12pt" font-weight="bold" font-style="normal" data-name="repository-b">
											<g transform="translate(8, 8)" fill="#33322E" text-align="center" data-name="repository-b">
												<text x="47.0" y="14.1" stroke="none" text-anchor="middle" data-name="repository-b">repository-b</text>
												
											</g>
										</g>
										<g transform="translate(0, 32)" font-family="Helvetica" font-size="12pt" font-weight="normal" font-style="normal" data-name="repository-b">
											<g transform="translate(8, 8)" fill="#33322E" text-align="left" data-name="repository-b">
												<text x="0.0" y="14.1" stroke="none" data-name="repository-b">main</text>
												
											</g>
										</g>
										<g transform="translate(0, 64)" font-family="Helvetica" font-size="12pt" font-weight="normal" font-style="normal" data-name="repository-b">
											<g transform="translate(8, 8)" fill="#33322E" text-align="left" data-name="repository-b">
												<text x="0.0" y="14.1" stroke="none" data-name="repository-b">dev</text>
												
											</g>
										</g>
									</g>
								</g>
							</g>
						</g>
					</g>
					<g data-name="Internet Widget Co">
						<g fill="#eee8d5" stroke="#33322E" data-name="Internet Widget Co">
							<rect x="453.0" y="48.0" height="120.0" width="158.0" data-name="Internet Widget Co"></rect>
							<path d="M453.0 80.0 L611.0 80.0" fill="none" data-name="Internet Widget Co"></path>
						</g>
						<g transform="translate(453, 48)" font-family="Helvetica" font-size="12pt" font-weight="bold" font-style="normal" data-name="Internet Widget Co">
							<g transform="translate(8, 8)" fill="#33322E" text-align="center" data-name="Internet Widget Co">
								<text x="71.0" y="14.1" stroke="none" text-anchor="middle" data-name="Internet Widget Co">Internet Widget Co</text>
								
							</g>
						</g>
						<g transform="translate(453, 80)" font-family="Helvetica" font-size="12pt" font-weight="normal" font-style="normal" data-name="Internet Widget Co">
							<g transform="translate(8, 8)" fill="#33322E" data-name="Internet Widget Co">
								<g transform="translate(20, 20)" data-name="Internet Widget Co">
									<g data-name="file-c.tar.gz">
										<g fill="#fdf6e3" stroke="#33322E" data-name="file-c.tar.gz">
											<rect x="0.0" y="0.0" height="32.0" width="100.0" data-name="file-c.tar.gz"></rect>
										</g>
										<g transform="translate(0, 0)" font-family="Helvetica" font-size="12pt" font-weight="bold" font-style="normal" data-name="file-c.tar.gz">
											<g transform="translate(8, 8)" fill="#33322E" text-align="center" data-name="file-c.tar.gz">
												<text x="42.0" y="14.1" stroke="none" text-anchor="middle" data-name="file-c.tar.gz">file-c.tar.gz</text>
												
											</g>
										</g>
									</g>
								</g>
							</g>
						</g>
					</g>
					<g data-name="Lorry">
						<g fill="#eee8d5" stroke="#33322E" data-name="Lorry">
							<rect x="0.0" y="256.0" height="592.0" width="660.0" data-name="Lorry"></rect>
							<path d="M0.0 288.0 L660.0 288.0" fill="none" data-name="Lorry"></path>
							<path d="M0.0 320.0 L660.0 320.0" fill="none" data-name="Lorry"></path>
							<path d="M0.0 352.0 L660.0 352.0" fill="none" data-name="Lorry"></path>
							<path d="M0.0 744.0 L660.0 744.0" fill="none" data-name="Lorry"></path>
						</g>
						<g transform="translate(0, 256)" font-family="Helvetica" font-size="12pt" font-weight="bold" font-style="normal" data-name="Lorry">
							<g transform="translate(8, 8)" fill="#33322E" text-align="center" data-name="Lorry">
								<text x="322.0" y="14.1" stroke="none" text-anchor="middle" data-name="Lorry">Lorry</text>
								
							</g>
						</g>
						<g transform="translate(0, 288)" font-family="Helvetica" font-size="12pt" font-weight="normal" font-style="normal" data-name="Lorry">
							<g transform="translate(8, 8)" fill="#33322E" text-align="left" data-name="Lorry">
								<text x="0.0" y="14.1" stroke="none" data-name="Lorry">HTTP User Interface</text>
								
							</g>
						</g>
						<g transform="translate(0, 320)" font-family="Helvetica" font-size="12pt" font-weight="normal" font-style="normal" data-name="Lorry">
							<g transform="translate(8, 8)" fill="#33322E" text-align="left" data-name="Lorry">
								<text x="0.0" y="14.1" stroke="none" data-name="Lorry">Prometheus Metrics</text>
								
							</g>
						</g>
						<g transform="translate(0, 352)" font-family="Helvetica" font-size="12pt" font-weight="normal" font-style="normal" data-name="Lorry">
							<g transform="translate(8, 8)" fill="#33322E" data-name="Lorry">
								<g transform="translate(20, 20)" data-name="Lorry">
									<g data-name="File System">
										<g fill="#fdf6e3" stroke="#33322E" data-name="File System">
											<rect x="0.0" y="0.0" height="336.0" width="604.0" data-name="File System"></rect>
											<path d="M0.0 32.0 L604.0 32.0" fill="none" data-name="File System"></path>
										</g>
										<g transform="translate(0, 0)" font-family="Helvetica" font-size="12pt" font-weight="bold" font-style="normal" data-name="File System">
											<g transform="translate(8, 8)" fill="#33322E" text-align="center" data-name="File System">
												<text x="294.0" y="14.1" stroke="none" text-anchor="middle" data-name="File System">File System</text>
												
											</g>
										</g>
										<g transform="translate(0, 32)" font-family="Helvetica" font-size="12pt" font-weight="normal" font-style="normal" data-name="File System">
											<g transform="translate(8, 8)" fill="#33322E" data-name="File System">
												<g transform="translate(20, 20)" data-name="File System">
													<g data-name="workspace-a">
														<g fill="#eee8d5" stroke="#33322E" data-name="workspace-a">
															<rect x="0.0" y="0.0" height="248.0" width="156.0" data-name="workspace-a"></rect>
															<path d="M0.0 32.0 L156.0 32.0" fill="none" data-name="workspace-a"></path>
															<path d="M0.0 152.0 L156.0 152.0" fill="none" data-name="workspace-a"></path>
														</g>
														<g transform="translate(0, 0)" font-family="Helvetica" font-size="12pt" font-weight="bold" font-style="normal" data-name="workspace-a">
															<g transform="translate(8, 8)" fill="#33322E" text-align="center" data-name="workspace-a">
																<text x="70.0" y="14.1" stroke="none" text-anchor="middle" data-name="workspace-a">workspace-a</text>
																
															</g>
														</g>
														<g transform="translate(0, 32)" font-family="Helvetica" font-size="12pt" font-weight="normal" font-style="normal" data-name="workspace-a">
															<g transform="translate(8, 8)" fill="#33322E" data-name="workspace-a">
																<g transform="translate(20, 20)" data-name="workspace-a">
																	<g data-name="Repository">
																		<g fill="#fdf6e3" stroke="#33322E" data-name="Repository">
																			<rect x="0.0" y="0.0" height="64.0" width="100.0" data-name="Repository"></rect>
																			<path d="M0.0 32.0 L100.0 32.0" fill="none" data-name="Repository"></path>
																		</g>
																		<g transform="translate(0, 0)" font-family="Helvetica" font-size="12pt" font-weight="bold" font-style="normal" data-name="Repository">
																			<g transform="translate(8, 8)" fill="#33322E" text-align="center" data-name="Repository">
																				<text x="42.0" y="14.1" stroke="none" text-anchor="middle" data-name="Repository">Repository</text>
																				
																			</g>
																		</g>
																		<g transform="translate(0, 32)" font-family="Helvetica" font-size="12pt" font-weight="normal" font-style="normal" data-name="Repository">
																			<g transform="translate(8, 8)" fill="#33322E" text-align="left" data-name="Repository">
																				<text x="0.0" y="14.1" stroke="none" data-name="Repository">repository-a</text>
																				
																			</g>
																		</g>
																	</g>
																</g>
															</g>
														</g>
														<g transform="translate(0, 152)" font-family="Helvetica" font-size="12pt" font-weight="normal" font-style="normal" data-name="workspace-a">
															<g transform="translate(8, 8)" fill="#33322E" data-name="workspace-a">
																<g transform="translate(20, 20)" data-name="workspace-a">
																	<g data-name="Raw Files">
																		<g fill="#fdf6e3" stroke="#33322E" data-name="Raw Files">
																			<rect x="0.0" y="0.0" height="40.0" width="90.0" data-name="Raw Files"></rect>
																			<path d="M0.0 32.0 L90.0 32.0" fill="none" data-name="Raw Files"></path>
																		</g>
																		<g transform="translate(0, 0)" font-family="Helvetica" font-size="12pt" font-weight="bold" font-style="normal" data-name="Raw Files">
																			<g transform="translate(8, 8)" fill="#33322E" text-align="center" data-name="Raw Files">
																				<text x="37.0" y="14.1" stroke="none" text-anchor="middle" data-name="Raw Files">Raw Files</text>
																				
																			</g>
																		</g>
																		<g transform="translate(0, 32)" font-family="Helvetica" font-size="12pt" font-weight="normal" font-style="normal" data-name="Raw Files">
																			<g transform="translate(8, 8)" fill="#33322E" data-name="Raw Files">
																				
																			</g>
																		</g>
																	</g>
																</g>
															</g>
														</g>
													</g>
													<g data-name="workspace-b">
														<g fill="#eee8d5" stroke="#33322E" data-name="workspace-b">
															<rect x="196.0" y="0.0" height="248.0" width="156.0" data-name="workspace-b"></rect>
															<path d="M196.0 32.0 L352.0 32.0" fill="none" data-name="workspace-b"></path>
															<path d="M196.0 152.0 L352.0 152.0" fill="none" data-name="workspace-b"></path>
														</g>
														<g transform="translate(196, 0)" font-family="Helvetica" font-size="12pt" font-weight="bold" font-style="normal" data-name="workspace-b">
															<g transform="translate(8, 8)" fill="#33322E" text-align="center" data-name="workspace-b">
																<text x="70.0" y="14.1" stroke="none" text-anchor="middle" data-name="workspace-b">workspace-b</text>
																
															</g>
														</g>
														<g transform="translate(196, 32)" font-family="Helvetica" font-size="12pt" font-weight="normal" font-style="normal" data-name="workspace-b">
															<g transform="translate(8, 8)" fill="#33322E" data-name="workspace-b">
																<g transform="translate(20, 20)" data-name="workspace-b">
																	<g data-name="Repository">
																		<g fill="#fdf6e3" stroke="#33322E" data-name="Repository">
																			<rect x="0.0" y="0.0" height="64.0" width="100.0" data-name="Repository"></rect>
																			<path d="M0.0 32.0 L100.0 32.0" fill="none" data-name="Repository"></path>
																		</g>
																		<g transform="translate(0, 0)" font-family="Helvetica" font-size="12pt" font-weight="bold" font-style="normal" data-name="Repository">
																			<g transform="translate(8, 8)" fill="#33322E" text-align="center" data-name="Repository">
																				<text x="42.0" y="14.1" stroke="none" text-anchor="middle" data-name="Repository">Repository</text>
																				
																			</g>
																		</g>
																		<g transform="translate(0, 32)" font-family="Helvetica" font-size="12pt" font-weight="normal" font-style="normal" data-name="Repository">
																			<g transform="translate(8, 8)" fill="#33322E" text-align="left" data-name="Repository">
																				<text x="0.0" y="14.1" stroke="none" data-name="Repository">repository-b</text>
																				
																			</g>
																		</g>
																	</g>
																</g>
															</g>
														</g>
														<g transform="translate(196, 152)" font-family="Helvetica" font-size="12pt" font-weight="normal" font-style="normal" data-name="workspace-b">
															<g transform="translate(8, 8)" fill="#33322E" data-name="workspace-b">
																<g transform="translate(20, 20)" data-name="workspace-b">
																	<g data-name="Raw Files">
																		<g fill="#fdf6e3" stroke="#33322E" data-name="Raw Files">
																			<rect x="0.0" y="0.0" height="40.0" width="90.0" data-name="Raw Files"></rect>
																			<path d="M0.0 32.0 L90.0 32.0" fill="none" data-name="Raw Files"></path>
																		</g>
																		<g transform="translate(0, 0)" font-family="Helvetica" font-size="12pt" font-weight="bold" font-style="normal" data-name="Raw Files">
																			<g transform="translate(8, 8)" fill="#33322E" text-align="center" data-name="Raw Files">
																				<text x="37.0" y="14.1" stroke="none" text-anchor="middle" data-name="Raw Files">Raw Files</text>
																				
																			</g>
																		</g>
																		<g transform="translate(0, 32)" font-family="Helvetica" font-size="12pt" font-weight="normal" font-style="normal" data-name="Raw Files">
																			<g transform="translate(8, 8)" fill="#33322E" data-name="Raw Files">
																				
																			</g>
																		</g>
																	</g>
																</g>
															</g>
														</g>
													</g>
													<g data-name="workspace-c">
														<g fill="#eee8d5" stroke="#33322E" data-name="workspace-c">
															<rect x="392.0" y="0.0" height="248.0" width="156.0" data-name="workspace-c"></rect>
															<path d="M392.0 32.0 L548.0 32.0" fill="none" data-name="workspace-c"></path>
															<path d="M392.0 128.0 L548.0 128.0" fill="none" data-name="workspace-c"></path>
														</g>
														<g transform="translate(392, 0)" font-family="Helvetica" font-size="12pt" font-weight="bold" font-style="normal" data-name="workspace-c">
															<g transform="translate(8, 8)" fill="#33322E" text-align="center" data-name="workspace-c">
																<text x="70.0" y="14.1" stroke="none" text-anchor="middle" data-name="workspace-c">workspace-c</text>
																
															</g>
														</g>
														<g transform="translate(392, 32)" font-family="Helvetica" font-size="12pt" font-weight="normal" font-style="normal" data-name="workspace-c">
															<g transform="translate(8, 8)" fill="#33322E" data-name="workspace-c">
																<g transform="translate(20, 20)" data-name="workspace-c">
																	<g data-name="Repository">
																		<g fill="#fdf6e3" stroke="#33322E" data-name="Repository">
																			<rect x="0.0" y="0.0" height="40.0" width="100.0" data-name="Repository"></rect>
																			<path d="M0.0 32.0 L100.0 32.0" fill="none" data-name="Repository"></path>
																		</g>
																		<g transform="translate(0, 0)" font-family="Helvetica" font-size="12pt" font-weight="bold" font-style="normal" data-name="Repository">
																			<g transform="translate(8, 8)" fill="#33322E" text-align="center" data-name="Repository">
																				<text x="42.0" y="14.1" stroke="none" text-anchor="middle" data-name="Repository">Repository</text>
																				
																			</g>
																		</g>
																		<g transform="translate(0, 32)" font-family="Helvetica" font-size="12pt" font-weight="normal" font-style="normal" data-name="Repository">
																			<g transform="translate(8, 8)" fill="#33322E" data-name="Repository">
																				
																			</g>
																		</g>
																	</g>
																</g>
															</g>
														</g>
														<g transform="translate(392, 128)" font-family="Helvetica" font-size="12pt" font-weight="normal" font-style="normal" data-name="workspace-c">
															<g transform="translate(8, 8)" fill="#33322E" data-name="workspace-c">
																<g transform="translate(20, 20)" data-name="workspace-c">
																	<g data-name="Raw Files">
																		<g fill="#fdf6e3" stroke="#33322E" data-name="Raw Files">
																			<rect x="0.0" y="0.0" height="64.0" width="93.0" data-name="Raw Files"></rect>
																			<path d="M0.0 32.0 L93.0 32.0" fill="none" data-name="Raw Files"></path>
																		</g>
																		<g transform="translate(0, 0)" font-family="Helvetica" font-size="12pt" font-weight="bold" font-style="normal" data-name="Raw Files">
																			<g transform="translate(8, 8)" fill="#33322E" text-align="center" data-name="Raw Files">
																				<text x="38.5" y="14.1" stroke="none" text-anchor="middle" data-name="Raw Files">Raw Files</text>
																				
																			</g>
																		</g>
																		<g transform="translate(0, 32)" font-family="Helvetica" font-size="12pt" font-weight="normal" font-style="normal" data-name="Raw Files">
																			<g transform="translate(8, 8)" fill="#33322E" text-align="left" data-name="Raw Files">
																				<text x="0.0" y="14.1" stroke="none" data-name="Raw Files">file-c.tar.gz</text>
																				
																			</g>
																		</g>
																	</g>
																</g>
															</g>
														</g>
													</g>
												</g>
											</g>
										</g>
									</g>
								</g>
							</g>
						</g>
						<g transform="translate(0, 744)" font-family="Helvetica" font-size="12pt" font-weight="normal" font-style="normal" data-name="Lorry">
							<g transform="translate(8, 8)" fill="#33322E" data-name="Lorry">
								<g transform="translate(20, 20)" data-name="Lorry">
									<g data-name="Metadata Store">
										<g fill="#fdf6e3" stroke="#33322E" data-name="Metadata Store">
											<rect x="0.0" y="8.0" height="32.0" width="131.0" stroke="none" data-name="Metadata Store"></rect>
											<path d="M0.0 8.0 L0.0 40.0" fill="none" data-name="Metadata Store"></path>
											<path d="M131.0 8.0 L131.0 40.0" fill="none" data-name="Metadata Store"></path>
											<ellipse cx="65.5" cy="8.0" rx="65.5" ry="6.0" data-name="Metadata Store"></ellipse>
											<path d="M131.0 40.0 L130.9 40.3 L130.7 40.6 L130.3 40.9 L129.7 41.2 L129.0 41.5 L128.1 41.8 L127.0 42.1 L125.9 42.3 L124.5 42.6 L123.0 42.9 L121.4 43.1 L119.6 43.4 L117.7 43.6 L115.7 43.9 L113.5 44.1 L111.2 44.3 L108.8 44.5 L106.3 44.7 L103.7 44.9 L101.0 45.0 L98.2 45.2 L95.4 45.3 L92.4 45.5 L89.4 45.6 L86.4 45.7 L83.2 45.8 L80.1 45.8 L76.9 45.9 L73.6 46.0 L70.4 46.0 L67.1 46.0 L63.9 46.0 L60.6 46.0 L57.4 46.0 L54.1 45.9 L50.9 45.8 L47.8 45.8 L44.6 45.7 L41.6 45.6 L38.6 45.5 L35.6 45.3 L32.7 45.2 L30.0 45.0 L27.3 44.9 L24.7 44.7 L22.2 44.5 L19.8 44.3 L17.5 44.1 L15.3 43.9 L13.3 43.6 L11.4 43.4 L9.6 43.1 L8.0 42.9 L6.5 42.6 L5.1 42.3 L3.9 42.1 L2.9 41.8 L2.0 41.5 L1.3 41.2 L0.7 40.9 L0.3 40.6 L0.1 40.3 L0.0 40.0" data-name="Metadata Store"></path>
										</g>
										<g transform="translate(0, 12)" font-family="Helvetica" font-size="12pt" font-weight="bold" font-style="normal" data-name="Metadata Store">
											<g transform="translate(8, 8)" fill="#33322E" text-align="center" data-name="Metadata Store">
												<text x="57.5" y="14.1" stroke="none" text-anchor="middle" data-name="Metadata Store">Metadata Store</text>
												
											</g>
										</g>
									</g>
								</g>
							</g>
						</g>
					</g>
					<g data-name="&quot;Downstream&quot; Git Host">
						<g fill="#eee8d5" stroke="#33322E" data-name="&quot;Downstream&quot; Git Host">
							<rect x="172.5" y="888.0" height="344.0" width="315.0" data-name="&quot;Downstream&quot; Git Host"></rect>
							<path d="M172.5 920.0 L487.5 920.0" fill="none" data-name="&quot;Downstream&quot; Git Host"></path>
							<path d="M172.5 1104.0 L487.5 1104.0" fill="none" data-name="&quot;Downstream&quot; Git Host"></path>
							<path d="M172.5 1224.0 L487.5 1224.0" fill="none" data-name="&quot;Downstream&quot; Git Host"></path>
						</g>
						<g transform="translate(172.5, 888)" font-family="Helvetica" font-size="12pt" font-weight="bold" font-style="normal" data-name="&quot;Downstream&quot; Git Host">
							<g transform="translate(8, 8)" fill="#33322E" text-align="center" data-name="&quot;Downstream&quot; Git Host">
								<text x="149.5" y="14.1" stroke="none" text-anchor="middle" data-name="&quot;Downstream&quot; Git Host">&quot;Downstream&quot; Git Host</text>
								
							</g>
						</g>
						<g transform="translate(172.5, 920)" font-family="Helvetica" font-size="12pt" font-weight="normal" font-style="normal" data-name="&quot;Downstream&quot; Git Host">
							<g transform="translate(8, 8)" fill="#33322E" data-name="&quot;Downstream&quot; Git Host">
								<g transform="translate(20, 20)" data-name="&quot;Downstream&quot; Git Host">
									<g data-name="repository-a">
										<g fill="#fdf6e3" stroke="#33322E" data-name="repository-a">
											<rect x="0.0" y="0.0" height="128.0" width="109.0" data-name="repository-a"></rect>
											<path d="M0.0 32.0 L109.0 32.0" fill="none" data-name="repository-a"></path>
											<path d="M0.0 64.0 L109.0 64.0" fill="none" data-name="repository-a"></path>
											<path d="M0.0 96.0 L109.0 96.0" fill="none" data-name="repository-a"></path>
										</g>
										<g transform="translate(0, 0)" font-family="Helvetica" font-size="12pt" font-weight="bold" font-style="normal" data-name="repository-a">
											<g transform="translate(8, 8)" fill="#33322E" text-align="center" data-name="repository-a">
												<text x="46.5" y="14.1" stroke="none" text-anchor="middle" data-name="repository-a">repository-a</text>
												
											</g>
										</g>
										<g transform="translate(0, 32)" font-family="Helvetica" font-size="12pt" font-weight="normal" font-style="normal" data-name="repository-a">
											<g transform="translate(8, 8)" fill="#33322E" text-align="left" data-name="repository-a">
												<text x="0.0" y="14.1" stroke="none" data-name="repository-a">main</text>
												
											</g>
										</g>
										<g transform="translate(0, 64)" font-family="Helvetica" font-size="12pt" font-weight="normal" font-style="normal" data-name="repository-a">
											<g transform="translate(8, 8)" fill="#33322E" text-align="left" data-name="repository-a">
												<text x="0.0" y="14.1" stroke="none" data-name="repository-a">1.0</text>
												
											</g>
										</g>
										<g transform="translate(0, 96)" font-family="Helvetica" font-size="12pt" font-weight="normal" font-style="normal" data-name="repository-a">
											<g transform="translate(8, 8)" fill="#33322E" text-align="left" data-name="repository-a">
												<text x="0.0" y="14.1" stroke="none" data-name="repository-a">1.1</text>
												
											</g>
										</g>
									</g>
									<g data-name="repository-b">
										<g fill="#fdf6e3" stroke="#33322E" data-name="repository-b">
											<rect x="149.0" y="16.0" height="96.0" width="110.0" data-name="repository-b"></rect>
											<path d="M149.0 48.0 L259.0 48.0" fill="none" data-name="repository-b"></path>
											<path d="M149.0 80.0 L259.0 80.0" fill="none" data-name="repository-b"></path>
										</g>
										<g transform="translate(149, 16)" font-family="Helvetica" font-size="12pt" font-weight="bold" font-style="normal" data-name="repository-b">
											<g transform="translate(8, 8)" fill="#33322E" text-align="center" data-name="repository-b">
												<text x="47.0" y="14.1" stroke="none" text-anchor="middle" data-name="repository-b">repository-b</text>
												
											</g>
										</g>
										<g transform="translate(149, 48)" font-family="Helvetica" font-size="12pt" font-weight="normal" font-style="normal" data-name="repository-b">
											<g transform="translate(8, 8)" fill="#33322E" text-align="left" data-name="repository-b">
												<text x="0.0" y="14.1" stroke="none" data-name="repository-b">main</text>
												
											</g>
										</g>
										<g transform="translate(149, 80)" font-family="Helvetica" font-size="12pt" font-weight="normal" font-style="normal" data-name="repository-b">
											<g transform="translate(8, 8)" fill="#33322E" text-align="left" data-name="repository-b">
												<text x="0.0" y="14.1" stroke="none" data-name="repository-b">dev</text>
												
											</g>
										</g>
									</g>
								</g>
							</g>
						</g>
						<g transform="translate(172.5, 1104)" font-family="Helvetica" font-size="12pt" font-weight="normal" font-style="normal" data-name="&quot;Downstream&quot; Git Host">
							<g transform="translate(8, 8)" fill="#33322E" data-name="&quot;Downstream&quot; Git Host">
								<g transform="translate(20, 20)" data-name="&quot;Downstream&quot; Git Host">
									<g data-name="internet-widget-co (LFS)">
										<g fill="#fdf6e3" stroke="#33322E" data-name="internet-widget-co (LFS)">
											<rect x="0.0" y="0.0" height="64.0" width="200.0" data-name="internet-widget-co (LFS)"></rect>
											<path d="M0.0 32.0 L200.0 32.0" fill="none" data-name="internet-widget-co (LFS)"></path>
										</g>
										<g transform="translate(0, 0)" font-family="Helvetica" font-size="12pt" font-weight="bold" font-style="normal" data-name="internet-widget-co (LFS)">
											<g transform="translate(8, 8)" fill="#33322E" text-align="center" data-name="internet-widget-co (LFS)">
												<text x="92.0" y="14.1" stroke="none" text-anchor="middle" data-name="internet-widget-co (LFS)">internet-widget-co (LFS)</text>
												
											</g>
										</g>
										<g transform="translate(0, 32)" font-family="Helvetica" font-size="12pt" font-weight="normal" font-style="normal" data-name="internet-widget-co (LFS)">
											<g transform="translate(8, 8)" fill="#33322E" text-align="left" data-name="internet-widget-co (LFS)">
												<text x="0.0" y="14.1" stroke="none" data-name="internet-widget-co (LFS)">file-c.tar.gz</text>
												
											</g>
										</g>
									</g>
								</g>
							</g>
						</g>
						<g transform="translate(172.5, 1224)" font-family="Helvetica" font-size="12pt" font-weight="normal" font-style="normal" data-name="&quot;Downstream&quot; Git Host">
							<g transform="translate(8, 8)" fill="#33322E" data-name="&quot;Downstream&quot; Git Host">
								
							</g>
						</g>
					</g>
				</g>
			</g>
		</g>
	</g>
</svg>