{
  "db_name": "SQLite",
  "query": "SELECT COUNT(*) AS count FROM jobs WHERE path = ?",
  "describe": {
    "columns": [
      {
        "name": "count",
        "ordinal": 0,
        "type_info": "Int"
      }
    ],
    "parameters": {
      "Right": 1
    },
    "nullable": [
      false
    ]
  },
  "hash": "3735a21eb58c77aaea40fc4a70a1938b5f47f96a855c4668b57d5ed46988599a"
}
