{
  "db_name": "SQLite",
  "query": "SELECT COUNT(*) AS count FROM lorries WHERE last_run_exit != 0",
  "describe": {
    "columns": [
      {
        "name": "count",
        "ordinal": 0,
        "type_info": "Int"
      }
    ],
    "parameters": {
      "Right": 0
    },
    "nullable": [
      false
    ]
  },
  "hash": "c88a5e572730a3ef7fa80ae30b329990cd102dad380d81cf2dc83e488ed2b104"
}
