Mirror of git-backup-test-repo failed, state before mirror is saved at DATADIR/work-dir/git-backup-test-repo/git-a and state after mirror is saved at DATADIR/work-dir/git-backup-test-repo/git-post-fail-DATETIME
DATADIR/work-dir/git-backup-test-repo
DATADIR/work-dir/git-backup-test-repo/git-a
DATADIR/work-dir/git-backup-test-repo/git-a/FETCH_HEAD
DATADIR/work-dir/git-backup-test-repo/git-a/HEAD
DATADIR/work-dir/git-backup-test-repo/git-a/branches
DATADIR/work-dir/git-backup-test-repo/git-a/config
DATADIR/work-dir/git-backup-test-repo/git-a/description
DATADIR/work-dir/git-backup-test-repo/git-a/hooks
DATADIR/work-dir/git-backup-test-repo/git-a/info
DATADIR/work-dir/git-backup-test-repo/git-a/info/exclude
DATADIR/work-dir/git-backup-test-repo/git-a/info/refs
DATADIR/work-dir/git-backup-test-repo/git-a/lorry-update-count
DATADIR/work-dir/git-backup-test-repo/git-a/objects
DATADIR/work-dir/git-backup-test-repo/git-a/objects/info
DATADIR/work-dir/git-backup-test-repo/git-a/objects/info/packs
DATADIR/work-dir/git-backup-test-repo/git-a/objects/pack
DATADIR/work-dir/git-backup-test-repo/git-a/objects/pack/pack-file
DATADIR/work-dir/git-backup-test-repo/git-a/objects/pack/pack-file
DATADIR/work-dir/git-backup-test-repo/git-a/packed-refs
DATADIR/work-dir/git-backup-test-repo/git-a/refs
DATADIR/work-dir/git-backup-test-repo/git-a/refs/heads
DATADIR/work-dir/git-backup-test-repo/git-a/refs/tags
DATADIR/work-dir/git-backup-test-repo/git-post-fail-DATETIME
DATADIR/work-dir/git-backup-test-repo/git-post-fail-DATETIME/FETCH_HEAD
DATADIR/work-dir/git-backup-test-repo/git-post-fail-DATETIME/HEAD
DATADIR/work-dir/git-backup-test-repo/git-post-fail-DATETIME/branches
DATADIR/work-dir/git-backup-test-repo/git-post-fail-DATETIME/config
DATADIR/work-dir/git-backup-test-repo/git-post-fail-DATETIME/description
DATADIR/work-dir/git-backup-test-repo/git-post-fail-DATETIME/hooks
DATADIR/work-dir/git-backup-test-repo/git-post-fail-DATETIME/info
DATADIR/work-dir/git-backup-test-repo/git-post-fail-DATETIME/info/exclude
DATADIR/work-dir/git-backup-test-repo/git-post-fail-DATETIME/info/refs
DATADIR/work-dir/git-backup-test-repo/git-post-fail-DATETIME/objects
DATADIR/work-dir/git-backup-test-repo/git-post-fail-DATETIME/objects/info
DATADIR/work-dir/git-backup-test-repo/git-post-fail-DATETIME/objects/info/packs
DATADIR/work-dir/git-backup-test-repo/git-post-fail-DATETIME/objects/pack
DATADIR/work-dir/git-backup-test-repo/git-post-fail-DATETIME/objects/pack/pack-file
DATADIR/work-dir/git-backup-test-repo/git-post-fail-DATETIME/objects/pack/pack-file
DATADIR/work-dir/git-backup-test-repo/git-post-fail-DATETIME/packed-refs
DATADIR/work-dir/git-backup-test-repo/git-post-fail-DATETIME/refs
DATADIR/work-dir/git-backup-test-repo/git-post-fail-DATETIME/refs/heads
DATADIR/work-dir/git-backup-test-repo/git-post-fail-DATETIME/refs/tags
DATADIR/work-dir/git-backup-test-repo/git-a/lorry-update-count:1
