100644 blob c68466a6567c3d8be444d1dc89223ef97036b420	.gitattributes
100644 blob 337a22092095bde29dd4808f2a91d447dfc4ab71	file.txt
100644 blob c68466a6567c3d8be444d1dc89223ef97036b420	.gitattributes
100644 blob ff4a2abd8fb4d2fe4df3e0b7d1cb1098bcb563f4	file.txt
