// Jest Snapshot v1, https://goo.gl/fbAQLP

exports[`UnmarkedWsNoticeViewContainer renders normally 1`] = `
<div
  class="pageContent noticeView"
>
  <div
    class="fullWidth"
  >
    <h2
      class="text standard h2 xl normalWeight pageTitle"
    >
      NOSTOJÄRJESTYSILMOITUS
    </h2>
  </div>
  <div
    class="actions"
  >
    <div
      class="noticeStatus"
    >
      <h2
        class="text standard h2 xl normalWeight"
      >
        Ilmoitus 06.05.2019
      </h2>
      <span
        class="StatusLabel-module_statusLabel__3R2J2 status-label_hds-status-label__1L8YI StatusLabel-module_info__3YrAe status-label_hds-status-label--info__J28-H"
      >
        Käsitelty
      </span>
    </div>
    <div
      class="actionsRight"
    >
      <button
        class="Button-module_button__3wgee button_hds-button__2A0je Button-module_secondary__399Vd button_hds-button--secondary__1NOWS Button-module_theme-coat__2xA5D button_hds-button--theme-coat__12cO0"
        type="button"
      >
        <span
          class="Button-module_label__2zMLC button_hds-button__label__2EQa-"
        >
          Poista ilmoitus
        </span>
      </button>
    </div>
  </div>
  <div
    class="fullWidth"
  >
    <section
      aria-atomic="true"
      aria-label="Notification"
      class="Notification-module_notification__2hN3H notification_hds-notification__2DQPN Notification-module_alert__1Erry notification_hds-notification--alert__1MV7H"
    >
      <div
        class="Notification-module_content__ZZKvE notification_hds-notification__content__5ylSS"
      >
        <div
          aria-level="2"
          class="Notification-module_label__1bhNu notification_hds-notification__label__2t1lR"
          role="heading"
        >
          <svg
            class="Icon-module_icon__1Jtzj icon_hds-icon__1YqNC Icon-module_s__2WGWe icon_hds-icon--size-s__2Lkik Notification-module_icon__1ans7 notification_hds-icon__29HQM"
            role="img"
            viewBox="0 0 24 24"
            xmlns="http://www.w3.org/2000/svg"
          >
            <g
              fill="none"
              fill-rule="evenodd"
            >
              <path
                d="M0 0h24v24H0z"
              />
              <path
                d="M12 2c5.523 0 10 4.477 10 10s-4.477 10-10 10S2 17.523 2 12 6.477 2 12 2zm0 2a8 8 0 100 16 8 8 0 000-16zm1 12v2h-2v-2h2zm0-10v8h-2V6h2z"
                fill="currentColor"
              />
            </g>
          </svg>
          Hakemusta ei ole liitetty mihinkään asiakkaaseen
        </div>
        <div
          class="Notification-module_body__9BSAD notification_hds-notification__body__3cobH"
        >
          Liitä hakemus olemassa olevaan asiakasprofiiliin tai luo uusi asiakasprofiili hakemuksen tiedoilla.
        </div>
      </div>
    </section>
  </div>
  <div
    class="fullWidth"
  >
    <div
      class="customersTableTools"
    >
      <div
        class="Dropdown-module_root__3ro8_ select select"
      >
        <div
          class="Dropdown-module_wrapper__1sFxz"
        >
          <button
            aria-expanded="false"
            aria-haspopup="listbox"
            aria-labelledby="hds-label hds-toggle-button"
            class="Dropdown-module_buttonDropdown__2xA1D Dropdown-module_dropdown__34HBV"
            id="hds-toggle-button"
            type="button"
          >
            <span
              class="Dropdown-module_buttonLabel__3y4eg"
            >
              Sähköposti
            </span>
            <svg
              class="Icon-module_icon__1Jtzj icon_hds-icon__1YqNC Icon-module_s__2WGWe icon_hds-icon--size-s__2Lkik Dropdown-module_angleIcon__3-f8N"
              role="img"
              viewBox="0 0 24 24"
              xmlns="http://www.w3.org/2000/svg"
            >
              <g
                fill="none"
                fill-rule="evenodd"
              >
                <path
                  d="M0 0h24v24H0z"
                />
                <path
                  d="M12 13.5l5-5 1.5 1.5-6.5 6.5L5.5 10 7 8.5z"
                  fill="currentColor"
                />
              </g>
            </svg>
          </button>
        </div>
        <ul
          aria-labelledby="hds-label"
          class="Dropdown-module_menu__3xwA0"
          id="hds-menu"
          role="listbox"
          style="max-height: calc(var(--dropdown-height) * 5);"
          tabindex="-1"
        />
      </div>
      <div
        class="TextInput-module_root__2CMNr text-input_hds-text-input__2LODq searchInput"
      >
        <div
          class="TextInput-module_inputWrapper__3Rvel text-input_hds-text-input__input-wrapper__1OqYG"
        >
          <input
            class="TextInput-module_input__1BlHi text-input_hds-text-input__input__GJm5C"
            id="searchSimilarCustomers"
            type="text"
            value="test@test.com"
          />
        </div>
      </div>
      <button
        class="Button-module_button__3wgee button_hds-button__2A0je Button-module_primary__3bo_T button_hds-button--primary__2NVvO Button-module_theme-coat__2xA5D button_hds-button--theme-coat__12cO0"
        disabled=""
        type="button"
      >
        <span
          class="Button-module_label__2zMLC button_hds-button__label__2EQa-"
        >
          Liitä valittuun
        </span>
      </button>
      <button
        class="Button-module_button__3wgee button_hds-button__2A0je Button-module_secondary__399Vd button_hds-button--secondary__1NOWS Button-module_theme-coat__2xA5D button_hds-button--theme-coat__12cO0"
        type="button"
      >
        <span
          class="Button-module_label__2zMLC button_hds-button__label__2EQa-"
        >
          Luo uusi asiakas
        </span>
      </button>
    </div>
    <div
      class="tableWrapper"
    >
      <div
        class="table primary"
        role="table"
        style="min-width: 75px;"
      >
        <div
          class="stickyHeaders"
        >
          <div
            class="header mainHeader"
            role="row"
            style="display: flex; flex: 1 0 auto; min-width: 75px;"
          >
            <div
              class="headerCell"
              colspan="7"
              role="columnheader"
              style="box-sizing: border-box; flex: 975 0 auto; min-width: 75px; width: 975px;"
            >
              LIITÄ HAKEMUS OLEMASSA OLEVAAN ASIAKASPROFIILIIN
            </div>
          </div>
          <div
            class="header"
            role="row"
            style="display: flex; flex: 1 0 auto; min-width: 75px;"
          >
            <div
              class="headerCell radioSelector"
              colspan="1"
              role="columnheader"
              style="box-sizing: border-box; flex: 75 0 auto; min-width: 75px; width: 75px;"
            >
               
            </div>
            <div
              class="headerCell"
              colspan="1"
              role="columnheader"
              style="box-sizing: border-box; flex: 150 0 auto; min-width: 0px; width: 150px; cursor: pointer;"
              title="Toggle SortBy"
            >
              Nimi
              <div
                class="sortArrowWrapper"
              >
                <svg
                  class="Icon-module_icon__1Jtzj icon_hds-icon__1YqNC Icon-module_m__3edUY icon_hds-icon--size-m__1mcHv sortArrow sortArrowDown"
                  role="img"
                  viewBox="0 0 24 24"
                  xmlns="http://www.w3.org/2000/svg"
                >
                  <g
                    fill="none"
                    fill-rule="evenodd"
                  >
                    <path
                      d="M0 0h24v24H0z"
                    />
                    <path
                      d="M10 5.636l1.414 1.414L7.465 11H20v2H7.464l3.95 3.95L10 18.364 3.636 12z"
                      fill="currentColor"
                    />
                  </g>
                </svg>
              </div>
            </div>
            <div
              class="headerCell"
              colspan="1"
              role="columnheader"
              style="box-sizing: border-box; flex: 150 0 auto; min-width: 0px; width: 150px;"
            >
              Asiakasryhmä
            </div>
            <div
              class="headerCell"
              colspan="1"
              role="columnheader"
              style="box-sizing: border-box; flex: 150 0 auto; min-width: 0px; width: 150px;"
            >
              Kotikunta
            </div>
            <div
              class="headerCell"
              colspan="1"
              role="columnheader"
              style="box-sizing: border-box; flex: 150 0 auto; min-width: 0px; width: 150px;"
            >
              Jakeluosoite
            </div>
            <div
              class="headerCell"
              colspan="1"
              role="columnheader"
              style="box-sizing: border-box; flex: 150 0 auto; min-width: 0px; width: 150px;"
            >
              Venepaikat
            </div>
            <div
              class="headerCell"
              colspan="1"
              role="columnheader"
              style="box-sizing: border-box; flex: 150 0 auto; min-width: 0px; width: 150px;"
            >
              Talvisäilytyspaikat
            </div>
          </div>
        </div>
        <div
          role="rowgroup"
        >
          <div
            class="rowWrapper"
            role="row"
          >
            <div
              class="tableCell"
            >
              <div>
                Rajauksella ei löytynyt asiakastietoja
              </div>
            </div>
          </div>
        </div>
      </div>
    </div>
    <ul
      class="pagination fullWidth"
    >
      <li
        class="prevBtn disabled"
      >
        <a
          aria-disabled="true"
          class="navLink"
          role="button"
          tabindex="0"
        >
          <div
            class="icnBtn"
          >
            <svg
              class="Icon-module_icon__1Jtzj icon_hds-icon__1YqNC Icon-module_m__3edUY icon_hds-icon--size-m__1mcHv"
              role="img"
              viewBox="0 0 24 24"
              xmlns="http://www.w3.org/2000/svg"
            >
              <g
                fill="none"
                fill-rule="evenodd"
              >
                <path
                  d="M0 0h24v24H0z"
                />
                <path
                  d="M10 5.636l1.414 1.414L7.465 11H20v2H7.464l3.95 3.95L10 18.364 3.636 12z"
                  fill="currentColor"
                />
              </g>
            </svg>
            <span
              class="text standard span"
            >
              Edellinen
            </span>
          </div>
        </a>
      </li>
      <li
        class="pageBtn selected"
      >
        <a
          aria-current="page"
          aria-label="Page 1 is your current page"
          class="navLink pageLink active"
          role="button"
          tabindex="0"
        >
          1
        </a>
      </li>
      <li
        class="nextBtn disabled"
      >
        <a
          aria-disabled="true"
          class="navLink"
          role="button"
          tabindex="0"
        >
          <div
            class="icnBtn"
          >
            <span
              class="text standard span"
            >
              Seuraava
            </span>
            <svg
              class="Icon-module_icon__1Jtzj icon_hds-icon__1YqNC Icon-module_m__3edUY icon_hds-icon--size-m__1mcHv"
              role="img"
              viewBox="0 0 24 24"
              xmlns="http://www.w3.org/2000/svg"
            >
              <g
                fill="none"
                fill-rule="evenodd"
              >
                <path
                  d="M0 0h24v24H0z"
                />
                <path
                  d="M12.586 7.05L14 5.636 20.364 12 14 18.364l-1.414-1.414 3.95-3.95H4v-2h12.535z"
                  fill="currentColor"
                />
              </g>
            </svg>
          </div>
        </a>
      </li>
    </ul>
  </div>
  <div
    class="card fullWidth"
  >
    <div
      class="cardHeader"
    >
      <span
        class="title"
      >
        NOSTOJÄRJESTYSILMOITUS
      </span>
    </div>
    <div
      class="cardBody"
    >
      <div
        class="grid cols3"
      >
        <div>
          <article
            class="section"
          >
            <h4
              class="text standard h4 m title"
            >
              ILMOITUS
            </h4>
            <section
              class="body"
            >
              <div
                class="labelValuePair"
              >
                <span
                  class="label standard"
                >
                  Alue:
                </span>
                <span
                  class="value left"
                >
                  Iso-Sarvasto
                </span>
              </div>
              <div
                class="labelValuePair"
              >
                <span
                  class="label standard"
                >
                  Vastaanotettu:
                </span>
                <span
                  class="value left"
                >
                  06.05.2019 klo 10.54
                </span>
              </div>
              <div
                class="labelValuePair"
              >
                <span
                  class="label standard"
                >
                  Status:
                </span>
                <span
                  class="value left"
                >
                  Käsitelty
                </span>
              </div>
            </section>
          </article>
          <article
            class="section"
          >
            <h4
              class="text standard h4 m title"
            >
              OMISTAJAN TIEDOT
            </h4>
            <section
              class="body"
            >
              <div
                class="labelValuePair"
              >
                <span
                  class="label standard"
                >
                  Etunimet:
                </span>
                <span
                  class="value left"
                >
                  test
                </span>
              </div>
              <div
                class="labelValuePair"
              >
                <span
                  class="label standard"
                >
                  Sukunimi:
                </span>
                <span
                  class="value left"
                >
                  test
                </span>
              </div>
            </section>
          </article>
          <article
            class="section"
          >
            <section
              class="body"
            >
              <div
                class="labelValuePair"
              >
                <span
                  class="label standard"
                >
                  Jakeluosoite:
                </span>
                <span
                  class="value left"
                >
                  test
                </span>
              </div>
              <div
                class="labelValuePair"
              >
                <span
                  class="label standard"
                >
                  Postinumero:
                </span>
                <span
                  class="value left"
                >
                  00100
                </span>
              </div>
              <div
                class="labelValuePair"
              >
                <span
                  class="label standard"
                >
                  Postitoimipaikka:
                </span>
                <span
                  class="value left"
                >
                  helsinki
                </span>
              </div>
            </section>
          </article>
          <article
            class="section"
          >
            <section
              class="body"
            >
              <div
                class="labelValuePair"
              >
                <span
                  class="label standard"
                >
                  Matkapuhelin:
                </span>
                <span
                  class="value left"
                >
                  555555
                </span>
              </div>
              <div
                class="labelValuePair"
              >
                <span
                  class="label standard"
                >
                  Sähköpostiosoite:
                </span>
                <span
                  class="value left"
                >
                  test@test.com
                </span>
              </div>
            </section>
          </article>
          <article
            class="section"
          >
            <section
              class="body"
            >
              <div
                class="labelValuePair"
              >
                <span
                  class="label standard"
                >
                  Asiakasryhmä:
                </span>
                <span
                  class="value left"
                >
                  Yksityinen
                </span>
              </div>
              <div
                class="labelValuePair"
              >
                <span
                  class="label standard"
                >
                  Asiointikieli:
                </span>
                <span
                  class="value left"
                >
                  Englanti
                </span>
              </div>
            </section>
          </article>
          <article
            class="section"
          >
            <section
              class="body"
            >
              <div
                class="labelValuePair"
              >
                <span
                  class="label standard"
                >
                  Huomiot:
                </span>
                <span
                  class="value left"
                >
                  -
                </span>
              </div>
            </section>
          </article>
        </div>
        <div>
          <article
            class="section"
          >
            <h4
              class="text standard h4 m title"
            >
              VENEEN TIEDOT
            </h4>
            <section
              class="body"
            >
              <div
                class="labelValuePair"
              >
                <span
                  class="label standard"
                >
                  Veneen tyyppi:
                </span>
                <span
                  class="value left"
                >
                  Perämoottorivene
                </span>
              </div>
              <div
                class="labelValuePair"
              >
                <span
                  class="label standard"
                >
                  Rekisterinumero:
                </span>
                <span
                  class="value left"
                >
                  test
                </span>
              </div>
            </section>
          </article>
          <article
            class="section"
          >
            <section
              class="body"
            >
              <div
                class="labelValuePair"
              >
                <span
                  class="label standard"
                >
                  Veneen leveys:
                </span>
                <span
                  class="value left"
                >
                  1,0 m
                </span>
              </div>
              <div
                class="labelValuePair"
              >
                <span
                  class="label standard"
                >
                  Veneen pituus:
                </span>
                <span
                  class="value left"
                >
                  1,0 m
                </span>
              </div>
              <div
                class="labelValuePair"
              >
                <span
                  class="label standard"
                >
                  Veneen syväys:
                </span>
                <span
                  class="value left"
                >
                  -
                </span>
              </div>
              <div
                class="labelValuePair"
              >
                <span
                  class="label standard"
                >
                  Veneen paino:
                </span>
                <span
                  class="value left"
                >
                  -
                </span>
              </div>
            </section>
          </article>
          <article
            class="section"
          >
            <section
              class="body"
            >
              <div
                class="labelValuePair"
              >
                <span
                  class="label standard"
                >
                  Nimi:
                </span>
                <span
                  class="value left"
                >
                  test
                </span>
              </div>
              <div
                class="labelValuePair"
              >
                <span
                  class="label standard"
                >
                  Merkki:
                </span>
                <span
                  class="value left"
                >
                  test
                </span>
              </div>
            </section>
          </article>
          <article
            class="section"
          >
            <h4
              class="text standard h4 m title"
            >
              YHTEENVETO
            </h4>
            <section
              class="body"
            >
              <div>
                <span
                  class="text standard span"
                >
                  Tilaan uutiskirjeen
                </span>
              </div>
              <div>
                <span
                  class="text standard span"
                >
                  Tilaan tietoa liikuntapalveluista
                </span>
              </div>
              <div>
                <span
                  class="text standard span"
                >
                  Tilaan tietoa kirjastopalveluista
                </span>
              </div>
              <div>
                <span
                  class="text standard span"
                >
                  Tilaan tietoa muista kulttuuripalveluista
                </span>
              </div>
            </section>
          </article>
        </div>
        <div
          class="detailsActions"
        />
      </div>
    </div>
     
  </div>
</div>
`;
