// Jest Snapshot v1, https://goo.gl/fbAQLP

exports[`HarborCard renders normally 1`] = `
<div
  class="card card"
>
  <div
    class="cardHeader"
  >
    <span
      class="title"
    >
      SATAMA
    </span>
  </div>
  <div
    class="cardBody"
  >
    <div
      class="cardBody"
    >
      <div
        class="details"
      >
        <div
          class="imageWrapper"
        >
          <img
            alt="Kuva kohteesta"
            class="image"
            src="https://venepaikka-api.test.hel.ninja/media/harbors/9a8d8313-eaa2-47d2-8f2d-2bb9893f9bc7/41359.jpg"
          />
        </div>
        <div>
          <article
            class="section"
          >
            <section
              class="body"
            >
              <h2
                class="text standard h2 xxl"
              >
                Pajalahden venesatama (Meripuistotie) / Venesatama
              </h2>
              <span
                class="text standard span"
              >
                Meripuistotie 1a, 00210 Helsinki
              </span>
            </section>
          </article>
          <article
            class="section"
          >
            <section
              class="body"
            >
              <a
                class="link withArrow"
                href="https://palvelukartta.hel.fi/unit/41359"
                rel="noopener noreferrer"
                target="_blank"
              >
                Palvelukartta
                <svg
                  class="Icon-module_icon__1Jtzj icon_hds-icon__1YqNC Icon-module_m__3edUY icon_hds-icon--size-m__1mcHv arrow"
                  color="brand"
                  role="img"
                  viewBox="0 0 24 24"
                  xmlns="http://www.w3.org/2000/svg"
                >
                  <g
                    fill="none"
                    fill-rule="evenodd"
                  >
                    <path
                      d="M0 24V0h24v24z"
                    />
                    <path
                      d="M13 12.5l-5-5L9.5 6l6.5 6.5L9.5 19 8 17.5z"
                      fill="currentColor"
                    />
                  </g>
                </svg>
              </a>
            </section>
          </article>
          <article
            class="section"
          >
            <section
              class="body"
            >
              <div>
                <a
                  class="link withArrow"
                  href="testmap"
                  rel="noopener noreferrer"
                  target="_blank"
                >
                  Satamakartta (PDF)
                  <svg
                    class="Icon-module_icon__1Jtzj icon_hds-icon__1YqNC Icon-module_m__3edUY icon_hds-icon--size-m__1mcHv arrow"
                    color="brand"
                    role="img"
                    viewBox="0 0 24 24"
                    xmlns="http://www.w3.org/2000/svg"
                  >
                    <g
                      fill="none"
                      fill-rule="evenodd"
                    >
                      <path
                        d="M0 24V0h24v24z"
                      />
                      <path
                        d="M13 12.5l-5-5L9.5 6l6.5 6.5L9.5 19 8 17.5z"
                        fill="currentColor"
                      />
                    </g>
                  </svg>
                </a>
              </div>
            </section>
          </article>
        </div>
      </div>
      <div
        class="grid cols5 propsGrid"
      >
        <div />
        <div
          class="property"
        >
          <strong
            class="text standard strong xxxl"
          >
            4
          </strong>
          <span
            class="text standard span s bold label"
          >
            Paikkoja
          </span>
        </div>
        <div
          class="property"
        >
          <strong
            class="text standard strong xxxl"
          >
            2
          </strong>
          <span
            class="text standard span s bold label"
          >
            Vapaata
          </span>
        </div>
        <div
          class="property"
        >
          <strong
            class="text standard strong xxxl"
          >
            0
          </strong>
          <span
            class="text standard span s bold label"
          >
            Jonossa
          </span>
        </div>
        <div
          class="property"
        >
          <strong
            class="text standard strong xxxl"
          >
            4
          </strong>
          <span
            class="text standard span s bold label"
          >
            Max. leveys
          </span>
        </div>
        <div
          class="property"
        >
          <div
            class="iconWrapper standard outlined"
          >
            <svg
              class="Icon-module_icon__1Jtzj icon_hds-icon__1YqNC Icon-module_m__3edUY icon_hds-icon--size-m__1mcHv"
              role="img"
              viewBox="0 0 24 24"
              xmlns="http://www.w3.org/2000/svg"
            >
              <g
                fill="none"
                fill-rule="evenodd"
              >
                <path
                  d="M0 0h24v24H0z"
                />
                <path
                  d="M18 9H6l1.087 13h9.826L18 9zm-2.095 2l-.818 9H8.912l-.818-9h7.811zM12 2a2.97 2.97 0 012.995 2.82L15 5v1h3v2H6V6h3V5c0-1.688 1.331-3 3-3zm0 2c-.53 0-.938.365-.994.879L11 5v1h2V5c0-.577-.43-1-1-1z"
                  fill="currentColor"
                />
              </g>
            </svg>
          </div>
          <span
            class="text standard span s bold label"
          >
            Jätehuolto
          </span>
        </div>
        <div
          class="property"
        >
          <div
            class="iconWrapper standard outlined"
          >
            <svg
              class="icon m"
              height="100%"
              viewBox="0 0 480 480"
              width="100%"
              xmlns="http://www.w3.org/2000/svg"
            >
              <path
                d="M410.18 85l-62 46.23v60.5h-25v-60.44L262.1 85l-62 46.23v60.5h-25v-60.44L114 85l-62 46.22v332.17h123.16V383.5h25v79.89h123.09V383.5h25v79.89h123.08v-332.1zm-178.06 62.27L262 125l29.3 22.18v44.52h-59.18zm59.13 76.45V351.5h-59.13V223.72zM143.16 431.39H84V147.27L113.87 125l29.29 22.18v44.52h-41v32h41v127.8h-41v32h41zm32-79.89V223.72h25V351.5zm116.09 79.89h-59.13V383.5h59.13zm32-79.89V223.72h25V351.5zm116.08 79.89h-59.12V383.5h39v-32h-39V223.72h39v-32h-39v-44.45L410 125l29.29 22.18z"
              />
            </svg>
          </div>
          <span
            class="text standard span s bold label"
          >
            Portti
          </span>
        </div>
        <div
          class="property"
        >
          <div
            class="iconWrapper standard outlined"
          >
            <svg
              class="icon m"
              height="100%"
              viewBox="0 0 400 400"
              width="100%"
              xmlns="http://www.w3.org/2000/svg"
            >
              <path
                d="M159.86 380.84h42v74.41h-42zM327.33 142.77H262.1v-81h-32v81h-98.47v-81h-32v81H34.39v32H67v48.82a111.59 111.59 0 0 0 21.6 65.91 119.83 119.83 0 0 0 43.63 36.86v42.86h97.24v-42.5a113.69 113.69 0 0 0 65.23-103.13v-48.82h32.62zm-64.62 80.82c0 34.94-21.88 66-54.46 77.24l-10.77 3.72v32.67h-33.24V305L154 301c-32.91-12.8-55-43.92-55-77.45v-48.78h163.7z"
              />
            </svg>
          </div>
          <span
            class="text standard span s bold label"
          >
            Sähkö
          </span>
        </div>
        <div
          class="property"
        >
          <div
            class="iconWrapper standard outlined"
          >
            <svg
              class="icon m"
              height="100%"
              viewBox="0 0 480 480"
              width="100%"
              xmlns="http://www.w3.org/2000/svg"
            >
              <path
                d="M294.37 344.75h32v55.77h-32zM200.584 355.229l41.577-41.664 22.651 22.604-41.577 41.664zM362.922 336.221l22.65-22.604 41.577 41.664-22.65 22.604z"
              />
              <path
                d="M321.32 143.85h-.95v-71.3h-126.7a93.65 93.65 0 0 0-67.59 28.32C108.36 119 98.6 143.43 98.6 169.57V461h95.26v-32H130.6V169.57c0-36.46 27.71-65 63.07-65h94.7v39.3h-.94c-64.88 0-117.66 49.82-117.66 111.07v16h73.43a60.61 60.61 0 0 0 20.8 30.33c13.82 11.08 32.38 17.18 52.26 17.18s38.44-6.1 52.26-17.18a60.61 60.61 0 0 0 20.78-30.35H439v-16c0-61.25-52.8-111.07-117.68-111.07zm-5.08 142.6c-16.55 0-30.36-6.1-37.67-15.53h75.35c-7.32 9.43-21.13 15.53-37.68 15.53zm75.3-47.53h-188c8-36 42.6-63.07 83.9-63.07h33.89c41.3 0 75.87 27.11 83.9 63.07z"
              />
            </svg>
          </div>
          <span
            class="text standard span s bold label"
          >
            Valaistus
          </span>
        </div>
        <div
          class="property"
        >
          <div
            class="iconWrapper standard outlined"
          >
            <svg
              class="icon m"
              height="100%"
              viewBox="0 0 480 480"
              width="100%"
              xmlns="http://www.w3.org/2000/svg"
            >
              <path
                d="M154.61 313.9l-11.36-11.45-11.36 11.45a341.93 341.93 0 0 0-26.29 30.56c-18.95 25-28.16 45.16-28.16 61.73C77.44 425 84.87 442 98.37 454a68.35 68.35 0 0 0 89.76 0c13.5-12 20.94-29 20.94-47.81 0-16.57-9.21-36.76-28.16-61.73a341.09 341.09 0 0 0-26.3-30.56zm-11.36 124.9c-22.2 0-33.81-16.4-33.81-32.61 0-4.14 2.09-16.54 21.44-42.11 4.29-5.66 8.61-10.88 12.37-15.22 3.76 4.34 8.09 9.56 12.37 15.22 19.36 25.57 21.45 38 21.45 42.11 0 16.21-11.62 32.61-33.82 32.61zM341.91 158.33v-44h66.42v-32H243.49v32h66.42v44h-83.63c-57.36 0-104 45.76-104 102v21h42v-21c0-33.1 27.83-60 62-60h220.26v-42z"
              />
            </svg>
          </div>
          <span
            class="text standard span s bold label"
          >
            Vesi
          </span>
        </div>
      </div>
    </div>
  </div>
   
</div>
`;
