[
{
    "model": "harbors.boattypetranslation",
    "pk": 1,
    "fields": {
        "language_code": "fi",
        "name": "Jollavene",
        "master": 1
    }
},
{
    "model": "harbors.boattypetranslation",
    "pk": 2,
    "fields": {
        "language_code": "fi",
        "name": "Soutuvene",
        "master": 2
    }
},
{
    "model": "harbors.boattypetranslation",
    "pk": 3,
    "fields": {
        "language_code": "fi",
        "name": "Per\u00e4moottorivene",
        "master": 3
    }
},
{
    "model": "harbors.boattypetranslation",
    "pk": 4,
    "fields": {
        "language_code": "fi",
        "name": "Sis\u00e4per\u00e4moottorivene",
        "master": 4
    }
},
{
    "model": "harbors.boattypetranslation",
    "pk": 5,
    "fields": {
        "language_code": "fi",
        "name": "Keskimoottorivene",
        "master": 5
    }
},
{
    "model": "harbors.boattypetranslation",
    "pk": 6,
    "fields": {
        "language_code": "fi",
        "name": "Purjevene / moottoripursi",
        "master": 6
    }
},
{
    "model": "harbors.boattypetranslation",
    "pk": 7,
    "fields": {
        "language_code": "fi",
        "name": "Troolari",
        "master": 7
    }
},
{
    "model": "harbors.boattypetranslation",
    "pk": 8,
    "fields": {
        "language_code": "fi",
        "name": "Suuri alus (yli 20t)",
        "master": 8
    }
},
{
    "model": "harbors.boattypetranslation",
    "pk": 9,
    "fields": {
        "language_code": "en",
        "name": "Dinghy",
        "master": 1
    }
},
{
    "model": "harbors.boattypetranslation",
    "pk": 10,
    "fields": {
        "language_code": "sv",
        "name": "Jolle",
        "master": 1
    }
},
{
    "model": "harbors.boattypetranslation",
    "pk": 11,
    "fields": {
        "language_code": "en",
        "name": "Rowing boat",
        "master": 2
    }
},
{
    "model": "harbors.boattypetranslation",
    "pk": 12,
    "fields": {
        "language_code": "sv",
        "name": "Roddb\u00e5t",
        "master": 2
    }
},
{
    "model": "harbors.boattypetranslation",
    "pk": 13,
    "fields": {
        "language_code": "en",
        "name": "Outboard motor boat",
        "master": 3
    }
},
{
    "model": "harbors.boattypetranslation",
    "pk": 14,
    "fields": {
        "language_code": "sv",
        "name": "Utombordsmotorb\u00e5t",
        "master": 3
    }
},
{
    "model": "harbors.boattypetranslation",
    "pk": 15,
    "fields": {
        "language_code": "en",
        "name": "Inboard motor boat",
        "master": 4
    }
},
{
    "model": "harbors.boattypetranslation",
    "pk": 16,
    "fields": {
        "language_code": "sv",
        "name": "Drevb\u00e5t",
        "master": 4
    }
},
{
    "model": "harbors.boattypetranslation",
    "pk": 17,
    "fields": {
        "language_code": "en",
        "name": "Mid-engined boat",
        "master": 5
    }
},
{
    "model": "harbors.boattypetranslation",
    "pk": 18,
    "fields": {
        "language_code": "sv",
        "name": "Inombordsmotorb\u00e5t",
        "master": 5
    }
},
{
    "model": "harbors.boattypetranslation",
    "pk": 19,
    "fields": {
        "language_code": "en",
        "name": "Sailing boat / motor-sailing boat",
        "master": 6
    }
},
{
    "model": "harbors.boattypetranslation",
    "pk": 20,
    "fields": {
        "language_code": "sv",
        "name": "Segelb\u00e5t / motorseglare",
        "master": 6
    }
},
{
    "model": "harbors.boattypetranslation",
    "pk": 21,
    "fields": {
        "language_code": "en",
        "name": "Trawler",
        "master": 7
    }
},
{
    "model": "harbors.boattypetranslation",
    "pk": 22,
    "fields": {
        "language_code": "sv",
        "name": "Tr\u00e5lare",
        "master": 7
    }
},
{
    "model": "harbors.boattypetranslation",
    "pk": 23,
    "fields": {
        "language_code": "en",
        "name": "Large vessel (more than 20 tonnes)",
        "master": 8
    }
},
{
    "model": "harbors.boattypetranslation",
    "pk": 24,
    "fields": {
        "language_code": "sv",
        "name": "Stort fartyg (\u00f6ver 20 t)",
        "master": 8
    }
},
{
    "model": "harbors.boattype",
    "pk": 1,
    "fields": {}
},
{
    "model": "harbors.boattype",
    "pk": 2,
    "fields": {}
},
{
    "model": "harbors.boattype",
    "pk": 3,
    "fields": {}
},
{
    "model": "harbors.boattype",
    "pk": 4,
    "fields": {}
},
{
    "model": "harbors.boattype",
    "pk": 5,
    "fields": {}
},
{
    "model": "harbors.boattype",
    "pk": 6,
    "fields": {}
},
{
    "model": "harbors.boattype",
    "pk": 7,
    "fields": {}
},
{
    "model": "harbors.boattype",
    "pk": 8,
    "fields": {}
},
{
    "model": "harbors.availabilityleveltranslation",
    "pk": 1,
    "fields": {
        "language_code": "fi",
        "title": "V\u00e4h\u00e4n jonoa",
        "description": "",
        "master": 1
    }
},
{
    "model": "harbors.availabilityleveltranslation",
    "pk": 2,
    "fields": {
        "language_code": "fi",
        "title": "Jonkin verran jonoa",
        "description": "",
        "master": 2
    }
},
{
    "model": "harbors.availabilityleveltranslation",
    "pk": 3,
    "fields": {
        "language_code": "fi",
        "title": "Paljon jonoa",
        "description": "Satamat, joihin on paljon hakijoita ja yleens\u00e4 useamman vuoden jonotusaika. N\u00e4ist\u00e4 satamista vapautuu paikkoja p\u00e4\u00e4asiassa venepaikan vaihtajille.",
        "master": 3
    }
},
{
    "model": "harbors.availabilityleveltranslation",
    "pk": 4,
    "fields": {
        "language_code": "sv",
        "title": "Lite k\u00f6",
        "description": "",
        "master": 1
    }
},
{
    "model": "harbors.availabilityleveltranslation",
    "pk": 5,
    "fields": {
        "language_code": "en",
        "title": "Short waiting periods.",
        "description": "",
        "master": 1
    }
},
{
    "model": "harbors.availabilityleveltranslation",
    "pk": 6,
    "fields": {
        "language_code": "en",
        "title": "Medium waiting periods",
        "description": "",
        "master": 2
    }
},
{
    "model": "harbors.availabilityleveltranslation",
    "pk": 7,
    "fields": {
        "language_code": "sv",
        "title": "En del k\u00f6",
        "description": "",
        "master": 2
    }
},
{
    "model": "harbors.availabilityleveltranslation",
    "pk": 8,
    "fields": {
        "language_code": "en",
        "title": "Long waiting periods",
        "description": "Harbours with many applicants and, usually, waiting periods of several years. Berths in these harbours are typically only available to those who exchange berths.",
        "master": 3
    }
},
{
    "model": "harbors.availabilityleveltranslation",
    "pk": 9,
    "fields": {
        "language_code": "sv",
        "title": "L\u00e5nga v\u00e4ntetider",
        "description": "Hamnar med m\u00e5nga s\u00f6kande och i regel flera \u00e5rs k\u00f6tid. I r\u00f6da hamnar blir platser lediga huvudsakligen f\u00f6r dem som byter b\u00e5tplats.",
        "master": 3
    }
},
{
    "model": "harbors.availabilitylevel",
    "pk": 1,
    "fields": {}
},
{
    "model": "harbors.availabilitylevel",
    "pk": 2,
    "fields": {}
},
{
    "model": "harbors.availabilitylevel",
    "pk": 3,
    "fields": {}
},
{
    "model": "harbors.harbortranslation",
    "pk": 1,
    "fields": {
        "language_code": "fi",
        "name": "Airorannan venesatama A",
        "street_address": "Airoranta 2",
        "master": 1
    }
},
{
    "model": "harbors.harbortranslation",
    "pk": 2,
    "fields": {
        "language_code": "sv",
        "name": "\u00c5rstrands sm\u00e5b\u00e5tshamn A",
        "street_address": "\u00c5rstrand 2",
        "master": 1
    }
},
{
    "model": "harbors.harbortranslation",
    "pk": 3,
    "fields": {
        "language_code": "fi",
        "name": "Aurinkolahden venesatama (Aurinkoranta)",
        "street_address": "Aurinkoranta 1",
        "master": 2
    }
},
{
    "model": "harbors.harbortranslation",
    "pk": 4,
    "fields": {
        "language_code": "sv",
        "name": "Solvikens sm\u00e5b\u00e5tshamn (Solstranden)",
        "street_address": "Solstranden 1",
        "master": 2
    }
},
{
    "model": "harbors.harbortranslation",
    "pk": 5,
    "fields": {
        "language_code": "fi",
        "name": "Merisatama (Ehrenstr\u00f6mintie 21)",
        "street_address": "Ehrenstr\u00f6mintie 21",
        "master": 3
    }
},
{
    "model": "harbors.harbortranslation",
    "pk": 6,
    "fields": {
        "language_code": "sv",
        "name": "Havshamnen (Ehrenstr\u00f6msv\u00e4gen 21)",
        "street_address": "Ehrenstr\u00f6msv\u00e4gen 21",
        "master": 3
    }
},
{
    "model": "harbors.harbortranslation",
    "pk": 7,
    "fields": {
        "language_code": "fi",
        "name": "El\u00e4intarhanlahden venesatama",
        "street_address": "El\u00e4intarhantie 10",
        "master": 4
    }
},
{
    "model": "harbors.harbortranslation",
    "pk": 8,
    "fields": {
        "language_code": "sv",
        "name": "Djurg\u00e5rdsvikens sm\u00e5b\u00e5tshamn",
        "street_address": "Djurg\u00e5rdsv\u00e4gen 10",
        "master": 4
    }
},
{
    "model": "harbors.harbortranslation",
    "pk": 9,
    "fields": {
        "language_code": "fi",
        "name": "Hietalahdenallas / Venesatama",
        "street_address": "Hietalahdenranta 10",
        "master": 5
    }
},
{
    "model": "harbors.harbortranslation",
    "pk": 10,
    "fields": {
        "language_code": "sv",
        "name": "Sandviksbass\u00e4ngen / Sm\u00e5b\u00e5tshamn",
        "street_address": "Sandvikskajen 10",
        "master": 5
    }
},
{
    "model": "harbors.harbortranslation",
    "pk": 11,
    "fields": {
        "language_code": "fi",
        "name": "Honkaluoto / Venesatama",
        "street_address": "Mustikkamaantie 6",
        "master": 6
    }
},
{
    "model": "harbors.harbortranslation",
    "pk": 12,
    "fields": {
        "language_code": "sv",
        "name": "Furusk\u00e4r / Sm\u00e5b\u00e5tshamn",
        "street_address": "Bl\u00e5b\u00e4rslandsv\u00e4gen 6",
        "master": 6
    }
},
{
    "model": "harbors.harbortranslation",
    "pk": 13,
    "fields": {
        "language_code": "fi",
        "name": "Hopeasalmen venesatama",
        "street_address": "Hopeasalmenranta 7",
        "master": 7
    }
},
{
    "model": "harbors.harbortranslation",
    "pk": 14,
    "fields": {
        "language_code": "sv",
        "name": "Silversundets sm\u00e5b\u00e5tshamn",
        "street_address": "Silversundsstranden 7",
        "master": 7
    }
},
{
    "model": "harbors.harbortranslation",
    "pk": 15,
    "fields": {
        "language_code": "fi",
        "name": "Sarvaston venesatama",
        "street_address": "Isonsarvastontie 3",
        "master": 8
    }
},
{
    "model": "harbors.harbortranslation",
    "pk": 16,
    "fields": {
        "language_code": "sv",
        "name": "Fladans sm\u00e5b\u00e5tshamn",
        "street_address": "Storfladav\u00e4gen 3",
        "master": 8
    }
},
{
    "model": "harbors.harbortranslation",
    "pk": 17,
    "fields": {
        "language_code": "fi",
        "name": "Ruoholahden venesatama (Jaalaranta)",
        "street_address": "Jaalaranta 7a",
        "master": 9
    }
},
{
    "model": "harbors.harbortranslation",
    "pk": 18,
    "fields": {
        "language_code": "sv",
        "name": "Gr\u00e4svikens sm\u00e5b\u00e5tshamn (Skutstranden)",
        "street_address": "Skutstranden 7a",
        "master": 9
    }
},
{
    "model": "harbors.harbortranslation",
    "pk": 19,
    "fields": {
        "language_code": "fi",
        "name": "Katajanokan venesatama",
        "street_address": "Laivastokatu 1c",
        "master": 10
    }
},
{
    "model": "harbors.harbortranslation",
    "pk": 20,
    "fields": {
        "language_code": "sv",
        "name": "Skatuddens sm\u00e5b\u00e5tshamn",
        "street_address": "Maringatan 1 C",
        "master": 10
    }
},
{
    "model": "harbors.harbortranslation",
    "pk": 21,
    "fields": {
        "language_code": "fi",
        "name": "Ruoholahden venesatama (Kellosaarenranta)",
        "street_address": "Kellosaarenranta 4",
        "master": 11
    }
},
{
    "model": "harbors.harbortranslation",
    "pk": 22,
    "fields": {
        "language_code": "sv",
        "name": "Gr\u00e4svikens b\u00e5thamn (Sk\u00e4llarstranden)",
        "street_address": "Sk\u00e4llarstranden 4",
        "master": 11
    }
},
{
    "model": "harbors.harbortranslation",
    "pk": 23,
    "fields": {
        "language_code": "fi",
        "name": "Kipparlahden venesatama",
        "street_address": "Kipparlahdenkuja 3",
        "master": 12
    }
},
{
    "model": "harbors.harbortranslation",
    "pk": 24,
    "fields": {
        "language_code": "sv",
        "name": "Skepparvikens sm\u00e5b\u00e5tshamn",
        "street_address": "Skepparviksgr\u00e4nden 3",
        "master": 12
    }
},
{
    "model": "harbors.harbortranslation",
    "pk": 25,
    "fields": {
        "language_code": "fi",
        "name": "Koivuniemen venesatama",
        "street_address": "Marjaniemenranta 1a",
        "master": 13
    }
},
{
    "model": "harbors.harbortranslation",
    "pk": 26,
    "fields": {
        "language_code": "sv",
        "name": "Bj\u00f6rkn\u00e4sets sm\u00e5b\u00e5tshamn",
        "street_address": "Maruddsstrand 1a",
        "master": 13
    }
},
{
    "model": "harbors.harbortranslation",
    "pk": 27,
    "fields": {
        "language_code": "fi",
        "name": "Laivalahden venesatama",
        "street_address": "Simppukarinkatu 2",
        "master": 14
    }
},
{
    "model": "harbors.harbortranslation",
    "pk": 28,
    "fields": {
        "language_code": "sv",
        "name": "B\u00e5tsvikens sm\u00e5b\u00e5tshamn",
        "street_address": "Simp\u00f6rsgatan 2",
        "master": 14
    }
},
{
    "model": "harbors.harbortranslation",
    "pk": 29,
    "fields": {
        "language_code": "fi",
        "name": "L\u00e4hteel\u00e4 retkisatama",
        "street_address": "L\u00e4ntinen K\u00e4llvikintie",
        "master": 15
    }
},
{
    "model": "harbors.harbortranslation",
    "pk": 30,
    "fields": {
        "language_code": "sv",
        "name": "K\u00e4llvik utflyktshamn",
        "street_address": "",
        "master": 15
    }
},
{
    "model": "harbors.harbortranslation",
    "pk": 31,
    "fields": {
        "language_code": "fi",
        "name": "Merihaan venesatama (Hakaniemenranta 13)",
        "street_address": "Hakaniemenranta 13",
        "master": 16
    }
},
{
    "model": "harbors.harbortranslation",
    "pk": 32,
    "fields": {
        "language_code": "sv",
        "name": "Havshagens sm\u00e5b\u00e5tshamn (Hagn\u00e4skajen 13)",
        "street_address": "Hagn\u00e4skajen 13",
        "master": 16
    }
},
{
    "model": "harbors.harbortranslation",
    "pk": 33,
    "fields": {
        "language_code": "fi",
        "name": "Meri-Rastilan venesatama",
        "street_address": "M\u00e4rssykuja 7",
        "master": 17
    }
},
{
    "model": "harbors.harbortranslation",
    "pk": 34,
    "fields": {
        "language_code": "sv",
        "name": "Havsrastb\u00f6le sm\u00e5b\u00e5tshamn",
        "street_address": "M\u00e4rsgr\u00e4nden 7",
        "master": 17
    }
},
{
    "model": "harbors.harbortranslation",
    "pk": 35,
    "fields": {
        "language_code": "fi",
        "name": "Merisatama (Merisatama 28)",
        "street_address": "Merisatama 28",
        "master": 18
    }
},
{
    "model": "harbors.harbortranslation",
    "pk": 36,
    "fields": {
        "language_code": "sv",
        "name": "Havshamn (Havshamnen 28)",
        "street_address": "Havshamnen 28",
        "master": 18
    }
},
{
    "model": "harbors.harbortranslation",
    "pk": 37,
    "fields": {
        "language_code": "fi",
        "name": "Merisatama (Merisatamanranta 20)",
        "street_address": "Merisatamanranta 20",
        "master": 19
    }
},
{
    "model": "harbors.harbortranslation",
    "pk": 38,
    "fields": {
        "language_code": "sv",
        "name": "Havshamn (Havsstranden 20)",
        "street_address": "Havsstranden 20",
        "master": 19
    }
},
{
    "model": "harbors.harbortranslation",
    "pk": 39,
    "fields": {
        "language_code": "fi",
        "name": "Mustikkamaan venesatama",
        "street_address": "Mustikkamaantie 1",
        "master": 20
    }
},
{
    "model": "harbors.harbortranslation",
    "pk": 40,
    "fields": {
        "language_code": "sv",
        "name": "Bl\u00e5b\u00e4rslandets sm\u00e5b\u00e5tshamn",
        "street_address": "Bl\u00e5b\u00e4rslandsv\u00e4gen 1",
        "master": 20
    }
},
{
    "model": "harbors.harbortranslation",
    "pk": 41,
    "fields": {
        "language_code": "fi",
        "name": "Nandelstadhin venesatama",
        "street_address": "Lars Sonckin tie 8a",
        "master": 21
    }
},
{
    "model": "harbors.harbortranslation",
    "pk": 42,
    "fields": {
        "language_code": "sv",
        "name": "Nandelstadhs sm\u00e5b\u00e5tshamn",
        "street_address": "Lars Soncks v\u00e4g 8a",
        "master": 21
    }
},
{
    "model": "harbors.harbortranslation",
    "pk": 43,
    "fields": {
        "language_code": "fi",
        "name": "Naurissalmen venesatama (Kipparlahdensilmukka 9)",
        "street_address": "Kipparlahdensilmukka 9",
        "master": 22
    }
},
{
    "model": "harbors.harbortranslation",
    "pk": 44,
    "fields": {
        "language_code": "sv",
        "name": "Rovholmssundets sm\u00e5b\u00e5tshamn (Kipparlahdensilmukka 9)",
        "street_address": "",
        "master": 22
    }
},
{
    "model": "harbors.harbortranslation",
    "pk": 45,
    "fields": {
        "language_code": "fi",
        "name": "Pajalahden venesatama (Meripuistotie) / Venesatama",
        "street_address": "Meripuistotie 1a",
        "master": 23
    }
},
{
    "model": "harbors.harbortranslation",
    "pk": 46,
    "fields": {
        "language_code": "sv",
        "name": "Smedjevikens sm\u00e5b\u00e5tshamn (Meripuistotie) / B\u00e5thamn",
        "street_address": "Hallonn\u00e4sstranden 5",
        "master": 23
    }
},
{
    "model": "harbors.harbortranslation",
    "pk": 47,
    "fields": {
        "language_code": "fi",
        "name": "Pikku Kallahden venesatama",
        "street_address": "Kalkkihiekantori 4",
        "master": 24
    }
},
{
    "model": "harbors.harbortranslation",
    "pk": 48,
    "fields": {
        "language_code": "sv",
        "name": "Lilla Kallviks sm\u00e5b\u00e5tshamn",
        "street_address": "Kalksandstorget 4",
        "master": 24
    }
},
{
    "model": "harbors.harbortranslation",
    "pk": 49,
    "fields": {
        "language_code": "fi",
        "name": "El\u00e4intarhanlahden venesatama (Pitk\u00e4nsillanranta)",
        "street_address": "Pitk\u00e4nsillanranta",
        "master": 25
    }
},
{
    "model": "harbors.harbortranslation",
    "pk": 50,
    "fields": {
        "language_code": "sv",
        "name": "Djurg\u00e5rdsvikens sm\u00e5b\u00e5tshamn (L\u00e5ngbrokajen)",
        "street_address": "L\u00e5ngbrokajen",
        "master": 25
    }
},
{
    "model": "harbors.harbortranslation",
    "pk": 51,
    "fields": {
        "language_code": "fi",
        "name": "Pohjoisranta 3 / Venesatama",
        "street_address": "Pohjoisranta 3",
        "master": 26
    }
},
{
    "model": "harbors.harbortranslation",
    "pk": 52,
    "fields": {
        "language_code": "sv",
        "name": "Norra kajen 3 / Sm\u00e5b\u00e5tshamn",
        "street_address": "Norra kajen 3",
        "master": 26
    }
},
{
    "model": "harbors.harbortranslation",
    "pk": 53,
    "fields": {
        "language_code": "fi",
        "name": "Porslahden venesatama",
        "street_address": "Etel\u00e4reimarintie 8",
        "master": 27
    }
},
{
    "model": "harbors.harbortranslation",
    "pk": 54,
    "fields": {
        "language_code": "sv",
        "name": "Porslax sm\u00e5b\u00e5tshamn",
        "street_address": "Sydremmarv\u00e4gen 8",
        "master": 27
    }
},
{
    "model": "harbors.harbortranslation",
    "pk": 55,
    "fields": {
        "language_code": "fi",
        "name": "Puotilan venesatama",
        "street_address": "Meripellontie 11",
        "master": 28
    }
},
{
    "model": "harbors.harbortranslation",
    "pk": 56,
    "fields": {
        "language_code": "sv",
        "name": "Botby g\u00e5rds sm\u00e5b\u00e5tshamn",
        "street_address": "Sj\u00f6\u00e5kerv\u00e4gen 11",
        "master": 28
    }
},
{
    "model": "harbors.harbortranslation",
    "pk": 57,
    "fields": {
        "language_code": "fi",
        "name": "Aurinkolahden venesatama (Pursilahdenranta)",
        "street_address": "Pursilahdenranta 1",
        "master": 29
    }
},
{
    "model": "harbors.harbortranslation",
    "pk": 58,
    "fields": {
        "language_code": "sv",
        "name": "Solvikens sm\u00e5b\u00e5tshamn (Slupviksstranden)",
        "street_address": "Slupviksstranden 1",
        "master": 29
    }
},
{
    "model": "harbors.harbortranslation",
    "pk": 59,
    "fields": {
        "language_code": "fi",
        "name": "Ramsaynrannan venesatama (A) (Ramsaynranta 4)",
        "street_address": "Ramsaynranta 4",
        "master": 30
    }
},
{
    "model": "harbors.harbortranslation",
    "pk": 60,
    "fields": {
        "language_code": "sv",
        "name": "Ramsays strands sm\u00e5b\u00e5tshamn (A) (Ramsays strand 4)",
        "street_address": "Ramsays strand 4",
        "master": 30
    }
},
{
    "model": "harbors.harbortranslation",
    "pk": 61,
    "fields": {
        "language_code": "fi",
        "name": "Ruoholahden venesatama (Ruoholahden kanava)",
        "street_address": "Ruoholahdenkanava",
        "master": 31
    }
},
{
    "model": "harbors.harbortranslation",
    "pk": 62,
    "fields": {
        "language_code": "sv",
        "name": "Gr\u00e4svikens sm\u00e5b\u00e5tshamn (Gr\u00e4svikskanalen)",
        "street_address": "Gr\u00e4svikskanalen",
        "master": 31
    }
},
{
    "model": "harbors.harbortranslation",
    "pk": 63,
    "fields": {
        "language_code": "fi",
        "name": "Salmisaaren venesatama",
        "street_address": "Salmisaarenranta",
        "master": 32
    }
},
{
    "model": "harbors.harbortranslation",
    "pk": 64,
    "fields": {
        "language_code": "sv",
        "name": "Sundholmens sm\u00e5b\u00e5tshamn",
        "street_address": "Sundholmsstranden",
        "master": 32
    }
},
{
    "model": "harbors.harbortranslation",
    "pk": 65,
    "fields": {
        "language_code": "fi",
        "name": "Saukonpaaden venesatama",
        "street_address": "Saukonpaadenranta 7",
        "master": 33
    }
},
{
    "model": "harbors.harbortranslation",
    "pk": 66,
    "fields": {
        "language_code": "sv",
        "name": "Utterh\u00e4llens sm\u00e5b\u00e5tshamn",
        "street_address": "Utterh\u00e4llsstranden 7",
        "master": 33
    }
},
{
    "model": "harbors.harbortranslation",
    "pk": 67,
    "fields": {
        "language_code": "fi",
        "name": "Saunalahden venesatama (Ramsaynranta 6)",
        "street_address": "Ramsaynranta 6",
        "master": 34
    }
},
{
    "model": "harbors.harbortranslation",
    "pk": 68,
    "fields": {
        "language_code": "sv",
        "name": "Bastuvikens sm\u00e5b\u00e5tshamn (Ramsays strand 6)",
        "street_address": "Ramsays strand 6",
        "master": 34
    }
},
{
    "model": "harbors.harbortranslation",
    "pk": 69,
    "fields": {
        "language_code": "fi",
        "name": "Siltavuoren venesatama",
        "street_address": "Siltavuorenranta 3",
        "master": 35
    }
},
{
    "model": "harbors.harbortranslation",
    "pk": 70,
    "fields": {
        "language_code": "sv",
        "name": "Brobergets sm\u00e5b\u00e5tshamn",
        "street_address": "Brobergskajen 3",
        "master": 35
    }
},
{
    "model": "harbors.harbortranslation",
    "pk": 71,
    "fields": {
        "language_code": "fi",
        "name": "Str\u00f6msinlahden venesatama",
        "street_address": "Abraham Wetterin tie 26",
        "master": 36
    }
},
{
    "model": "harbors.harbortranslation",
    "pk": 72,
    "fields": {
        "language_code": "sv",
        "name": "Str\u00f6msvikens sm\u00e5b\u00e5tshamn",
        "street_address": "Abraham Wetters v\u00e4g 26",
        "master": 36
    }
},
{
    "model": "harbors.harbortranslation",
    "pk": 73,
    "fields": {
        "language_code": "fi",
        "name": "Tammasaaren allas (paikat 1-31)",
        "street_address": "Tammasaarenaukio 4",
        "master": 37
    }
},
{
    "model": "harbors.harbortranslation",
    "pk": 74,
    "fields": {
        "language_code": "sv",
        "name": "M\u00e4raholmsbass\u00e4ngen (platser 1-31)",
        "street_address": "M\u00e4raholmsplatsen 4",
        "master": 37
    }
},
{
    "model": "harbors.harbortranslation",
    "pk": 75,
    "fields": {
        "language_code": "fi",
        "name": "Tervasaari (Tervasaarenkannas 1) / Venesatama",
        "street_address": "Tervasaarenkannas 1",
        "master": 38
    }
},
{
    "model": "harbors.harbortranslation",
    "pk": 76,
    "fields": {
        "language_code": "sv",
        "name": "Tj\u00e4rholmen (Tj\u00e4rholmn\u00e4set 1) / Sm\u00e5b\u00e5tshamn",
        "street_address": "Tj\u00e4rholmsn\u00e4set 1",
        "master": 38
    }
},
{
    "model": "harbors.harbortranslation",
    "pk": 77,
    "fields": {
        "language_code": "fi",
        "name": "Vasikkasaaren venesatama",
        "street_address": "Vasikkasaari",
        "master": 39
    }
},
{
    "model": "harbors.harbortranslation",
    "pk": 78,
    "fields": {
        "language_code": "sv",
        "name": "Kalvholmens sm\u00e5b\u00e5tshamn",
        "street_address": "Kalvholmen",
        "master": 39
    }
},
{
    "model": "harbors.harbortranslation",
    "pk": 79,
    "fields": {
        "language_code": "fi",
        "name": "Vuosaarenlahden venesatama",
        "street_address": "Merenkulkijankuja 7",
        "master": 40
    }
},
{
    "model": "harbors.harbortranslation",
    "pk": 80,
    "fields": {
        "language_code": "sv",
        "name": "Nordsj\u00f6vikens sm\u00e5b\u00e5tshamn",
        "street_address": "Sj\u00f6farargr\u00e4nden 7",
        "master": 40
    }
},
{
    "model": "harbors.harbortranslation",
    "pk": 81,
    "fields": {
        "language_code": "fi",
        "name": "V\u00e4h\u00e4niityn venesatama",
        "street_address": "V\u00e4h\u00e4niityntie 3a",
        "master": 41
    }
},
{
    "model": "harbors.harbortranslation",
    "pk": 82,
    "fields": {
        "language_code": "sv",
        "name": "Lill\u00e4ngens sm\u00e5b\u00e5tshamn",
        "street_address": "Lill\u00e4ngsv\u00e4gen 3a",
        "master": 41
    }
},
{
    "model": "harbors.harbortranslation",
    "pk": 83,
    "fields": {
        "language_code": "fi",
        "name": "Katajanokan venesatama (rantamuuri)",
        "street_address": "Laivastokatu 1c",
        "master": 42
    }
},
{
    "model": "harbors.harbortranslation",
    "pk": 84,
    "fields": {
        "language_code": "fi",
        "name": "Kipparlahden venesatama (rantamuuri)",
        "street_address": "Kipparlahdenkuja 3",
        "master": 43
    }
},
{
    "model": "harbors.harbortranslation",
    "pk": 85,
    "fields": {
        "language_code": "fi",
        "name": "Mustikkamaan venesatama (rantamuuri)",
        "street_address": "Mustikkamaantie 1",
        "master": 44
    }
},
{
    "model": "harbors.harbortranslation",
    "pk": 86,
    "fields": {
        "language_code": "fi",
        "name": "Pajalahden venesatama (rantamuuri)",
        "street_address": "Meripuistotie 1a",
        "master": 45
    }
},
{
    "model": "harbors.harbortranslation",
    "pk": 87,
    "fields": {
        "language_code": "sv",
        "name": "Skatuddens sm\u00e5b\u00e5tshamn (strandmuren)",
        "street_address": "Maringatan 1 C",
        "master": 42
    }
},
{
    "model": "harbors.harbortranslation",
    "pk": 88,
    "fields": {
        "language_code": "sv",
        "name": "Skepparvikens sm\u00e5b\u00e5tshamn (strandmuren)",
        "street_address": "Skepparviksgr\u00e4nden 3",
        "master": 43
    }
},
{
    "model": "harbors.harbortranslation",
    "pk": 89,
    "fields": {
        "language_code": "sv",
        "name": "Bl\u00e5b\u00e4rslandets sm\u00e5b\u00e5tshamn (strandmuren)",
        "street_address": "Bl\u00e5b\u00e4rslandsv\u00e4gen 1",
        "master": 44
    }
},
{
    "model": "harbors.harbortranslation",
    "pk": 90,
    "fields": {
        "language_code": "sv",
        "name": "Smedjevikens sm\u00e5b\u00e5tshamn (strandmuren)",
        "street_address": "Hallonn\u00e4sstranden 5",
        "master": 45
    }
},
{
    "model": "harbors.harbortranslation",
    "pk": 91,
    "fields": {
        "language_code": "fi",
        "name": "Airorannan venesatama B",
        "street_address": "Airoranta 2",
        "master": 46
    }
},
{
    "model": "harbors.harbortranslation",
    "pk": 92,
    "fields": {
        "language_code": "sv",
        "name": "\u00c5rstrands sm\u00e5b\u00e5tshamn B",
        "street_address": "\u00c5rstrand 2",
        "master": 46
    }
},
{
    "model": "harbors.harbortranslation",
    "pk": 93,
    "fields": {
        "language_code": "fi",
        "name": "Laivalahden venesatama (Reginankuja)",
        "street_address": "Reginankuja",
        "master": 47
    }
},
{
    "model": "harbors.harbortranslation",
    "pk": 94,
    "fields": {
        "language_code": "sv",
        "name": "B\u00e5tsvikens sm\u00e5b\u00e5tshamn (Reginagr\u00e4nden)",
        "street_address": "Reginagr\u00e4nden",
        "master": 47
    }
},
{
    "model": "harbors.harbortranslation",
    "pk": 95,
    "fields": {
        "language_code": "fi",
        "name": "Laivalahden venesatama (aallonmurtaja)",
        "street_address": "Simppurinkatu 2",
        "master": 48
    }
},
{
    "model": "harbors.harbortranslation",
    "pk": 96,
    "fields": {
        "language_code": "sv",
        "name": "B\u00e5tsvikens sm\u00e5b\u00e5tshamn (v\u00e5gbrytaren)",
        "street_address": "Simp\u00f6rsgatan 2",
        "master": 48
    }
},
{
    "model": "harbors.harbortranslation",
    "pk": 97,
    "fields": {
        "language_code": "fi",
        "name": "Merihaan venesatama (Hakaniemenranta 30)",
        "street_address": "Hakaniemenranta 30",
        "master": 49
    }
},
{
    "model": "harbors.harbortranslation",
    "pk": 98,
    "fields": {
        "language_code": "sv",
        "name": "Havshagens sm\u00e5b\u00e5tshamn (Hagn\u00e4skajen 30)",
        "street_address": "Hagn\u00e4skajen 30",
        "master": 49
    }
},
{
    "model": "harbors.harbortranslation",
    "pk": 99,
    "fields": {
        "language_code": "fi",
        "name": "Merisatama (Ehrenstr\u00f6mintie 22)",
        "street_address": "Ehrenstr\u00f6mintie 22",
        "master": 50
    }
},
{
    "model": "harbors.harbortranslation",
    "pk": 100,
    "fields": {
        "language_code": "sv",
        "name": "Havshamnen (Ehrenstr\u00f6msv\u00e4gen 22)",
        "street_address": "Ehrenstr\u00f6msv\u00e4gen 22",
        "master": 50
    }
},
{
    "model": "harbors.harbortranslation",
    "pk": 101,
    "fields": {
        "language_code": "fi",
        "name": "Tammasaaren allas (paikat 32-75)",
        "street_address": "Tammasaarenaukio 4",
        "master": 51
    }
},
{
    "model": "harbors.harbortranslation",
    "pk": 102,
    "fields": {
        "language_code": "sv",
        "name": "M\u00e4raholmsbass\u00e4ngen (platser 32-75)",
        "street_address": "M\u00e4raholmsplatsen 4",
        "master": 51
    }
},
{
    "model": "harbors.harbortranslation",
    "pk": 103,
    "fields": {
        "language_code": "fi",
        "name": "Hietalahdenallas (J\u00e4tk\u00e4saaren puoli) / Venesatama",
        "street_address": "Hietalahdenranta 10",
        "master": 52
    }
},
{
    "model": "harbors.harbortranslation",
    "pk": 104,
    "fields": {
        "language_code": "sv",
        "name": "Sandviksbass\u00e4ngen (Busholmens sida) / Sm\u00e5b\u00e5tshamn",
        "street_address": "Sandvikskajen 10",
        "master": 52
    }
},
{
    "model": "harbors.harbor",
    "pk": 1,
    "fields": {
        "servicemap_id": "40393",
        "zip_code": "00830",
        "phone": "",
        "email": "",
        "www_url": "https://www.hel.fi/helsinki/fi/kulttuuri-ja-vapaa-aika/ulkoilu/veneily/kaupungin-venepaikat/kaupungin-venesatamat/airorannan-venesatama",
        "location": "SRID=4326;POINT (25.06585287235345 60.18815467436053)",
        "municipality": "helsinki",
        "image_file": "harbors/airoranta-a/40393.jpg",
        "image_link": "",
        "mooring": true,
        "electricity": false,
        "water": false,
        "waste_collection": false,
        "gate": false,
        "lighting": false,
        "availability_level": 3,
        "number_of_places": 6,
        "maximum_width": 200,
        "maximum_length": 500,
        "maximum_depth": null,
        "suitable_boat_types": [
            2,
            3
        ]
    }
},
{
    "model": "harbors.harbor",
    "pk": 2,
    "fields": {
        "servicemap_id": "41636",
        "zip_code": "00990",
        "phone": "",
        "email": "",
        "www_url": "https://www.hel.fi/helsinki/fi/kulttuuri-ja-vapaa-aika/ulkoilu/veneily/kaupungin-venepaikat/kaupungin-venesatamat/aurinkolahden-venesatama",
        "location": "SRID=4326;POINT (25.14785400000001 60.20036299999999)",
        "municipality": "helsinki",
        "image_file": "harbors/aurinkolahti/41636.jpg",
        "image_link": "",
        "mooring": true,
        "electricity": true,
        "water": true,
        "waste_collection": true,
        "gate": true,
        "lighting": true,
        "availability_level": 2,
        "number_of_places": 96,
        "maximum_width": 400,
        "maximum_length": 2100,
        "maximum_depth": null,
        "suitable_boat_types": [
            2,
            3,
            4,
            5,
            6,
            8
        ]
    }
},
{
    "model": "harbors.harbor",
    "pk": 3,
    "fields": {
        "servicemap_id": "40971",
        "zip_code": "00140",
        "phone": "",
        "email": "",
        "www_url": "https://www.hel.fi/helsinki/fi/kulttuuri-ja-vapaa-aika/ulkoilu/veneily/kaupungin-venepaikat/kaupungin-venesatamat/merisatama",
        "location": "SRID=4326;POINT (24.95324466270327 60.15452603410284)",
        "municipality": "helsinki",
        "image_file": "harbors/ehrenstromintie-21/40971.jpg",
        "image_link": "",
        "mooring": true,
        "electricity": false,
        "water": false,
        "waste_collection": true,
        "gate": false,
        "lighting": true,
        "availability_level": 2,
        "number_of_places": 62,
        "maximum_width": 350,
        "maximum_length": 1400,
        "maximum_depth": null,
        "suitable_boat_types": [
            3,
            4,
            5,
            6
        ]
    }
},
{
    "model": "harbors.harbor",
    "pk": 4,
    "fields": {
        "servicemap_id": "39913",
        "zip_code": "00530",
        "phone": "",
        "email": "",
        "www_url": "https://www.hel.fi/helsinki/fi/kulttuuri-ja-vapaa-aika/ulkoilu/veneily/kaupungin-venepaikat/kaupungin-venesatamat/elaintarhanlahden-venesatama",
        "location": "SRID=4326;POINT (24.94178200000002 60.17999999999999)",
        "municipality": "helsinki",
        "image_file": "harbors/elaintarhanlahti/39913.jpg",
        "image_link": "",
        "mooring": true,
        "electricity": true,
        "water": true,
        "waste_collection": true,
        "gate": true,
        "lighting": true,
        "availability_level": 2,
        "number_of_places": 84,
        "maximum_width": 300,
        "maximum_length": 800,
        "maximum_depth": null,
        "suitable_boat_types": [
            2,
            3,
            4,
            5
        ]
    }
},
{
    "model": "harbors.harbor",
    "pk": 5,
    "fields": {
        "servicemap_id": "41390",
        "zip_code": "00180",
        "phone": "",
        "email": "",
        "www_url": "https://www.hel.fi/helsinki/fi/kulttuuri-ja-vapaa-aika/ulkoilu/veneily/kaupungin-venepaikat/kaupungin-venesatamat/hietalahdenallas",
        "location": "SRID=4326;POINT (24.92907700000001 60.16155199999997)",
        "municipality": "helsinki",
        "image_file": "harbors/hietalahdenallas/41390.jpg",
        "image_link": "",
        "mooring": true,
        "electricity": false,
        "water": false,
        "waste_collection": true,
        "gate": false,
        "lighting": true,
        "availability_level": 2,
        "number_of_places": 74,
        "maximum_width": 500,
        "maximum_length": 1800,
        "maximum_depth": null,
        "suitable_boat_types": [
            3,
            4,
            5,
            6,
            8
        ]
    }
},
{
    "model": "harbors.harbor",
    "pk": 6,
    "fields": {
        "servicemap_id": "40672",
        "zip_code": "00570",
        "phone": "",
        "email": "",
        "www_url": "https://www.hel.fi/helsinki/fi/kulttuuri-ja-vapaa-aika/ulkoilu/veneily/kaupungin-venepaikat/kaupungin-venesatamat/honkaluoto",
        "location": "SRID=4326;POINT (25.00117000000002 60.18107199999997)",
        "municipality": "helsinki",
        "image_file": "harbors/honkaluoto/40672.jpg",
        "image_link": "",
        "mooring": true,
        "electricity": true,
        "water": true,
        "waste_collection": false,
        "gate": false,
        "lighting": true,
        "availability_level": 1,
        "number_of_places": 20,
        "maximum_width": 275,
        "maximum_length": 1400,
        "maximum_depth": null,
        "suitable_boat_types": [
            3,
            4,
            5,
            6
        ]
    }
},
{
    "model": "harbors.harbor",
    "pk": 7,
    "fields": {
        "servicemap_id": "41926",
        "zip_code": "00570",
        "phone": "",
        "email": "",
        "www_url": "https://www.hel.fi/helsinki/fi/kulttuuri-ja-vapaa-aika/ulkoilu/veneily/kaupungin-venepaikat/kaupungin-venesatamat/hopeasalmen-venesatama",
        "location": "SRID=4326;POINT (24.99573099999997 60.18447499999999)",
        "municipality": "helsinki",
        "image_file": "harbors/hopeasalmi/41926.jpg",
        "image_link": "",
        "mooring": true,
        "electricity": true,
        "water": true,
        "waste_collection": true,
        "gate": true,
        "lighting": true,
        "availability_level": 1,
        "number_of_places": 35,
        "maximum_width": 300,
        "maximum_length": 1500,
        "maximum_depth": null,
        "suitable_boat_types": [
            2,
            3,
            4,
            5
        ]
    }
},
{
    "model": "harbors.harbor",
    "pk": 8,
    "fields": {
        "servicemap_id": "40166",
        "zip_code": "00840",
        "phone": "",
        "email": "",
        "www_url": "https://www.hel.fi/helsinki/fi/kulttuuri-ja-vapaa-aika/ulkoilu/veneily/kaupungin-venepaikat/kaupungin-venesatamat/sarvaston-venesatama",
        "location": "SRID=4326;POINT (25.05870200000003 60.16715999999997)",
        "municipality": "helsinki",
        "image_file": "harbors/iso-sarvasto/40166.jpg",
        "image_link": "",
        "mooring": true,
        "electricity": true,
        "water": true,
        "waste_collection": true,
        "gate": true,
        "lighting": true,
        "availability_level": 1,
        "number_of_places": 321,
        "maximum_width": 400,
        "maximum_length": 1600,
        "maximum_depth": null,
        "suitable_boat_types": [
            2,
            3,
            4,
            5,
            6
        ]
    }
},
{
    "model": "harbors.harbor",
    "pk": 9,
    "fields": {
        "servicemap_id": "40827",
        "zip_code": "00180",
        "phone": "",
        "email": "",
        "www_url": "https://www.hel.fi/helsinki/fi/kulttuuri-ja-vapaa-aika/ulkoilu/veneily/kaupungin-venepaikat/kaupungin-venesatamat/ruoholahden-venesatama",
        "location": "SRID=4326;POINT (24.91271000000004 60.161034)",
        "municipality": "helsinki",
        "image_file": "harbors/jaalaranta/40827.jpg",
        "image_link": "",
        "mooring": true,
        "electricity": false,
        "water": false,
        "waste_collection": false,
        "gate": false,
        "lighting": true,
        "availability_level": 1,
        "number_of_places": 50,
        "maximum_width": 400,
        "maximum_length": 1500,
        "maximum_depth": null,
        "suitable_boat_types": [
            2,
            3,
            4,
            5
        ]
    }
},
{
    "model": "harbors.harbor",
    "pk": 10,
    "fields": {
        "servicemap_id": "48272",
        "zip_code": "00170",
        "phone": "",
        "email": "",
        "www_url": "https://www.hel.fi/helsinki/fi/kulttuuri-ja-vapaa-aika/ulkoilu/veneily/kaupungin-venepaikat/kaupungin-venesatamat/katajanokan-venesatama",
        "location": "SRID=4326;POINT (24.96585654232736 60.16959497046764)",
        "municipality": "helsinki",
        "image_file": "harbors/katajanokka/48272.jpg",
        "image_link": "",
        "mooring": true,
        "electricity": true,
        "water": true,
        "waste_collection": true,
        "gate": true,
        "lighting": true,
        "availability_level": 3,
        "number_of_places": 11,
        "maximum_width": 250,
        "maximum_length": 1000,
        "maximum_depth": null,
        "suitable_boat_types": [
            2,
            3,
            5
        ]
    }
},
{
    "model": "harbors.harbor",
    "pk": 11,
    "fields": {
        "servicemap_id": "40310",
        "zip_code": "00180",
        "phone": "",
        "email": "",
        "www_url": "https://www.hel.fi/helsinki/fi/kulttuuri-ja-vapaa-aika/ulkoilu/veneily/kaupungin-venepaikat/kaupungin-venesatamat/ruoholahden-venesatama",
        "location": "SRID=4326;POINT (24.91256300000001 60.16163299999998)",
        "municipality": "helsinki",
        "image_file": "harbors/kellosaarenranta/40310.jpg",
        "image_link": "",
        "mooring": true,
        "electricity": false,
        "water": false,
        "waste_collection": false,
        "gate": false,
        "lighting": true,
        "availability_level": 1,
        "number_of_places": 27,
        "maximum_width": 500,
        "maximum_length": 2000,
        "maximum_depth": null,
        "suitable_boat_types": [
            3,
            4,
            5
        ]
    }
},
{
    "model": "harbors.harbor",
    "pk": 12,
    "fields": {
        "servicemap_id": "41189",
        "zip_code": "00810",
        "phone": "",
        "email": "",
        "www_url": "https://www.hel.fi/helsinki/fi/kulttuuri-ja-vapaa-aika/ulkoilu/veneily/kaupungin-venepaikat/kaupungin-venesatamat/kipparlahden-venesatama",
        "location": "SRID=4326;POINT (25.02156792855906 60.19045365285283)",
        "municipality": "helsinki",
        "image_file": "harbors/kipparlahti/41189.jpg",
        "image_link": "",
        "mooring": true,
        "electricity": false,
        "water": false,
        "waste_collection": true,
        "gate": true,
        "lighting": false,
        "availability_level": 2,
        "number_of_places": 25,
        "maximum_width": 300,
        "maximum_length": 1000,
        "maximum_depth": null,
        "suitable_boat_types": [
            2,
            3,
            4,
            5,
            6
        ]
    }
},
{
    "model": "harbors.harbor",
    "pk": 13,
    "fields": {
        "servicemap_id": "39950",
        "zip_code": "00930",
        "phone": "",
        "email": "",
        "www_url": "https://www.hel.fi/helsinki/fi/kulttuuri-ja-vapaa-aika/ulkoilu/veneily/kaupungin-venepaikat/kaupungin-venesatamat/koivuniemen-venesatama",
        "location": "SRID=4326;POINT (25.09772699999996 60.20078699999999)",
        "municipality": "helsinki",
        "image_file": "harbors/koivuniemen-venesatama/39950.jpg",
        "image_link": "",
        "mooring": true,
        "electricity": false,
        "water": false,
        "waste_collection": true,
        "gate": false,
        "lighting": false,
        "availability_level": 2,
        "number_of_places": 18,
        "maximum_width": 250,
        "maximum_length": 500,
        "maximum_depth": null,
        "suitable_boat_types": [
            2,
            3
        ]
    }
},
{
    "model": "harbors.harbor",
    "pk": 14,
    "fields": {
        "servicemap_id": "40864",
        "zip_code": "00810",
        "phone": "",
        "email": "",
        "www_url": "https://www.hel.fi/helsinki/fi/kulttuuri-ja-vapaa-aika/ulkoilu/veneily/kaupungin-venepaikat/kaupungin-venesatamat/laivalahden-venesatama",
        "location": "SRID=4326;POINT (25.02772281481857 60.18698499999979)",
        "municipality": "helsinki",
        "image_file": "harbors/laivalahti/40864.jpg",
        "image_link": "",
        "mooring": true,
        "electricity": true,
        "water": true,
        "waste_collection": true,
        "gate": true,
        "lighting": true,
        "availability_level": 2,
        "number_of_places": 211,
        "maximum_width": 450,
        "maximum_length": 1800,
        "maximum_depth": null,
        "suitable_boat_types": [
            2,
            3,
            4,
            5,
            6,
            7,
            8
        ]
    }
},
{
    "model": "harbors.harbor",
    "pk": 15,
    "fields": {
        "servicemap_id": "40290",
        "zip_code": "02480",
        "phone": "040 827 8310",
        "email": "",
        "www_url": "https://www.hel.fi/helsinki/fi/kulttuuri-ja-vapaa-aika/ulkoilu/veneily/kaupungin-venepaikat/kaupungin-venesatamat/lahteela",
        "location": "SRID=4326;POINT (24.43913699999998 59.981045)",
        "municipality": "kirkkonummi",
        "image_file": "harbors/lahteela/40290.jpg",
        "image_link": "",
        "mooring": true,
        "electricity": false,
        "water": false,
        "waste_collection": true,
        "gate": true,
        "lighting": false,
        "availability_level": 1,
        "number_of_places": 54,
        "maximum_width": 650,
        "maximum_length": 1200,
        "maximum_depth": null,
        "suitable_boat_types": [
            2,
            3
        ]
    }
},
{
    "model": "harbors.harbor",
    "pk": 16,
    "fields": {
        "servicemap_id": "41454",
        "disabled": true,
        "zip_code": "00530",
        "phone": "",
        "email": "",
        "www_url": "https://www.hel.fi/helsinki/fi/kulttuuri-ja-vapaa-aika/ulkoilu/veneily/kaupungin-venepaikat/kaupungin-venesatamat/merihaan-venesatama",
        "location": "SRID=4326;POINT (24.959497 60.17813499999998)",
        "municipality": "helsinki",
        "image_file": "harbors/merihaka/41454.jpg",
        "image_link": "",
        "mooring": true,
        "electricity": true,
        "water": true,
        "waste_collection": true,
        "gate": true,
        "lighting": true,
        "availability_level": null,
        "number_of_places": null,
        "maximum_width": null,
        "maximum_length": null,
        "maximum_depth": null,
        "suitable_boat_types": [
            2,
            3,
            4,
            5,
            6
        ]
    }
},
{
    "model": "harbors.harbor",
    "pk": 17,
    "fields": {
        "servicemap_id": "41066",
        "zip_code": "00980",
        "phone": "",
        "email": "",
        "www_url": "https://www.hel.fi/helsinki/fi/kulttuuri-ja-vapaa-aika/ulkoilu/veneily/kaupungin-venepaikat/kaupungin-venesatamat/meri-rastilan-venesatama",
        "location": "SRID=4326;POINT (25.113478 60.20614000000001)",
        "municipality": "helsinki",
        "image_file": "harbors/meri-rastila/41066.jpg",
        "image_link": "",
        "mooring": true,
        "electricity": true,
        "water": true,
        "waste_collection": true,
        "gate": true,
        "lighting": true,
        "availability_level": 1,
        "number_of_places": 115,
        "maximum_width": 450,
        "maximum_length": 1400,
        "maximum_depth": null,
        "suitable_boat_types": [
            1,
            2,
            3,
            4,
            5,
            6
        ]
    }
},
{
    "model": "harbors.harbor",
    "pk": 18,
    "fields": {
        "servicemap_id": "40948",
        "zip_code": "00140",
        "phone": "",
        "email": "",
        "www_url": "https://www.hel.fi/helsinki/fi/kulttuuri-ja-vapaa-aika/ulkoilu/veneily/kaupungin-venepaikat/kaupungin-venesatamat/merisatama",
        "location": "SRID=4326;POINT (24.94809499999996 60.15480999999998)",
        "municipality": "helsinki",
        "image_file": "harbors/merisatama/40948.jpg",
        "image_link": "",
        "mooring": true,
        "electricity": true,
        "water": true,
        "waste_collection": true,
        "gate": true,
        "lighting": true,
        "availability_level": 3,
        "number_of_places": 129,
        "maximum_width": 450,
        "maximum_length": 2000,
        "maximum_depth": null,
        "suitable_boat_types": [
            2,
            3,
            4,
            5,
            6
        ]
    }
},
{
    "model": "harbors.harbor",
    "pk": 19,
    "fields": {
        "servicemap_id": "45995",
        "zip_code": "00150",
        "phone": "",
        "email": "",
        "www_url": "https://www.hel.fi/helsinki/fi/kulttuuri-ja-vapaa-aika/ulkoilu/veneily/kaupungin-venepaikat/kaupungin-venesatamat/merisatama",
        "location": "SRID=4326;POINT (24.94499199999997 60.154316)",
        "municipality": "helsinki",
        "image_file": "harbors/merisatamaranta/45995.jpg",
        "image_link": "",
        "mooring": true,
        "electricity": false,
        "water": false,
        "waste_collection": true,
        "gate": false,
        "lighting": true,
        "availability_level": 2,
        "number_of_places": 123,
        "maximum_width": 400,
        "maximum_length": 1500,
        "maximum_depth": null,
        "suitable_boat_types": [
            3,
            4,
            5,
            6
        ]
    }
},
{
    "model": "harbors.harbor",
    "pk": 20,
    "fields": {
        "servicemap_id": "40359",
        "zip_code": "00570",
        "phone": "",
        "email": "",
        "www_url": "https://www.hel.fi/helsinki/fi/kulttuuri-ja-vapaa-aika/ulkoilu/veneily/kaupungin-venepaikat/kaupungin-venesatamat/mustikkamaan-venesatama",
        "location": "SRID=4326;POINT (24.99521236574618 60.18296813265754)",
        "municipality": "helsinki",
        "image_file": "harbors/mustikkamaa/40359.jpg",
        "image_link": "",
        "mooring": true,
        "electricity": true,
        "water": true,
        "waste_collection": true,
        "gate": true,
        "lighting": true,
        "availability_level": 2,
        "number_of_places": 66,
        "maximum_width": 350,
        "maximum_length": 1100,
        "maximum_depth": null,
        "suitable_boat_types": [
            2,
            3,
            4,
            5
        ]
    }
},
{
    "model": "harbors.harbor",
    "pk": 21,
    "fields": {
        "servicemap_id": "42225",
        "zip_code": "00570",
        "phone": "",
        "email": "",
        "www_url": "https://www.hel.fi/helsinki/fi/kulttuuri-ja-vapaa-aika/ulkoilu/veneily/kaupungin-venepaikat/kaupungin-venesatamat/nandelstadhin-venesatama",
        "location": "SRID=4326;POINT (25.01524699999996 60.182655)",
        "municipality": "helsinki",
        "image_file": "harbors/nandelstadh/42225.jpg",
        "image_link": "",
        "mooring": true,
        "electricity": true,
        "water": true,
        "waste_collection": true,
        "gate": true,
        "lighting": true,
        "availability_level": 1,
        "number_of_places": 55,
        "maximum_width": 350,
        "maximum_length": 1300,
        "maximum_depth": null,
        "suitable_boat_types": [
            1,
            2,
            3,
            4,
            5,
            6
        ]
    }
},
{
    "model": "harbors.harbor",
    "pk": 22,
    "fields": {
        "servicemap_id": "40712",
        "zip_code": "00810",
        "phone": "",
        "email": "",
        "www_url": "https://www.hel.fi/helsinki/fi/kulttuuri-ja-vapaa-aika/ulkoilu/veneily/kaupungin-venepaikat/kaupungin-venesatamat/naurissalmen-venesatama",
        "location": "SRID=4326;POINT (25.01592299999999 60.19148599999995)",
        "municipality": "helsinki",
        "image_file": "harbors/naurissalmi/40712.jpg",
        "image_link": "",
        "mooring": true,
        "electricity": true,
        "water": true,
        "waste_collection": true,
        "gate": true,
        "lighting": true,
        "availability_level": 1,
        "number_of_places": 112,
        "maximum_width": 300,
        "maximum_length": 1000,
        "maximum_depth": null,
        "suitable_boat_types": [
            1,
            2,
            3,
            4,
            5
        ]
    }
},
{
    "model": "harbors.harbor",
    "pk": 23,
    "fields": {
        "servicemap_id": "41359",
        "zip_code": "00210",
        "phone": "",
        "email": "",
        "www_url": "https://www.hel.fi/helsinki/fi/kulttuuri-ja-vapaa-aika/ulkoilu/veneily/kaupungin-venepaikat/kaupungin-venesatamat/pajalahden-venesatama",
        "location": "SRID=4326;POINT (24.88904799999996 60.15822599999999)",
        "municipality": "helsinki",
        "image_file": "harbors/pajalahti/41359.jpg",
        "image_link": "",
        "mooring": true,
        "electricity": true,
        "water": true,
        "waste_collection": true,
        "gate": true,
        "lighting": true,
        "availability_level": 3,
        "number_of_places": 173,
        "maximum_width": 400,
        "maximum_length": 1700,
        "maximum_depth": null,
        "suitable_boat_types": [
            2,
            3,
            4,
            5,
            6
        ]
    }
},
{
    "model": "harbors.harbor",
    "pk": 24,
    "fields": {
        "servicemap_id": "40590",
        "zip_code": "00980",
        "phone": "",
        "email": "",
        "www_url": "https://www.hel.fi/helsinki/fi/kulttuuri-ja-vapaa-aika/ulkoilu/veneily/kaupungin-venepaikat/kaupungin-venesatamat/pikku-kallahden-venesatama",
        "location": "SRID=4326;POINT (25.14131499999998 60.19891000000001)",
        "municipality": "helsinki",
        "image_file": "harbors/pikku-kallahden-venesatama/40590.jpg",
        "image_link": "",
        "mooring": true,
        "electricity": true,
        "water": true,
        "waste_collection": true,
        "gate": true,
        "lighting": true,
        "availability_level": 2,
        "number_of_places": 14,
        "maximum_width": 500,
        "maximum_length": 2200,
        "maximum_depth": null,
        "suitable_boat_types": [
            3,
            4,
            5,
            6
        ]
    }
},
{
    "model": "harbors.harbor",
    "pk": 25,
    "fields": {
        "servicemap_id": "41669",
        "zip_code": "00530",
        "phone": "",
        "email": "",
        "www_url": "https://www.hel.fi/helsinki/fi/kulttuuri-ja-vapaa-aika/ulkoilu/veneily/kaupungin-venepaikat/kaupungin-venesatamat/elaintarhanlahden-venesatama",
        "location": "SRID=4326;POINT (24.946941 60.17735700000001)",
        "municipality": "helsinki",
        "image_file": "harbors/pitkansillanranta/41669.jpg",
        "image_link": "",
        "mooring": true,
        "electricity": true,
        "water": false,
        "waste_collection": true,
        "gate": false,
        "lighting": true,
        "availability_level": 1,
        "number_of_places": 69,
        "maximum_width": 300,
        "maximum_length": 1200,
        "maximum_depth": null,
        "suitable_boat_types": [
            2,
            3,
            4,
            5
        ]
    }
},
{
    "model": "harbors.harbor",
    "pk": 26,
    "fields": {
        "servicemap_id": "41150",
        "zip_code": "00170",
        "phone": "",
        "email": "",
        "www_url": "https://www.hel.fi/helsinki/fi/kulttuuri-ja-vapaa-aika/ulkoilu/veneily/kaupungin-venepaikat/kaupungin-venesatamat/pohjoisranta",
        "location": "SRID=4326;POINT (24.96115099999998 60.172394)",
        "municipality": "helsinki",
        "image_file": "harbors/pohjoisranta/41150.jpg",
        "image_link": "",
        "mooring": true,
        "electricity": false,
        "water": true,
        "waste_collection": true,
        "gate": false,
        "lighting": true,
        "availability_level": 3,
        "number_of_places": 60,
        "maximum_width": 600,
        "maximum_length": 2000,
        "maximum_depth": null,
        "suitable_boat_types": [
            3,
            4,
            5,
            6,
            7,
            8
        ]
    }
},
{
    "model": "harbors.harbor",
    "pk": 27,
    "fields": {
        "servicemap_id": "40842",
        "zip_code": "00990",
        "phone": "",
        "email": "",
        "www_url": "https://www.hel.fi/helsinki/fi/kulttuuri-ja-vapaa-aika/ulkoilu/veneily/kaupungin-venepaikat/kaupungin-venesatamat/porslahden-venesatama",
        "location": "SRID=4326;POINT (25.17723500000004 60.20771399999997)",
        "municipality": "helsinki",
        "image_file": "harbors/porslahden-venesatama/40842.jpg",
        "image_link": "",
        "mooring": true,
        "electricity": true,
        "water": true,
        "waste_collection": true,
        "gate": true,
        "lighting": true,
        "availability_level": 3,
        "number_of_places": 61,
        "maximum_width": 350,
        "maximum_length": 800,
        "maximum_depth": null,
        "suitable_boat_types": [
            2,
            3,
            4,
            5,
            6
        ]
    }
},
{
    "model": "harbors.harbor",
    "pk": 28,
    "fields": {
        "servicemap_id": "40897",
        "zip_code": "00930",
        "phone": "",
        "email": "",
        "www_url": "https://www.hel.fi/helsinki/fi/kulttuuri-ja-vapaa-aika/ulkoilu/veneily/kaupungin-venepaikat/kaupungin-venesatamat/puotilan-venesatama",
        "location": "SRID=4326;POINT (25.10433199999997 60.207024)",
        "municipality": "helsinki",
        "image_file": "harbors/puotila/40897.jpg",
        "image_link": "",
        "mooring": true,
        "electricity": true,
        "water": true,
        "waste_collection": true,
        "gate": true,
        "lighting": true,
        "availability_level": 1,
        "number_of_places": 462,
        "maximum_width": 400,
        "maximum_length": 1500,
        "maximum_depth": null,
        "suitable_boat_types": [
            1,
            2,
            3,
            4,
            5,
            6
        ]
    }
},
{
    "model": "harbors.harbor",
    "pk": 29,
    "fields": {
        "servicemap_id": "40800",
        "zip_code": "00990",
        "phone": "",
        "email": "",
        "www_url": "https://www.hel.fi/helsinki/fi/kulttuuri-ja-vapaa-aika/ulkoilu/veneily/kaupungin-venepaikat/kaupungin-venesatamat/aurinkolahden-venesatama",
        "location": "SRID=4326;POINT (25.14818799999996 60.20052999999999)",
        "municipality": "helsinki",
        "image_file": "harbors/pursilahti/40800.jpg",
        "image_link": "",
        "mooring": true,
        "electricity": false,
        "water": false,
        "waste_collection": false,
        "gate": false,
        "lighting": true,
        "availability_level": 2,
        "number_of_places": 51,
        "maximum_width": 400,
        "maximum_length": 1200,
        "maximum_depth": null,
        "suitable_boat_types": [
            2,
            3,
            4,
            5,
            6,
            7
        ]
    }
},
{
    "model": "harbors.harbor",
    "pk": 30,
    "fields": {
        "servicemap_id": "41074",
        "zip_code": "00330",
        "phone": "",
        "email": "venepaikkavaraukset@hel.fi",
        "www_url": "https://www.hel.fi/helsinki/fi/kulttuuri-ja-vapaa-aika/ulkoilu/veneily/kaupungin-venepaikat/kaupungin-venesatamat/ramsaynrannan-venesatama",
        "location": "SRID=4326;POINT (24.88408300000004 60.19365299999998)",
        "municipality": "helsinki",
        "image_file": "harbors/ramsaynranta/41074.jpg",
        "image_link": "",
        "mooring": true,
        "electricity": true,
        "water": true,
        "waste_collection": true,
        "gate": true,
        "lighting": true,
        "availability_level": 1,
        "number_of_places": 224,
        "maximum_width": 300,
        "maximum_length": 800,
        "maximum_depth": null,
        "suitable_boat_types": [
            2,
            3,
            4,
            5
        ]
    }
},
{
    "model": "harbors.harbor",
    "pk": 31,
    "fields": {
        "servicemap_id": "40203",
        "zip_code": "00180",
        "phone": "",
        "email": "",
        "www_url": "https://www.hel.fi/helsinki/fi/kulttuuri-ja-vapaa-aika/ulkoilu/veneily/kaupungin-venepaikat/kaupungin-venesatamat/ruoholahden-venesatama",
        "location": "SRID=4326;POINT (24.915993 60.16185799999999)",
        "municipality": "helsinki",
        "image_file": "harbors/ruoholahden-kanava/40203.jpg",
        "image_link": "",
        "mooring": true,
        "electricity": false,
        "water": false,
        "waste_collection": false,
        "gate": false,
        "lighting": true,
        "availability_level": 1,
        "number_of_places": 22,
        "maximum_width": 300,
        "maximum_length": 1200,
        "maximum_depth": null,
        "suitable_boat_types": [
            2,
            3,
            4,
            5
        ]
    }
},
{
    "model": "harbors.harbor",
    "pk": 32,
    "fields": {
        "servicemap_id": "40535",
        "zip_code": "00180",
        "phone": "",
        "email": "",
        "www_url": "https://www.hel.fi/helsinki/fi/kulttuuri-ja-vapaa-aika/ulkoilu/veneily/kaupungin-venepaikat/kaupungin-venesatamat/salmisaaren-venesatama",
        "location": "SRID=4326;POINT (24.90000199999996 60.16529500000001)",
        "municipality": "helsinki",
        "image_file": "harbors/salmisaari/40535.jpg",
        "image_link": "",
        "mooring": true,
        "electricity": true,
        "water": true,
        "waste_collection": true,
        "gate": true,
        "lighting": true,
        "availability_level": 2,
        "number_of_places": 52,
        "maximum_width": 600,
        "maximum_length": 1400,
        "maximum_depth": null,
        "suitable_boat_types": [
            2,
            3,
            4,
            5
        ]
    }
},
{
    "model": "harbors.harbor",
    "pk": 33,
    "fields": {
        "servicemap_id": "40627",
        "zip_code": "00180",
        "phone": "",
        "email": "",
        "www_url": "https://www.hel.fi/helsinki/fi/kulttuuri-ja-vapaa-aika/ulkoilu/veneily/kaupungin-venepaikat/kaupungin-venesatamat/saukonpaaden-venesatama",
        "location": "SRID=4326;POINT (24.90732199999999 60.15931299999999)",
        "municipality": "helsinki",
        "image_file": "harbors/saukonpaasi/40627.jpg",
        "image_link": "",
        "mooring": true,
        "electricity": true,
        "water": true,
        "waste_collection": true,
        "gate": true,
        "lighting": true,
        "availability_level": 3,
        "number_of_places": 42,
        "maximum_width": 400,
        "maximum_length": 1000,
        "maximum_depth": null,
        "suitable_boat_types": [
            3,
            4,
            5,
            6
        ]
    }
},
{
    "model": "harbors.harbor",
    "pk": 34,
    "fields": {
        "servicemap_id": "41857",
        "zip_code": "00330",
        "phone": "",
        "email": "venepaikkavaraukset@hel.fi",
        "www_url": "https://www.hel.fi/helsinki/fi/kulttuuri-ja-vapaa-aika/ulkoilu/veneily/kaupungin-venepaikat/kaupungin-venesatamat/saunalahden-venesatama",
        "location": "SRID=4326;POINT (24.88216800000003 60.19230999999998)",
        "municipality": "helsinki",
        "image_file": "harbors/saunalahti/41857.jpg",
        "image_link": "",
        "mooring": true,
        "electricity": true,
        "water": true,
        "waste_collection": true,
        "gate": true,
        "lighting": true,
        "availability_level": 2,
        "number_of_places": 69,
        "maximum_width": 250,
        "maximum_length": 800,
        "maximum_depth": null,
        "suitable_boat_types": [
            2,
            3,
            4,
            5
        ]
    }
},
{
    "model": "harbors.harbor",
    "pk": 35,
    "fields": {
        "servicemap_id": "40876",
        "zip_code": "00170",
        "phone": "",
        "email": "",
        "www_url": "https://www.hel.fi/helsinki/fi/kulttuuri-ja-vapaa-aika/ulkoilu/veneily/kaupungin-venepaikat/kaupungin-venesatamat/sltavuoren-enesatama",
        "location": "SRID=4326;POINT (24.95591200000003 60.17663599999999)",
        "municipality": "helsinki",
        "image_file": "harbors/siltavuoren-venesatama/40876.jpg",
        "image_link": "",
        "mooring": true,
        "electricity": true,
        "water": false,
        "waste_collection": true,
        "gate": true,
        "lighting": true,
        "availability_level": 1,
        "number_of_places": 69,
        "maximum_width": 300,
        "maximum_length": 800,
        "maximum_depth": null,
        "suitable_boat_types": [
            2,
            3,
            4,
            5
        ]
    }
},
{
    "model": "harbors.harbor",
    "pk": 36,
    "fields": {
        "servicemap_id": "42276",
        "zip_code": "00820",
        "phone": "",
        "email": "",
        "www_url": "https://www.hel.fi/helsinki/fi/kulttuuri-ja-vapaa-aika/ulkoilu/veneily/kaupungin-venepaikat/kaupungin-venesatamat/stromsinlahden-venesatama",
        "location": "SRID=4326;POINT (25.06527100000002 60.19763999999999)",
        "municipality": "helsinki",
        "image_file": "harbors/stromsinlahti/42276.jpg",
        "image_link": "",
        "mooring": true,
        "electricity": true,
        "water": true,
        "waste_collection": true,
        "gate": true,
        "lighting": true,
        "availability_level": 2,
        "number_of_places": 93,
        "maximum_width": 350,
        "maximum_length": 1750,
        "maximum_depth": null,
        "suitable_boat_types": [
            2,
            3,
            4,
            5,
            6
        ]
    }
},
{
    "model": "harbors.harbor",
    "pk": 37,
    "fields": {
        "servicemap_id": "41472",
        "zip_code": "00180",
        "phone": "",
        "email": "",
        "www_url": "https://www.hel.fi/helsinki/fi/kulttuuri-ja-vapaa-aika/ulkoilu/veneily/kaupungin-venepaikat/kaupungin-venesatamat/tammasaarenallas",
        "location": "SRID=4326;POINT (24.90518811639428 60.16102670629775)",
        "municipality": "helsinki",
        "image_file": "harbors/tammasaarenallas-1/41472.jpg",
        "image_link": "",
        "mooring": true,
        "electricity": false,
        "water": true,
        "waste_collection": true,
        "gate": false,
        "lighting": true,
        "availability_level": 1,
        "number_of_places": 31,
        "maximum_width": 300,
        "maximum_length": 1300,
        "maximum_depth": null,
        "suitable_boat_types": [
            3,
            4,
            5,
            6
        ]
    }
},
{
    "model": "harbors.harbor",
    "pk": 38,
    "fields": {
        "servicemap_id": "42136",
        "zip_code": "00170",
        "phone": "",
        "email": "",
        "www_url": "https://www.hel.fi/helsinki/fi/kulttuuri-ja-vapaa-aika/ulkoilu/veneily/kaupungin-venepaikat/kaupungin-venesatamat/tervasaari",
        "location": "SRID=4326;POINT (24.96509200000001 60.17399199999996)",
        "municipality": "helsinki",
        "image_file": "harbors/tervasaari/42136.jpg",
        "image_link": "",
        "mooring": true,
        "electricity": true,
        "water": true,
        "waste_collection": true,
        "gate": true,
        "lighting": true,
        "availability_level": 1,
        "number_of_places": 237,
        "maximum_width": 700,
        "maximum_length": 2000,
        "maximum_depth": null,
        "suitable_boat_types": [
            2,
            3,
            4,
            5,
            6,
            7
        ]
    }
},
{
    "model": "harbors.harbor",
    "pk": 39,
    "fields": {
        "servicemap_id": "41415",
        "zip_code": "00860",
        "phone": "",
        "email": "",
        "www_url": "https://www.hel.fi/helsinki/fi/kulttuuri-ja-vapaa-aika/ulkoilu/veneily/kaupungin-venepaikat/kaupungin-venesatamat/vasikkasaaren-venesatama",
        "location": "SRID=4326;POINT (25.01452799999996 60.15482999999995)",
        "municipality": "helsinki",
        "image_file": "harbors/vasikkasaari/41415.jpg",
        "image_link": "",
        "mooring": true,
        "electricity": false,
        "water": false,
        "waste_collection": false,
        "gate": false,
        "lighting": false,
        "availability_level": 3,
        "number_of_places": 32,
        "maximum_width": 350,
        "maximum_length": 1500,
        "maximum_depth": null,
        "suitable_boat_types": [
            2,
            3,
            4,
            5
        ]
    }
},
{
    "model": "harbors.harbor",
    "pk": 40,
    "fields": {
        "servicemap_id": "41637",
        "zip_code": "00980",
        "phone": "",
        "email": "",
        "www_url": "https://www.hel.fi/helsinki/fi/kulttuuri-ja-vapaa-aika/ulkoilu/veneily/kaupungin-venepaikat/kaupungin-venesatamat/vuosaarenlahden-venesatama",
        "location": "SRID=4326;POINT (25.18621999999997 60.21003700000001)",
        "municipality": "helsinki",
        "image_file": "harbors/vuosaarenlahden-venesatama/41637.jpg",
        "image_link": "",
        "mooring": true,
        "electricity": true,
        "water": true,
        "waste_collection": true,
        "gate": true,
        "lighting": true,
        "availability_level": 1,
        "number_of_places": 250,
        "maximum_width": 500,
        "maximum_length": 1800,
        "maximum_depth": null,
        "suitable_boat_types": [
            2,
            3,
            4,
            5,
            6
        ]
    }
},
{
    "model": "harbors.harbor",
    "pk": 41,
    "fields": {
        "servicemap_id": "42130",
        "zip_code": "00570",
        "phone": "",
        "email": "",
        "www_url": "https://www.hel.fi/helsinki/fi/kulttuuri-ja-vapaa-aika/ulkoilu/veneily/kaupungin-venepaikat/kaupungin-venesatamat/vahaniityn-venesatama",
        "location": "SRID=4326;POINT (25.01650000000001 60.18398699999997)",
        "municipality": "helsinki",
        "image_file": "harbors/vahaniitty/42130.jpg",
        "image_link": "",
        "mooring": true,
        "electricity": true,
        "water": true,
        "waste_collection": true,
        "gate": true,
        "lighting": true,
        "availability_level": 2,
        "number_of_places": 35,
        "maximum_width": 350,
        "maximum_length": 1200,
        "maximum_depth": null,
        "suitable_boat_types": [
            2,
            3,
            4,
            5,
            6
        ]
    }
},
{
    "model": "harbors.harbor",
    "pk": 42,
    "fields": {
        "servicemap_id": "48272",
        "zip_code": "00170",
        "phone": "",
        "email": "",
        "www_url": "https://www.hel.fi/helsinki/fi/kulttuuri-ja-vapaa-aika/ulkoilu/veneily/kaupungin-venepaikat/kaupungin-venesatamat/katajanokan-venesatama",
        "location": "SRID=4326;POINT (24.96636079762264 60.16910397273679)",
        "municipality": "helsinki",
        "image_file": "harbors/katajanokka-rm/48272.jpg",
        "image_link": "",
        "mooring": true,
        "electricity": true,
        "water": true,
        "waste_collection": true,
        "gate": false,
        "lighting": true,
        "availability_level": 3,
        "number_of_places": 16,
        "maximum_width": 300,
        "maximum_length": 1300,
        "maximum_depth": null,
        "suitable_boat_types": [
            3,
            4,
            5,
            6
        ]
    }
},
{
    "model": "harbors.harbor",
    "pk": 43,
    "fields": {
        "servicemap_id": "41189",
        "zip_code": "00810",
        "phone": "",
        "email": "",
        "www_url": "https://www.hel.fi/helsinki/fi/kulttuuri-ja-vapaa-aika/ulkoilu/veneily/kaupungin-venepaikat/kaupungin-venesatamat/kipparlahden-venesatama",
        "location": "SRID=4326;POINT (25.02330600000002 60.19106699999998)",
        "municipality": "helsinki",
        "image_file": "harbors/kipparlahti-rm/41189.jpg",
        "image_link": "",
        "mooring": true,
        "electricity": false,
        "water": false,
        "waste_collection": true,
        "gate": false,
        "lighting": false,
        "availability_level": 2,
        "number_of_places": 25,
        "maximum_width": 300,
        "maximum_length": 800,
        "maximum_depth": null,
        "suitable_boat_types": [
            2,
            3,
            4,
            5,
            6
        ]
    }
},
{
    "model": "harbors.harbor",
    "pk": 44,
    "fields": {
        "servicemap_id": "40359",
        "zip_code": "00570",
        "phone": "",
        "email": "",
        "www_url": "https://www.hel.fi/helsinki/fi/kulttuuri-ja-vapaa-aika/ulkoilu/veneily/kaupungin-venepaikat/kaupungin-venesatamat/mustikkamaan-venesatama",
        "location": "SRID=4326;POINT (24.99457400000004 60.18247199999998)",
        "municipality": "helsinki",
        "image_file": "harbors/mustikkamaa-rm/40359.jpg",
        "image_link": "",
        "mooring": true,
        "electricity": false,
        "water": false,
        "waste_collection": true,
        "gate": false,
        "lighting": true,
        "availability_level": 1,
        "number_of_places": 10,
        "maximum_width": 350,
        "maximum_length": 1100,
        "maximum_depth": null,
        "suitable_boat_types": [
            3,
            4,
            5
        ]
    }
},
{
    "model": "harbors.harbor",
    "pk": 45,
    "fields": {
        "servicemap_id": "41359",
        "zip_code": "00210",
        "phone": "",
        "email": "",
        "www_url": "https://www.hel.fi/helsinki/fi/kulttuuri-ja-vapaa-aika/ulkoilu/veneily/kaupungin-venepaikat/kaupungin-venesatamat/pajalahden-venesatama",
        "location": "SRID=4326;POINT (24.88626923146144 60.15691264404675)",
        "municipality": "helsinki",
        "image_file": "harbors/pajalahti-rm/41359.jpg",
        "image_link": "",
        "mooring": true,
        "electricity": false,
        "water": true,
        "waste_collection": true,
        "gate": true,
        "lighting": true,
        "availability_level": 3,
        "number_of_places": 16,
        "maximum_width": 300,
        "maximum_length": 900,
        "maximum_depth": null,
        "suitable_boat_types": [
            2,
            3,
            4,
            5,
            6
        ]
    }
},
{
    "model": "harbors.harbor",
    "pk": 46,
    "fields": {
        "servicemap_id": "40393",
        "zip_code": "00830",
        "phone": "",
        "email": "",
        "www_url": "https://www.hel.fi/helsinki/fi/kulttuuri-ja-vapaa-aika/ulkoilu/veneily/kaupungin-venepaikat/kaupungin-venesatamat/airorannan-venesatama",
        "location": "SRID=4326;POINT (25.0665395178596 60.18808000000039)",
        "municipality": "helsinki",
        "image_file": "harbors/airoranta-b/40393.jpg",
        "image_link": "",
        "mooring": false,
        "electricity": false,
        "water": false,
        "waste_collection": false,
        "gate": false,
        "lighting": false,
        "availability_level": 3,
        "number_of_places": 5,
        "maximum_width": 200,
        "maximum_length": 400,
        "maximum_depth": null,
        "suitable_boat_types": [
            2,
            3
        ]
    }
},
{
    "model": "harbors.harbor",
    "pk": 47,
    "fields": {
        "servicemap_id": "40864",
        "zip_code": "00810",
        "phone": "",
        "email": "",
        "www_url": "https://www.hel.fi/helsinki/fi/kulttuuri-ja-vapaa-aika/ulkoilu/veneily/kaupungin-venepaikat/kaupungin-venesatamat/laivalahden-venesatama",
        "location": "SRID=4326;POINT (25.02545366599298 60.18744105954804)",
        "municipality": "helsinki",
        "image_file": "harbors/laivalahti-reginankuja/40864.jpg",
        "image_link": "",
        "mooring": true,
        "electricity": false,
        "water": true,
        "waste_collection": false,
        "gate": false,
        "lighting": true,
        "availability_level": 3,
        "number_of_places": 7,
        "maximum_width": 700,
        "maximum_length": 2500,
        "maximum_depth": null,
        "suitable_boat_types": [
            3,
            4,
            5,
            7,
            8
        ]
    }
},
{
    "model": "harbors.harbor",
    "pk": 48,
    "fields": {
        "servicemap_id": "40864",
        "zip_code": "00810",
        "phone": "",
        "email": "",
        "www_url": "https://www.hel.fi/helsinki/fi/kulttuuri-ja-vapaa-aika/ulkoilu/veneily/kaupungin-venepaikat/kaupungin-venesatamat/laivalahden-venesatama",
        "location": "SRID=4326;POINT (25.02497623278769 60.1852353794545)",
        "municipality": "helsinki",
        "image_file": "harbors/laivalahti-am/40864.jpg",
        "image_link": "",
        "mooring": true,
        "electricity": false,
        "water": true,
        "waste_collection": true,
        "gate": false,
        "lighting": true,
        "availability_level": 3,
        "number_of_places": 30,
        "maximum_width": 700,
        "maximum_length": 1400,
        "maximum_depth": null,
        "suitable_boat_types": [
            3,
            4,
            5,
            6,
            7,
            8
        ]
    }
},
{
    "model": "harbors.harbor",
    "pk": 49,
    "fields": {
        "servicemap_id": "41454",
        "zip_code": "00530",
        "phone": "",
        "email": "",
        "www_url": "https://www.hel.fi/helsinki/fi/kulttuuri-ja-vapaa-aika/ulkoilu/veneily/kaupungin-venepaikat/kaupungin-venesatamat/merihaan-venesatama",
        "location": "SRID=4326;POINT (24.96268346431036 60.17795892787458)",
        "municipality": "helsinki",
        "image_file": "harbors/merihaka-f/41454.jpg",
        "image_link": "",
        "mooring": true,
        "electricity": true,
        "water": true,
        "waste_collection": true,
        "gate": false,
        "lighting": true,
        "availability_level": 2,
        "number_of_places": 10,
        "maximum_width": 400,
        "maximum_length": 2100,
        "maximum_depth": null,
        "suitable_boat_types": [
            3,
            4,
            5,
            6
        ]
    }
},
{
    "model": "harbors.harbor",
    "pk": 50,
    "fields": {
        "servicemap_id": "40971",
        "zip_code": "00140",
        "phone": "",
        "email": "",
        "www_url": "https://www.hel.fi/helsinki/fi/kulttuuri-ja-vapaa-aika/ulkoilu/veneily/kaupungin-venepaikat/kaupungin-venesatamat/merisatama",
        "location": "SRID=4326;POINT (24.95173726123831 60.15503326745377)",
        "municipality": "helsinki",
        "image_file": "harbors/ehrenstromintie-22/40971.jpg",
        "image_link": "",
        "mooring": true,
        "electricity": true,
        "water": true,
        "waste_collection": true,
        "gate": true,
        "lighting": true,
        "availability_level": 3,
        "number_of_places": 80,
        "maximum_width": 350,
        "maximum_length": 1500,
        "maximum_depth": null,
        "suitable_boat_types": [
            2,
            3,
            4,
            5,
            6
        ]
    }
},
{
    "model": "harbors.harbor",
    "pk": 51,
    "fields": {
        "servicemap_id": "41472",
        "zip_code": "00180",
        "phone": "",
        "email": "",
        "www_url": "https://www.hel.fi/helsinki/fi/kulttuuri-ja-vapaa-aika/ulkoilu/veneily/kaupungin-venepaikat/kaupungin-venesatamat/tammasaarenallas",
        "location": "SRID=4326;POINT (24.90454438623086 60.16034873726631)",
        "municipality": "helsinki",
        "image_file": "harbors/tammasaarenallas-32/41472.jpg",
        "image_link": "",
        "mooring": true,
        "electricity": true,
        "water": true,
        "waste_collection": true,
        "gate": false,
        "lighting": true,
        "availability_level": 1,
        "number_of_places": 44,
        "maximum_width": 500,
        "maximum_length": 1700,
        "maximum_depth": null,
        "suitable_boat_types": [
            3,
            4,
            5,
            6,
            8
        ]
    }
},
{
    "model": "harbors.harbor",
    "pk": 52,
    "fields": {
        "servicemap_id": "41390",
        "zip_code": "00180",
        "phone": "",
        "email": "",
        "www_url": "https://www.hel.fi/helsinki/fi/kulttuuri-ja-vapaa-aika/ulkoilu/veneily/kaupungin-venepaikat/kaupungin-venesatamat/hietalahdenallas",
        "location": "SRID=4326;POINT (24.9269634192952 60.1609861460934)",
        "municipality": "helsinki",
        "image_file": "harbors/hietalahdenallas-jatkasaaren-puoli/41390.jpg",
        "image_link": "",
        "mooring": true,
        "electricity": false,
        "water": false,
        "waste_collection": true,
        "gate": false,
        "lighting": true,
        "availability_level": 3,
        "number_of_places": 5,
        "maximum_width": 500,
        "maximum_length": 1800,
        "maximum_depth": null,
        "suitable_boat_types": []
    }
}
]
