{
	"id": "fe4f7e0b-f462-4699-9090-189a30ba4083",
	"name": "Customers Service Localhost",
	"values": [
		{
			"key": "url",
			"value": "http://localhost:3000",
			"enabled": true
		}
	],
	"_postman_variable_scope": "environment",
	"_postman_exported_at": "2021-11-06T20:04:03.103Z",
	"_postman_exported_using": "Postman/9.1.3"
}