{
	"info": {
		"_postman_id": "752c765f-5d0d-4fd2-ad0f-913ecdde58c0",
		"name": "[API e2e Tests] Customer Service",
		"schema": "https://schema.getpostman.com/json/collection/v2.1.0/collection.json"
	},
	"item": [
		{
			"name": "get Customers",
			"event": [
				{
					"listen": "test",
					"script": {
						"exec": [
							"pm.test(\"Status code is 200\", () => {\r",
							"    pm.expect(pm.response.code).to.eql(200);\r",
							"});\r",
							"\r",
							"pm.test(\"Status code name has string\", () => {\r",
							"  pm.response.to.have.status(\"OK\");\r",
							"});\r",
							"\r",
							"pm.test(\"Content-Type header is present\", () => {\r",
							"    pm.response.to.have.header('Content-Type');\r",
							"});\r",
							"\r",
							"pm.test(\"Content-Type header is application/json\", () => {\r",
							"  pm.expect(pm.response.headers.get('Content-Type')).to.eql('application/json; charset=utf-8');\r",
							"});\r",
							"\r",
							"const schema = {\r",
							"    \"type\": \"array\",\r",
							"    \"items\": { \"$ref\": \"#/definitions/customer\"},\r",
							"    \"definitions\": {\r",
							"        \"customer\": {\r",
							"            \"type\": \"object\",\r",
							"            \"required\": [\"id\", \"firstName\", \"lastName\", \"title\", \"location\"],\r",
							"            \"properties\": {\r",
							"                \"id\": {\r",
							"                    \"type\": \"number\",\r",
							"                    \"description\": \"id\"\r",
							"                },\r",
							"                \"firstName\": {\r",
							"                    \"type\": \"string\",\r",
							"                    \"description\": \"First Name\"\r",
							"                },\r",
							"                \"lastName\": {\r",
							"                    \"type\": \"string\",\r",
							"                    \"description\": \"Last Name\"\r",
							"                },\r",
							"                \"title\": {\r",
							"                    \"type\": \"string\",\r",
							"                    \"description\": \"Title\"\r",
							"                },\r",
							"                \"location\": {\r",
							"                    \"type\": \"array\",\r",
							"                    \"description\": \"Location\"\r",
							"                },\r",
							"            }\r",
							"        }\r",
							"    }\r",
							"};\r",
							"\r",
							"pm.test('Schema is valid', () => {\r",
							"  pm.response.to.have.jsonSchema(schema);\r",
							"});"
						],
						"type": "text/javascript"
					}
				}
			],
			"request": {
				"method": "GET",
				"header": [],
				"url": {
					"raw": "{{url}}/customers",
					"host": [
						"{{url}}"
					],
					"path": [
						"customers"
					]
				}
			},
			"response": []
		},
		{
			"name": "get Customers by id",
			"event": [
				{
					"listen": "test",
					"script": {
						"exec": [
							"pm.test(\"Status code is 200\", () => {\r",
							"    pm.expect(pm.response.code).to.eql(200);\r",
							"});\r",
							"\r",
							"pm.test(\"Status code name has string\", () => {\r",
							"  pm.response.to.have.status(\"OK\");\r",
							"});\r",
							"\r",
							"pm.test(\"Content-Type header is present\", () => {\r",
							"    pm.response.to.have.header('Content-Type');\r",
							"});\r",
							"\r",
							"pm.test(\"Content-Type header is application/json\", () => {\r",
							"  pm.expect(pm.response.headers.get('Content-Type')).to.eql('application/json; charset=utf-8');\r",
							"});\r",
							"\r",
							"const schema = {\r",
							"  \"type\": \"object\",\r",
							"  \"properties\": {\r",
							"    \"id\": {\r",
							"      \"type\": \"integer\"\r",
							"    },\r",
							"    \"firstName\": {\r",
							"      \"type\": \"string\"\r",
							"    },\r",
							"    \"lastName\": {\r",
							"      \"type\": \"string\"\r",
							"    },\r",
							"    \"title\": {\r",
							"      \"type\": \"string\"\r",
							"    },\r",
							"    \"location\": {\r",
							"      \"type\": \"array\",\r",
							"      \"items\": [\r",
							"        {\r",
							"          \"type\": \"string\"\r",
							"        },\r",
							"        {\r",
							"          \"type\": \"string\"\r",
							"        }\r",
							"      ]\r",
							"    }\r",
							"  },\r",
							"  \"required\": [\r",
							"    \"id\",\r",
							"    \"firstName\",\r",
							"    \"lastName\",\r",
							"    \"title\",\r",
							"    \"location\"\r",
							"  ]\r",
							"};\r",
							"\r",
							"pm.test('Schema is valid', () => {\r",
							"  pm.response.to.have.jsonSchema(schema);\r",
							"});"
						],
						"type": "text/javascript"
					}
				}
			],
			"request": {
				"method": "GET",
				"header": [],
				"url": {
					"raw": "{{url}}/customers/1",
					"host": [
						"{{url}}"
					],
					"path": [
						"customers",
						"1"
					]
				}
			},
			"response": []
		},
		{
			"name": "post Customers",
			"event": [
				{
					"listen": "test",
					"script": {
						"exec": [
							"pm.test(\"Status code is 201\", () => {\r",
							"    pm.expect(pm.response.code).to.eql(201);\r",
							"});\r",
							"\r",
							"pm.test(\"Status code name has string\", () => {\r",
							"  pm.response.to.have.status(\"Created\");\r",
							"});\r",
							"\r",
							"pm.test(\"Content-Type header is present\", () => {\r",
							"    pm.response.to.have.header('Content-Type');\r",
							"});\r",
							"\r",
							"pm.test(\"Content-Type header is application/json\", () => {\r",
							"  pm.expect(pm.response.headers.get('Content-Type')).to.eql('application/json; charset=utf-8');\r",
							"});\r",
							"\r",
							"const schema = {\r",
							"  \"type\": \"object\",\r",
							"  \"properties\": {\r",
							"    \"id\": {\r",
							"      \"type\": \"integer\"\r",
							"    },\r",
							"    \"firstName\": {\r",
							"      \"type\": \"string\"\r",
							"    },\r",
							"    \"lastName\": {\r",
							"      \"type\": \"string\"\r",
							"    },\r",
							"    \"title\": {\r",
							"      \"type\": \"string\"\r",
							"    },\r",
							"    \"location\": {\r",
							"      \"type\": \"array\",\r",
							"      \"items\": [\r",
							"        {\r",
							"          \"type\": \"string\"\r",
							"        }\r",
							"      ]\r",
							"    }\r",
							"  },\r",
							"  \"required\": [\r",
							"    \"id\",\r",
							"    \"firstName\",\r",
							"    \"lastName\",\r",
							"    \"title\",\r",
							"    \"location\"\r",
							"  ]\r",
							"};\r",
							"\r",
							"pm.test('Schema is valid', () => {\r",
							"  pm.response.to.have.jsonSchema(schema);\r",
							"});"
						],
						"type": "text/javascript"
					}
				}
			],
			"request": {
				"method": "POST",
				"header": [],
				"body": {
					"mode": "raw",
					"raw": "{\r\n    \"id\": 5,\r\n    \"firstName\": \"Test\",\r\n    \"lastName\": \"Ops\",\r\n    \"title\": \"E2e\",\r\n    \"location\": [\"Boston\"]\r\n}",
					"options": {
						"raw": {
							"language": "json"
						}
					}
				},
				"url": {
					"raw": "{{url}}/customers",
					"host": [
						"{{url}}"
					],
					"path": [
						"customers"
					]
				}
			},
			"response": []
		},
		{
			"name": "delete Customers",
			"event": [
				{
					"listen": "test",
					"script": {
						"exec": [
							"pm.test(\"Status code is 200\", () => {\r",
							"    pm.expect(pm.response.code).to.eql(200);\r",
							"});\r",
							"\r",
							"pm.test(\"Status code name has string\", () => {\r",
							"  pm.response.to.have.status(\"OK\");\r",
							"});\r",
							"\r",
							""
						],
						"type": "text/javascript"
					}
				}
			],
			"request": {
				"method": "DELETE",
				"header": [],
				"url": {
					"raw": "{{url}}/customers/5",
					"host": [
						"{{url}}"
					],
					"path": [
						"customers",
						"5"
					]
				}
			},
			"response": []
		}
	]
}