%YAML 1.1
%TAG !u! tag:unity3d.com,2011:
--- !u!78 &1
TagManager:
  serializedVersion: 2
  tags:
  - CameraTarget
  - Terrain
  - Mushroom
  - Enemy
  - DistructibleBlock
  - Water
  - GoombaHead
  - Flower
  - Block
  - Goomba
  - Coin
  - CoinBlock
  - Kroopa
  - LimitWall
  - Pipe
  - FireBall
  - Shield
  - MovingShield
  - Star
  - InvisibleWall
  - ActivateEnemiesOnTrigger
  - InvisibleLimitWall
  - WarpGo
  - WarpReturn
  - EndGame
  - StarMode
  layers:
  - Default
  - TransparentFX
  - Ignore Raycast
  - 
  - Water
  - UI
  - 
  - 
  - CameraTarget
  - IndistructibleBlock
  - DestructibleBlock
  - SpecialBlock
  - CoinBlock
  - Coin
  - Pipe
  - ActivateEnemiesOnTrigger
  - PowerUp
  - Enemies
  - Ground
  - 
  - 
  - 
  - 
  - 
  - 
  - 
  - 
  - 
  - 
  - 
  - 
  - 
  m_SortingLayers:
  - name: Default
    uniqueID: 0
    locked: 0
