%YAML 1.1
%TAG !u! tag:unity3d.com,2011:
--- !u!114 &11400000
MonoBehaviour:
  m_ObjectHideFlags: 0
  m_CorrespondingSourceObject: {fileID: 0}
  m_PrefabInstance: {fileID: 0}
  m_PrefabAsset: {fileID: 0}
  m_GameObject: {fileID: 0}
  m_Enabled: 1
  m_EditorHideFlags: 0
  m_Script: {fileID: 11500000, guid: ef3ee733ff9d2604a80f156db05fca5a, type: 3}
  m_Name: Wings_Heavy
  m_EditorClassIdentifier: 
  m_currentEquipType: 1
  m_equipPrefab: {fileID: 4131160092740851326, guid: 5e07b29061a3d6f419e662bbd931bc43,
    type: 3}
  m_equipmentSprite: {fileID: 21300000, guid: 6d04168c2877d044a8482c5244ffd7d5, type: 3}
  m_equipmentStats:
    Speed: 0
    Acceleration: 5
    Manovrability: 1
    Mass: 0
