%YAML 1.1
%TAG !u! tag:unity3d.com,2011:
--- !u!114 &11400000
MonoBehaviour:
  m_ObjectHideFlags: 0
  m_CorrespondingSourceObject: {fileID: 0}
  m_PrefabInstance: {fileID: 0}
  m_PrefabAsset: {fileID: 0}
  m_GameObject: {fileID: 0}
  m_Enabled: 1
  m_EditorHideFlags: 0
  m_Script: {fileID: 11500000, guid: 72a8b0a0ab3b59b4287baf190d624ba6, type: 3}
  m_Name: CharactersList
  m_EditorClassIdentifier: 
  Characters:
  - {fileID: 11400000, guid: 928478b37861e814a9e9d347f54f5907, type: 2}
  - {fileID: 11400000, guid: b2dbc1581d4e3ea418b46e04a029703a, type: 2}
  - {fileID: 11400000, guid: 433776ae477c15840be4455fc50b4e63, type: 2}
