%YAML 1.1
%TAG !u! tag:unity3d.com,2011:
--- !u!114 &11400000
MonoBehaviour:
  m_ObjectHideFlags: 0
  m_CorrespondingSourceObject: {fileID: 0}
  m_PrefabInstance: {fileID: 0}
  m_PrefabAsset: {fileID: 0}
  m_GameObject: {fileID: 0}
  m_Enabled: 1
  m_EditorHideFlags: 0
  m_Script: {fileID: 11500000, guid: ef3ee733ff9d2604a80f156db05fca5a, type: 3}
  m_Name: Wings_Normal
  m_EditorClassIdentifier: 
  m_currentEquipType: 1
  m_equipPrefab: {fileID: 1569658915726840009, guid: 320320a976f46404aaa600a694fa437a,
    type: 3}
  m_equipmentSprite: {fileID: 21300000, guid: 6b325fcc38f7d1e41a2f0f93374bba39, type: 3}
  m_equipmentStats:
    Speed: 0
    Acceleration: 2
    Manovrability: 4
    Mass: 0
