%YAML 1.1
%TAG !u! tag:unity3d.com,2011:
--- !u!114 &11400000
MonoBehaviour:
  m_ObjectHideFlags: 0
  m_CorrespondingSourceObject: {fileID: 0}
  m_PrefabInstance: {fileID: 0}
  m_PrefabAsset: {fileID: 0}
  m_GameObject: {fileID: 0}
  m_Enabled: 1
  m_EditorHideFlags: 0
  m_Script: {fileID: 11500000, guid: ef3ee733ff9d2604a80f156db05fca5a, type: 3}
  m_Name: Thrusters_Normal
  m_EditorClassIdentifier: 
  m_currentEquipType: 3
  m_equipPrefab: {fileID: 424766143443548969, guid: 3d5a9f50419c663468dcf0f1b19253da,
    type: 3}
  m_equipmentSprite: {fileID: 21300000, guid: 962a49734c8594042a7afebb8f53c3e7, type: 3}
  m_equipmentStats:
    Speed: 4
    Acceleration: 2
    Manovrability: 0
    Mass: 0
