%YAML 1.1
%TAG !u! tag:unity3d.com,2011:
--- !u!114 &11400000
MonoBehaviour:
  m_ObjectHideFlags: 0
  m_CorrespondingSourceObject: {fileID: 0}
  m_PrefabInstance: {fileID: 0}
  m_PrefabAsset: {fileID: 0}
  m_GameObject: {fileID: 0}
  m_Enabled: 1
  m_EditorHideFlags: 0
  m_Script: {fileID: 11500000, guid: ef3ee733ff9d2604a80f156db05fca5a, type: 3}
  m_Name: Engine_Normal
  m_EditorClassIdentifier: 
  m_currentEquipType: 2
  m_equipPrefab: {fileID: 139149387205879831, guid: 932dbf679dea4004eb07711155b37072,
    type: 3}
  m_equipmentSprite: {fileID: 21300000, guid: fad47eae1b027674dade59120c05597f, type: 3}
  m_equipmentStats:
    Speed: 4
    Acceleration: 0
    Manovrability: 0
    Mass: 2
