%YAML 1.1
%TAG !u! tag:unity3d.com,2011:
--- !u!114 &11400000
MonoBehaviour:
  m_ObjectHideFlags: 0
  m_CorrespondingSourceObject: {fileID: 0}
  m_PrefabInstance: {fileID: 0}
  m_PrefabAsset: {fileID: 0}
  m_GameObject: {fileID: 0}
  m_Enabled: 1
  m_EditorHideFlags: 0
  m_Script: {fileID: 11500000, guid: ef3ee733ff9d2604a80f156db05fca5a, type: 3}
  m_Name: Body_Manov
  m_EditorClassIdentifier: 
  m_currentEquipType: 0
  m_equipPrefab: {fileID: 5367558552342971584, guid: b4bd6407bf854c24a8f86225ce78a6b3,
    type: 3}
  m_equipmentSprite: {fileID: 21300000, guid: 79359302d61bbe44c9ac14fa94ab836a, type: 3}
  m_equipmentStats:
    Speed: 0
    Acceleration: 0
    Manovrability: 2
    Mass: 4
