{
    "arenaParam_amountEnemies": {
        "lesson_num": 3
    },
    "arenaParam_enemiesSpeed": {
        "lesson_num": 3
    },
    "ShooterAgent": {
        "checkpoints": [
            {
                "steps": 367761,
                "file_path": "results\\Shooter1-curriculum\\ShooterAgent\\ShooterAgent-367761.onnx",
                "reward": 3.906591668150049,
                "creation_time": 1617779246.5083518
            }
        ],
        "final_checkpoint": {
            "steps": 367761,
            "file_path": "results\\Shooter1-curriculum\\ShooterAgent.onnx",
            "reward": 3.906591668150049,
            "creation_time": 1617779246.5083518
        }
    },
    "metadata": {
        "stats_format_version": "0.2.0",
        "mlagents_version": "0.23.0",
        "torch_version": "1.7.1+cu110",
        "tensorflow_version": -1
    }
}