{
    "name": "root",
    "gauges": {
        "MoveToGoal.Policy.Entropy.mean": {
            "value": 1.410273790359497,
            "min": 1.410273790359497,
            "max": 1.4168990850448608,
            "count": 2
        },
        "MoveToGoal.Environment.EpisodeLength.mean": {
            "value": 187.54511278195488,
            "min": 144.26706231454006,
            "max": 187.54511278195488,
            "count": 2
        },
        "MoveToGoal.Policy.ExtrinsicValueEstimate.mean": {
            "value": 0.3747744858264923,
            "min": 0.0688752606511116,
            "max": 0.3747744858264923,
            "count": 2
        },
        "MoveToGoal.Environment.CumulativeReward.mean": {
            "value": 0.018867924528301886,
            "min": -0.4035608308605341,
            "max": 0.018867924528301886,
            "count": 2
        },
        "MoveToGoal.Policy.ExtrinsicReward.mean": {
            "value": 0.018867924528301886,
            "min": -0.4035608308605341,
            "max": 0.018867924528301886,
            "count": 2
        },
        "MoveToGoal.Losses.PolicyLoss.mean": {
            "value": 0.02564854082496216,
            "min": 0.023016075650230047,
            "max": 0.02564854082496216,
            "count": 2
        },
        "MoveToGoal.Losses.ValueLoss.mean": {
            "value": 0.007951716464788964,
            "min": 0.007951716464788964,
            "max": 0.07172928840542833,
            "count": 2
        },
        "MoveToGoal.Policy.LearningRate.mean": {
            "value": 0.00025674493441835996,
            "min": 0.00025674493441835996,
            "max": 0.00028457340514220005,
            "count": 2
        },
        "MoveToGoal.Policy.Epsilon.mean": {
            "value": 0.18558164000000002,
            "min": 0.18558164000000002,
            "max": 0.19485780000000003,
            "count": 2
        },
        "MoveToGoal.Policy.Beta.mean": {
            "value": 0.004280523835999999,
            "min": 0.004280523835999999,
            "max": 0.00474340422,
            "count": 2
        },
        "MoveToGoal.IsTraining.mean": {
            "value": 1.0,
            "min": 1.0,
            "max": 1.0,
            "count": 2
        }
    },
    "metadata": {
        "timer_format_version": "0.1.0",
        "start_time_seconds": "1614761723",
        "python_version": "3.7.9 (tags/v3.7.9:13c94747c7, Aug 17 2020, 18:58:18) [MSC v.1900 64 bit (AMD64)]",
        "command_line_arguments": "E:\\Horizon_School\\3 Anno\\GitProjects_Unity_2020-2021\\BonettoChristopher_MachineLearning_Project\\venv\\Scripts\\mlagents-learn --run-id=MoveToGoalBehavior3",
        "mlagents_version": "0.23.0",
        "mlagents_envs_version": "0.23.0",
        "communication_protocol_version": "1.3.0",
        "pytorch_version": "1.7.1+cu110",
        "numpy_version": "1.18.5",
        "end_time_seconds": "1614761843"
    },
    "total": 119.4435756,
    "count": 1,
    "self": 0.0038052000000021735,
    "children": {
        "run_training.setup": {
            "total": 0.2733281999999999,
            "count": 1,
            "self": 0.2733281999999999
        },
        "TrainerController.start_learning": {
            "total": 119.1664422,
            "count": 1,
            "self": 0.26422960000007834,
            "children": {
                "TrainerController._reset_env": {
                    "total": 6.7871379,
                    "count": 1,
                    "self": 6.7871379
                },
                "TrainerController.advance": {
                    "total": 111.80945929999993,
                    "count": 7848,
                    "self": 0.15353959999998779,
                    "children": {
                        "env_step": {
                            "total": 111.65591969999994,
                            "count": 7848,
                            "self": 82.03521730000047,
                            "children": {
                                "SubprocessEnvManager._take_step": {
                                    "total": 29.487235499999187,
                                    "count": 7848,
                                    "self": 0.7914767999992698,
                                    "children": {
                                        "TorchPolicy.evaluate": {
                                            "total": 28.695758699999917,
                                            "count": 7397,
                                            "self": 10.815648100000196,
                                            "children": {
                                                "TorchPolicy.sample_actions": {
                                                    "total": 17.88011059999972,
                                                    "count": 7397,
                                                    "self": 17.88011059999972
                                                }
                                            }
                                        }
                                    }
                                },
                                "workers": {
                                    "total": 0.1334669000002897,
                                    "count": 7847,
                                    "self": 0.0,
                                    "children": {
                                        "worker_root": {
                                            "total": 113.80888199999927,
                                            "count": 7847,
                                            "is_parallel": true,
                                            "self": 50.73127339999905,
                                            "children": {
                                                "steps_from_proto": {
                                                    "total": 0.0008097000000004684,
                                                    "count": 1,
                                                    "is_parallel": true,
                                                    "self": 0.00015360000000086416,
                                                    "children": {
                                                        "_process_vector_observation": {
                                                            "total": 0.0006560999999996042,
                                                            "count": 2,
                                                            "is_parallel": true,
                                                            "self": 0.0006560999999996042
                                                        }
                                                    }
                                                },
                                                "UnityEnvironment.step": {
                                                    "total": 63.07679890000023,
                                                    "count": 7847,
                                                    "is_parallel": true,
                                                    "self": 1.686310900000052,
                                                    "children": {
                                                        "UnityEnvironment._generate_step_input": {
                                                            "total": 3.3030594999999785,
                                                            "count": 7847,
                                                            "is_parallel": true,
                                                            "self": 3.3030594999999785
                                                        },
                                                        "communicator.exchange": {
                                                            "total": 55.082263500000096,
                                                            "count": 7847,
                                                            "is_parallel": true,
                                                            "self": 55.082263500000096
                                                        },
                                                        "steps_from_proto": {
                                                            "total": 3.005165000000103,
                                                            "count": 7847,
                                                            "is_parallel": true,
                                                            "self": 0.8479487000001873,
                                                            "children": {
                                                                "_process_vector_observation": {
                                                                    "total": 2.1572162999999156,
                                                                    "count": 15694,
                                                                    "is_parallel": true,
                                                                    "self": 2.1572162999999156
                                                                }
                                                            }
                                                        }
                                                    }
                                                }
                                            }
                                        }
                                    }
                                }
                            }
                        }
                    }
                },
                "trainer_threads": {
                    "total": 3.1300000003398054e-05,
                    "count": 1,
                    "self": 3.1300000003398054e-05,
                    "children": {
                        "thread_root": {
                            "total": 0.0,
                            "count": 0,
                            "is_parallel": true,
                            "self": 0.0,
                            "children": {
                                "trainer_advance": {
                                    "total": 111.92042199999963,
                                    "count": 7004,
                                    "is_parallel": true,
                                    "self": 0.5104896999997663,
                                    "children": {
                                        "process_trajectory": {
                                            "total": 90.56108299999983,
                                            "count": 7004,
                                            "is_parallel": true,
                                            "self": 90.56108299999983
                                        },
                                        "_update_policy": {
                                            "total": 20.84884930000004,
                                            "count": 11,
                                            "is_parallel": true,
                                            "self": 10.38285530000001,
                                            "children": {
                                                "TorchPPOOptimizer.update": {
                                                    "total": 10.46599400000003,
                                                    "count": 330,
                                                    "is_parallel": true,
                                                    "self": 10.46599400000003
                                                }
                                            }
                                        }
                                    }
                                }
                            }
                        }
                    }
                },
                "TrainerController._save_models": {
                    "total": 0.30558409999999014,
                    "count": 1,
                    "self": 0.00415489999998897,
                    "children": {
                        "RLTrainer._checkpoint": {
                            "total": 0.3014292000000012,
                            "count": 1,
                            "self": 0.3014292000000012
                        }
                    }
                }
            }
        }
    }
}