%YAML 1.1
%TAG !u! tag:unity3d.com,2011:
--- !u!114 &11400000
MonoBehaviour:
  m_ObjectHideFlags: 0
  m_CorrespondingSourceObject: {fileID: 0}
  m_PrefabInstance: {fileID: 0}
  m_PrefabAsset: {fileID: 0}
  m_GameObject: {fileID: 0}
  m_Enabled: 1
  m_EditorHideFlags: 0
  m_Script: {fileID: 11500000, guid: a59bd028032bfe543b3e79d468067a9a, type: 3}
  m_Name: AztecHouse
  m_EditorClassIdentifier: 
  BuildingName: AztecHouse
  BuildingType: 1
  HealthMax: 550
  Defence: 0
  TimeOfCostruction: 25
  BuildingAttack: 0
  BuildingAttackSpeed: 0
  BuildingViewRadius: 0
  BuildingSprite: {fileID: 21300004, guid: 6e60494fff9ac8749b3c78ff86362e83, type: 3}
  BuildingButtonReference: {fileID: 7562743680136092375, guid: 4146fbaa538b27044913601fb74958cf,
    type: 3}
  BuildingButtons: []
