%YAML 1.1
%TAG !u! tag:unity3d.com,2011:
--- !u!114 &11400000
MonoBehaviour:
  m_ObjectHideFlags: 0
  m_CorrespondingSourceObject: {fileID: 0}
  m_PrefabInstance: {fileID: 0}
  m_PrefabAsset: {fileID: 0}
  m_GameObject: {fileID: 0}
  m_Enabled: 1
  m_EditorHideFlags: 0
  m_Script: {fileID: 11500000, guid: a59bd028032bfe543b3e79d468067a9a, type: 3}
  m_Name: RomanCarpentry
  m_EditorClassIdentifier: 
  BuildingName: RomanCarpentry
  BuildingType: 2
  HealthMax: 600
  Defence: 0
  TimeOfCostruction: 35
  BuildingAttack: 0
  BuildingTimeToAttack: 0
  BuildingViewRadius: 0
  BuildingSprite: {fileID: 21300000, guid: e8714c1054228f645b66fccc888737df, type: 3}
  BuildingButtonReference: {fileID: 6096305708700833408, guid: 9b0ddc0779332b1438dbf44c6aa56fd1,
    type: 3}
  BuildingButtons:
  - {fileID: 1661161633154592273, guid: 0b7b5a7958fc38443af37f2bd4a8ab12, type: 3}
