%YAML 1.1
%TAG !u! tag:unity3d.com,2011:
--- !u!114 &11400000
MonoBehaviour:
  m_ObjectHideFlags: 0
  m_CorrespondingSourceObject: {fileID: 0}
  m_PrefabInstance: {fileID: 0}
  m_PrefabAsset: {fileID: 0}
  m_GameObject: {fileID: 0}
  m_Enabled: 1
  m_EditorHideFlags: 0
  m_Script: {fileID: 11500000, guid: a59bd028032bfe543b3e79d468067a9a, type: 3}
  m_Name: RomanCityHall
  m_EditorClassIdentifier: 
  BuildingName: RomanCityHall
  BuildingType: 0
  HealthMax: 2400
  Defence: 3
  TimeOfCostruction: 150
  BuildingSprite: {fileID: 21300000, guid: b06b055ba8d4ff84d881bcea570106bd, type: 3}
  BuildingButtonReference: {fileID: 6813477261486538418, guid: 7d31024440a2dcf469f959c57f389b38,
    type: 3}
  BuildingButtons:
  - {fileID: 466387211376193194, guid: f7ad6acd3b9b77f4b8df053acf8441c9, type: 3}
