%YAML 1.1
%TAG !u! tag:unity3d.com,2011:
--- !u!114 &11400000
MonoBehaviour:
  m_ObjectHideFlags: 0
  m_CorrespondingSourceObject: {fileID: 0}
  m_PrefabInstance: {fileID: 0}
  m_PrefabAsset: {fileID: 0}
  m_GameObject: {fileID: 0}
  m_Enabled: 1
  m_EditorHideFlags: 0
  m_Script: {fileID: 11500000, guid: 6fa49d1b00e77b140862d61f6c39a53a, type: 3}
  m_Name: AztecSoldier
  m_EditorClassIdentifier: 
  UnitName: AztecSoldier
  UnitType: 1
  TimeOfInstantiate: 21
  PopolationsValue: 1
  HealthMax: 40
  Attack: 4
  Defence: 1
  TimeToAttack: 1
  MovementSpeed: 0.9
  ViewRadius: 1
  UnitSprite: {fileID: 21300052, guid: 979f0099130f5694b9093369b29cfe10, type: 3}
  UnitcButtons:
  - {fileID: 1661161633154592273, guid: 0b7b5a7958fc38443af37f2bd4a8ab12, type: 3}
