{
  "active": true,
  "unavailableReason": "Chat service is unavailable for this user.",
  "unavailableEvent": "livechat_transfer_unavail",
  "isAvailable": true,
  "maintenance": false,
  "obsolete": false,
  "name": "Live Chat"
}