/say --&gt; edit read [<a href="text://<font color=CCInfoText>
  <center>
    <font color=CCInfoHeadline><u>Edit Read %1</u></font><br>
    <font color=CCInfoHeader>
      displaying lines %2 to %3 of %4<br>
      %5
    </font>
  </center>
  <br>
  %6
</font>">Click Here</a>]