/say --&gt; %1 [<a href="text://<font color=CCInfoText>
<center><font color=CCInfoHeadline><u>
#IF %2
%2
#ELSE
Help
#ENDIF
</u></font></center><br>
%3
<br>
<center>
--------------------------------------------------<br>
#IF %2
To see a list of all available commands, <a href='chatcmd:///tell %m %!help'>Click Here</a>.<br>
<br>
#ENDIF
If you have any problems with %m, contact <a href='chatcmd:///tell Gaticus'>Gaticus</a>.<br>
Brought to you by <a href='chatcmd:///tell %m %!guild info 8421378'>The Balance</a>, the number 3 and the letter K.<br>
<br>
%m is a DingBot v0.10b created by <a href='chatcmd:///tell %m %!whois Gaticus'>Gaticus</a><br>
--------------------------------------------------<br>
</center>
</font>">Click Here</a>]