<?xml version="1.0" encoding="UTF-8" standalone="no"?>
<!-- Created with Inkscape (http://www.inkscape.org/) -->
<svg
   xmlns:dc="http://purl.org/dc/elements/1.1/"
   xmlns:cc="http://web.resource.org/cc/"
   xmlns:rdf="http://www.w3.org/1999/02/22-rdf-syntax-ns#"
   xmlns:svg="http://www.w3.org/2000/svg"
   xmlns="http://www.w3.org/2000/svg"
   xmlns:xlink="http://www.w3.org/1999/xlink"
   xmlns:sodipodi="http://sodipodi.sourceforge.net/DTD/sodipodi-0.dtd"
   xmlns:inkscape="http://www.inkscape.org/namespaces/inkscape"
   width="744.09448819"
   height="1052.3622047"
   id="svg2"
   sodipodi:version="0.32"
   inkscape:version="0.45"
   sodipodi:modified="TRUE">
  <defs
     id="defs4">
    <linearGradient
       id="linearGradient3167">
      <stop
         id="stop3169"
         offset="0"
         style="stop-color:#0f2442;stop-opacity:1;" />
      <stop
         id="stop3171"
         offset="1"
         style="stop-color:#193a6a;stop-opacity:1;" />
    </linearGradient>
    <linearGradient
       id="linearGradient3145">
      <stop
         style="stop-color:#183666;stop-opacity:1;"
         offset="0"
         id="stop3147" />
      <stop
         id="stop3173"
         offset="0.27906978"
         style="stop-color:#3465a4;stop-opacity:1;" />
      <stop
         style="stop-color:#3465a4;stop-opacity:1;"
         offset="0.94970256"
         id="stop3175" />
      <stop
         style="stop-color:#0b1624;stop-opacity:1;"
         offset="1"
         id="stop3149" />
    </linearGradient>
    <linearGradient
       inkscape:collect="always"
       xlink:href="#linearGradient3167"
       id="linearGradient3151"
       x1="94.285713"
       y1="614.15192"
       x2="94.285713"
       y2="292.36218"
       gradientUnits="userSpaceOnUse" />
    <linearGradient
       inkscape:collect="always"
       xlink:href="#linearGradient3145"
       id="linearGradient3165"
       gradientUnits="userSpaceOnUse"
       x1="94.285728"
       y1="261.65591"
       x2="94.285728"
       y2="966.64795"
       gradientTransform="translate(-375.6665,-7.5040243)" />
  </defs>
  <sodipodi:namedview
     id="base"
     pagecolor="#ffffff"
     bordercolor="#666666"
     borderopacity="1.0"
     gridtolerance="10000"
     guidetolerance="10"
     objecttolerance="10"
     inkscape:pageopacity="0.0"
     inkscape:pageshadow="2"
     inkscape:zoom="0.35"
     inkscape:cx="375"
     inkscape:cy="257.55012"
     inkscape:document-units="px"
     inkscape:current-layer="layer1"
     inkscape:window-width="872"
     inkscape:window-height="638"
     inkscape:window-x="3"
     inkscape:window-y="61" />
  <metadata
     id="metadata7">
    <rdf:RDF>
      <cc:Work
         rdf:about="">
        <dc:format>image/svg+xml</dc:format>
        <dc:type
           rdf:resource="http://purl.org/dc/dcmitype/StillImage" />
      </cc:Work>
    </rdf:RDF>
  </metadata>
  <g
     inkscape:label="Layer 1"
     inkscape:groupmode="layer"
     id="layer1">
    <image
       y="255.58398"
       x="307.57144"
       id="image2167"
       height="704.99249"
       width="31.333"
       sodipodi:absref="/home/etelerra/Desktop/images/stripebackground.png"
       xlink:href="/home/etelerra/Desktop/images/stripebackground.png" />
    <image
       y="254.1554"
       x="610.04761"
       id="image2170"
       height="704.99249"
       width="31.333"
       sodipodi:absref="/home/etelerra/Desktop/images/stripebackground.png"
       xlink:href="/home/etelerra/Desktop/images/stripebackground.png" />
    <rect
       style="opacity:1;fill:url(#linearGradient3151);fill-opacity:1;stroke:none;stroke-width:1.24899995;stroke-miterlimit:4;stroke-dasharray:none;stroke-opacity:0.81920902"
       id="rect2172"
       width="31.333"
       height="704.992"
       x="94.285713"
       y="261.65591"
       inkscape:export-filename="/home/etelerra/Desktop/images/stripebackground.png"
       inkscape:export-xdpi="5.7447457"
       inkscape:export-ydpi="5.7447457" />
    <image
       y="189.1479"
       x="-466.71429"
       id="image3160"
       height="803.57141"
       width="45.918365"
       sodipodi:absref="/home/etelerra/Desktop/images/substripe.png"
       xlink:href="/home/etelerra/Desktop/images/substripe.png" />
    <rect
       style="opacity:1;fill:url(#linearGradient3165);fill-opacity:1;stroke:none;stroke-width:1.24899995;stroke-miterlimit:4;stroke-dasharray:none;stroke-opacity:0.81920902"
       id="rect3163"
       width="31.333"
       height="704.992"
       x="-281.38077"
       y="254.1519"
       inkscape:export-filename="/home/etelerra/Desktop/images/substripe.png"
       inkscape:export-xdpi="5.7447405"
       inkscape:export-ydpi="5.7447405" />
  </g>
</svg>
