<?xml version="1.0" encoding="UTF-8" standalone="no"?>
<!-- Created with Inkscape (http://www.inkscape.org/) -->
<svg
   xmlns:dc="http://purl.org/dc/elements/1.1/"
   xmlns:cc="http://web.resource.org/cc/"
   xmlns:rdf="http://www.w3.org/1999/02/22-rdf-syntax-ns#"
   xmlns:svg="http://www.w3.org/2000/svg"
   xmlns="http://www.w3.org/2000/svg"
   xmlns:xlink="http://www.w3.org/1999/xlink"
   xmlns:sodipodi="http://inkscape.sourceforge.net/DTD/s odipodi-0.dtd"
   xmlns:inkscape="http://www.inkscape.org/namespaces/inkscape"
   width="500pt"
   height="500pt"
   id="svg2316"
   sodipodi:version="0.32"
   inkscape:version="0.43"
   version="1.0"
   sodipodi:docbase="/home/al/projects/centos-artwork/v2"
   sodipodi:docname="alert.svg">
  <defs
     id="defs2318">
    <linearGradient
       inkscape:collect="always"
       xlink:href="#linearGradient9003"
       id="linearGradient9009"
       x1="542.08435"
       y1="196.25545"
       x2="676.82489"
       y2="371.61588"
       gradientUnits="userSpaceOnUse" />
    <linearGradient
       id="linearGradient9003">
      <stop
         style="stop-color:#ffbd00;stop-opacity:1;"
         offset="0"
         id="stop9005" />
      <stop
         style="stop-color:#ffffff;stop-opacity:0;"
         offset="1"
         id="stop9007" />
    </linearGradient>
    <linearGradient
       inkscape:collect="always"
       xlink:href="#linearGradient9003"
       id="linearGradient9027"
       gradientUnits="userSpaceOnUse"
       x1="567.57782"
       y1="242.0489"
       x2="749.45734"
       y2="447.17621" />
    <linearGradient
       id="linearGradient8120">
      <stop
         style="stop-color:#ffffff;stop-opacity:1;"
         offset="0"
         id="stop8122" />
      <stop
         style="stop-color:#ffffff;stop-opacity:0;"
         offset="1"
         id="stop8124" />
    </linearGradient>
    <linearGradient
       inkscape:collect="always"
       xlink:href="#linearGradient8120"
       id="linearGradient9035"
       gradientUnits="userSpaceOnUse"
       gradientTransform="matrix(-2.284822,0,0,2.292369,1751.005,189.8665)"
       x1="423.5451"
       y1="67.733673"
       x2="690.52057"
       y2="67.733673" />
  </defs>
  <sodipodi:namedview
     id="base"
     pagecolor="#ffffff"
     bordercolor="#666666"
     borderopacity="1.0"
     inkscape:pageopacity="0.0"
     inkscape:pageshadow="2"
     inkscape:zoom="0.7"
     inkscape:cx="434.89856"
     inkscape:cy="323.43171"
     inkscape:document-units="px"
     inkscape:current-layer="layer1"
     inkscape:window-width="783"
     inkscape:window-height="581"
     inkscape:window-x="127"
     inkscape:window-y="104" />
  <metadata
     id="metadata2321">
    <rdf:RDF>
      <cc:Work
         rdf:about="">
        <dc:format>image/svg+xml</dc:format>
        <dc:type
           rdf:resource="http://purl.org/dc/dcmitype/StillImage" />
      </cc:Work>
    </rdf:RDF>
  </metadata>
  <g
     inkscape:label="Layer 1"
     inkscape:groupmode="layer"
     id="layer1">
    <path
       transform="matrix(2.034545,-0.654497,0.741842,1.794993,-1094.608,263.3185)"
       d="M 674,364.36218 L 578.37828,328.11183 L 477.95964,291.54614 L 557.16422,226.86048 L 639.04036,158.17823 L 655.4575,259.11424 L 674,364.36218 z "
       inkscape:randomized="0"
       inkscape:rounded="0"
       inkscape:flatsided="false"
       sodipodi:arg2="1.8878639"
       sodipodi:arg1="0.87923938"
       sodipodi:r2="59.726803"
       sodipodi:r1="120.73939"
       sodipodi:cy="271.36218"
       sodipodi:cx="597"
       sodipodi:sides="3"
       id="path2978"
       style="opacity:1;fill:#ffffff;fill-opacity:1;stroke:none;stroke-width:6.85192633;stroke-miterlimit:4;stroke-dasharray:none;stroke-dashoffset:0;stroke-opacity:1"
       sodipodi:type="star"
       inkscape:export-filename="/home/al/projects/centos-artwork/v2/alert.png"
       inkscape:export-xdpi="31.620001"
       inkscape:export-ydpi="31.620001" />
    <path
       sodipodi:type="star"
       style="opacity:1;fill:url(#linearGradient9009);fill-opacity:1;stroke:#b07401;stroke-width:10.96308231;stroke-miterlimit:4;stroke-dasharray:none;stroke-dashoffset:0;stroke-opacity:1"
       id="path8128"
       sodipodi:sides="3"
       sodipodi:cx="597"
       sodipodi:cy="271.36218"
       sodipodi:r1="120.73939"
       sodipodi:r2="59.726803"
       sodipodi:arg1="0.87923938"
       sodipodi:arg2="1.8878639"
       inkscape:flatsided="false"
       inkscape:rounded="0"
       inkscape:randomized="0"
       d="M 674,364.36218 L 578.37828,328.11183 L 477.95964,291.54614 L 557.16422,226.86048 L 639.04036,158.17823 L 655.4575,259.11424 L 674,364.36218 z "
       transform="matrix(2.034545,-0.654497,0.741842,1.794993,-1094.608,266.1114)"
       inkscape:export-filename="/home/al/projects/centos-artwork/v2/alert.png"
       inkscape:export-xdpi="31.620001"
       inkscape:export-ydpi="31.620001" />
    <path
       transform="matrix(1.622676,-0.546712,0.591671,1.499377,-808.1307,278.8426)"
       d="M 674,364.36218 L 578.37828,328.11183 L 477.95964,291.54614 L 557.16422,226.86048 L 639.04036,158.17823 L 655.4575,259.11424 L 674,364.36218 z "
       inkscape:randomized="0"
       inkscape:rounded="0"
       inkscape:flatsided="false"
       sodipodi:arg2="1.8878639"
       sodipodi:arg1="0.87923938"
       sodipodi:r2="59.726803"
       sodipodi:r1="120.73939"
       sodipodi:cy="271.36218"
       sodipodi:cx="597"
       sodipodi:sides="3"
       id="path9025"
       style="opacity:1;fill:url(#linearGradient9027);fill-opacity:1;stroke:none;stroke-width:4;stroke-miterlimit:4;stroke-dasharray:none;stroke-dashoffset:0;stroke-opacity:1"
       sodipodi:type="star"
       inkscape:export-filename="/home/al/projects/centos-artwork/v2/alert.png"
       inkscape:export-xdpi="31.620001"
       inkscape:export-ydpi="31.620001" />
    <path
       sodipodi:nodetypes="cccc"
       id="path9033"
       d="M 502.02086,455.06814 L 325.26485,163.16008 C 325.26485,163.16008 276.0206,224.32096 221.5341,313.83412 C 209.41086,465.90616 451.21714,455.06814 502.02086,455.06814 z "
       style="fill:url(#linearGradient9035);fill-opacity:1;fill-rule:evenodd;stroke:none;stroke-width:1.01603782px;stroke-linecap:butt;stroke-linejoin:miter;stroke-opacity:1"
       inkscape:export-filename="/home/al/projects/centos-artwork/v2/alert.png"
       inkscape:export-xdpi="31.620001"
       inkscape:export-ydpi="31.620001" />
    <text
       inkscape:export-ydpi="31.620001"
       inkscape:export-xdpi="31.620001"
       inkscape:export-filename="/home/al/projects/centos-artwork/v2/alert.png"
       sodipodi:linespacing="125%"
       id="text3150"
       y="434.85599"
       x="319.3804"
       style="font-size:275.33114624px;font-style:normal;font-variant:normal;font-weight:bold;font-stretch:normal;text-align:center;line-height:125%;writing-mode:lr-tb;text-anchor:middle;fill:#000000;fill-opacity:1;stroke:#fff2d3;stroke-width:8.362463;stroke-linecap:butt;stroke-linejoin:miter;stroke-miterlimit:4;stroke-dasharray:none;stroke-opacity:1;font-family:Denmark"
       xml:space="preserve"
       transform="scale(0.998075,1.001928)"><tspan
         y="434.85599"
         x="319.3804"
         id="tspan3152"
         sodipodi:role="line">!</tspan></text>
  </g>
</svg>
