<?xml version="1.0" encoding="UTF-8" standalone="no"?>
<!-- Created with Inkscape (http://www.inkscape.org/) -->
<svg
   xmlns:dc="http://purl.org/dc/elements/1.1/"
   xmlns:cc="http://web.resource.org/cc/"
   xmlns:rdf="http://www.w3.org/1999/02/22-rdf-syntax-ns#"
   xmlns:svg="http://www.w3.org/2000/svg"
   xmlns="http://www.w3.org/2000/svg"
   xmlns:xlink="http://www.w3.org/1999/xlink"
   xmlns:sodipodi="http://inkscape.sourceforge.net/DTD/s odipodi-0.dtd"
   xmlns:inkscape="http://www.inkscape.org/namespaces/inkscape"
   width="500pt"
   height="500pt"
   id="svg2419"
   sodipodi:version="0.32"
   inkscape:version="0.43"
   version="1.0"
   sodipodi:docbase="/home/al/projects/centos-artwork/v2"
   sodipodi:docname="error.svg">
  <defs
     id="defs2421">
    <linearGradient
       id="linearGradient4974">
      <stop
         style="stop-color:#d80000;stop-opacity:1;"
         offset="0"
         id="stop4976" />
      <stop
         style="stop-color:#ffffff;stop-opacity:0;"
         offset="1"
         id="stop4978" />
    </linearGradient>
    <linearGradient
       inkscape:collect="always"
       xlink:href="#linearGradient4974"
       id="linearGradient4980"
       x1="852.61932"
       y1="190.45874"
       x2="962.53912"
       y2="89.823059"
       gradientUnits="userSpaceOnUse" />
    <linearGradient
       id="linearGradient4909">
      <stop
         style="stop-color:#840a0a;stop-opacity:1;"
         offset="0"
         id="stop4911" />
      <stop
         style="stop-color:#e51a1a;stop-opacity:0.35051546;"
         offset="1"
         id="stop4913" />
    </linearGradient>
    <linearGradient
       inkscape:collect="always"
       xlink:href="#linearGradient4909"
       id="linearGradient4915"
       x1="763.65198"
       y1="292.89355"
       x2="907.81616"
       y2="154.80617"
       gradientUnits="userSpaceOnUse" />
    <linearGradient
       id="linearGradient4085">
      <stop
         style="stop-color:#ffbdc4;stop-opacity:1;"
         offset="0"
         id="stop4087" />
      <stop
         style="stop-color:#ffffff;stop-opacity:0;"
         offset="1"
         id="stop4089" />
    </linearGradient>
    <linearGradient
       inkscape:collect="always"
       xlink:href="#linearGradient4085"
       id="linearGradient4091"
       x1="946.10675"
       y1="276.74933"
       x2="844.50195"
       y2="335.41089"
       gradientUnits="userSpaceOnUse"
       gradientTransform="matrix(2.733927,0,0,2.735531,-2097.366,-510.2236)" />
    <linearGradient
       inkscape:collect="always"
       id="linearGradient4917">
      <stop
         style="stop-color:#ffe2e2;stop-opacity:1;"
         offset="0"
         id="stop4919" />
      <stop
         style="stop-color:#ffe2e2;stop-opacity:0;"
         offset="1"
         id="stop4921" />
    </linearGradient>
    <radialGradient
       inkscape:collect="always"
       xlink:href="#linearGradient4917"
       id="radialGradient4925"
       cx="885.21649"
       cy="297.56232"
       fx="885.21649"
       fy="297.56232"
       r="49.113087"
       gradientTransform="matrix(8.232632,-6.627307e-16,-6.841823e-12,5.696792,-6964.912,-1391.383)"
       gradientUnits="userSpaceOnUse" />
  </defs>
  <sodipodi:namedview
     id="base"
     pagecolor="#ffffff"
     bordercolor="#666666"
     borderopacity="1.0"
     inkscape:pageopacity="0.0"
     inkscape:pageshadow="2"
     inkscape:zoom="0.35"
     inkscape:cx="375"
     inkscape:cy="520"
     inkscape:document-units="px"
     inkscape:current-layer="layer1"
     inkscape:window-width="783"
     inkscape:window-height="581"
     inkscape:window-x="5"
     inkscape:window-y="49" />
  <metadata
     id="metadata2424">
    <rdf:RDF>
      <cc:Work
         rdf:about="">
        <dc:format>image/svg+xml</dc:format>
        <dc:type
           rdf:resource="http://purl.org/dc/dcmitype/StillImage" />
      </cc:Work>
    </rdf:RDF>
  </metadata>
  <g
     inkscape:label="Layer 1"
     inkscape:groupmode="layer"
     id="layer1">
    <path
       inkscape:export-ydpi="31.381775"
       inkscape:export-xdpi="31.381775"
       inkscape:export-filename="/home/al/projects/centos-artwork/v2/error.png"
       transform="matrix(1.788368,0,0,1.789416,-1160.541,-95.18943)"
       d="M 954.80235 222.95319 A 125.39335 125.39335 0 1 1  704.01565,222.95319 A 125.39335 125.39335 0 1 1  954.80235 222.95319 z"
       sodipodi:ry="125.39335"
       sodipodi:rx="125.39335"
       sodipodi:cy="222.95319"
       sodipodi:cx="829.409"
       id="path2282"
       style="opacity:1;fill:#ffffff;fill-opacity:1;stroke:none;stroke-width:7.50857878;stroke-miterlimit:4;stroke-dasharray:none;stroke-dashoffset:0;stroke-opacity:1"
       sodipodi:type="arc" />
    <path
       sodipodi:type="arc"
       style="opacity:1;fill:url(#linearGradient4980);fill-opacity:1;stroke:#8b0000;stroke-width:15.4735527;stroke-miterlimit:4;stroke-dasharray:none;stroke-dashoffset:0;stroke-opacity:1"
       id="path4792"
       sodipodi:cx="829.409"
       sodipodi:cy="222.95319"
       sodipodi:rx="125.39335"
       sodipodi:ry="125.39335"
       d="M 954.80235 222.95319 A 125.39335 125.39335 0 1 1  704.01565,222.95319 A 125.39335 125.39335 0 1 1  954.80235 222.95319 z"
       transform="matrix(1.788368,0,0,1.789416,-1160.541,-95.18943)"
       inkscape:export-filename="/home/al/projects/centos-artwork/v2/error.png"
       inkscape:export-xdpi="31.381775"
       inkscape:export-ydpi="31.381775" />
    <path
       transform="matrix(1.531263,0,0,1.543968,-947.296,-40.46647)"
       d="M 954.80235 222.95319 A 125.39335 125.39335 0 1 1  704.01565,222.95319 A 125.39335 125.39335 0 1 1  954.80235 222.95319 z"
       sodipodi:ry="125.39335"
       sodipodi:rx="125.39335"
       sodipodi:cy="222.95319"
       sodipodi:cx="829.409"
       id="path4794"
       style="opacity:1;fill:url(#linearGradient4915);fill-opacity:1;stroke:none;stroke-width:5;stroke-miterlimit:4;stroke-dasharray:none;stroke-dashoffset:0;stroke-opacity:1"
       sodipodi:type="arc"
       inkscape:export-filename="/home/al/projects/centos-artwork/v2/error.png"
       inkscape:export-xdpi="31.381775"
       inkscape:export-ydpi="31.381775" />
    <path
       style="opacity:0.13200001;fill:url(#linearGradient4091);fill-opacity:1;fill-rule:evenodd;stroke:none;stroke-width:1px;stroke-linecap:butt;stroke-linejoin:miter;stroke-opacity:1"
       d="M 224.46892,138.75353 C 214.18004,147.08758 148.76186,252.37427 303.1038,305.93911 C 444.88062,355.1432 399.7695,437.68463 377.73775,490.25256 C 454.02941,468.98022 572.44657,358.24671 486.88305,202.28887 C 419.31031,85.773309 274.40847,98.30208 224.46892,138.75353 z "
       id="path4808"
       sodipodi:nodetypes="csccs"
       inkscape:export-filename="/home/al/projects/centos-artwork/v2/error.png"
       inkscape:export-xdpi="31.381775"
       inkscape:export-ydpi="31.381775" />
    <g
       id="g4067"
       transform="matrix(3.147798,0,0,3.149645,-2466.882,-631.8737)"
       inkscape:export-filename="/home/al/projects/centos-artwork/v2/error.png"
       inkscape:export-xdpi="31.381775"
       inkscape:export-ydpi="31.381775">
      <path
         style="fill:#de8778;fill-opacity:1;fill-rule:evenodd;stroke:#ffffff;stroke-width:14.37234688;stroke-linecap:butt;stroke-linejoin:miter;stroke-miterlimit:4;stroke-dasharray:none;stroke-opacity:1"
         d="M 922.65888,264.80576 L 849.77315,329.31858"
         id="path3090" />
      <path
         id="path4814"
         d="M 849.77315,264.80576 L 922.65888,329.31858"
         style="fill:#de8778;fill-opacity:1;fill-rule:evenodd;stroke:#ffffff;stroke-width:14.37234688;stroke-linecap:butt;stroke-linejoin:miter;stroke-miterlimit:4;stroke-dasharray:none;stroke-opacity:1" />
    </g>
    <path
       style="fill:none;fill-opacity:0.75;fill-rule:evenodd;stroke:url(#radialGradient4925);stroke-width:8.30415249;stroke-linecap:butt;stroke-linejoin:miter;stroke-miterlimit:4;stroke-dasharray:none;stroke-opacity:1"
       d="M 191.97925,390.40608 L 223.40951,421.85479 L 322.91482,336.09285 L 422.45197,424.34389 L 454.50419,388.34779 L 359.04926,303.94206 L 454.50419,219.42467 L 422.51577,183.18926 L 322.89884,271.8711 L 222.89923,183.30092 L 190.99056,219.3449 L 286.25413,303.86229 L 191.97925,390.40608 z "
       id="path3155"
       sodipodi:nodetypes="ccccccccccccc"
       inkscape:export-filename="/home/al/projects/centos-artwork/v2/error.png"
       inkscape:export-xdpi="31.381775"
       inkscape:export-ydpi="31.381775" />
  </g>
</svg>
