<?xml version="1.0" encoding="UTF-8" standalone="no"?>
<!-- Created with Inkscape (http://www.inkscape.org/) -->
<svg
   xmlns:dc="http://purl.org/dc/elements/1.1/"
   xmlns:cc="http://web.resource.org/cc/"
   xmlns:rdf="http://www.w3.org/1999/02/22-rdf-syntax-ns#"
   xmlns:svg="http://www.w3.org/2000/svg"
   xmlns="http://www.w3.org/2000/svg"
   xmlns:xlink="http://www.w3.org/1999/xlink"
   xmlns:sodipodi="http://inkscape.sourceforge.net/DTD/s odipodi-0.dtd"
   xmlns:inkscape="http://www.inkscape.org/namespaces/inkscape"
   width="500pt"
   height="500pt"
   id="svg2394"
   sodipodi:version="0.32"
   inkscape:version="0.43"
   version="1.0"
   sodipodi:docbase="/home/al/projects/centos-artwork/v2"
   sodipodi:docname="info.svg">
  <defs
     id="defs2396">
    <linearGradient
       id="linearGradient3155">
      <stop
         style="stop-color:#66b2f1;stop-opacity:1;"
         offset="0"
         id="stop3157" />
      <stop
         style="stop-color:#d3ebff;stop-opacity:0;"
         offset="1"
         id="stop3159" />
    </linearGradient>
    <linearGradient
       inkscape:collect="always"
       xlink:href="#linearGradient3155"
       id="linearGradient2277"
       gradientUnits="userSpaceOnUse"
       x1="904.6076"
       y1="95.920448"
       x2="962.05896"
       y2="16.226112"
       gradientTransform="matrix(2.96667,0,0,3.3463,-2351.807,17.67916)" />
    <linearGradient
       inkscape:collect="always"
       id="linearGradient4784">
      <stop
         style="stop-color:#ffffff;stop-opacity:1;"
         offset="0"
         id="stop4786" />
      <stop
         style="stop-color:#ffffff;stop-opacity:0;"
         offset="1"
         id="stop4788" />
    </linearGradient>
    <linearGradient
       inkscape:collect="always"
       xlink:href="#linearGradient4784"
       id="linearGradient4790"
       x1="893.90057"
       y1="60.923824"
       x2="933.59619"
       y2="23.588579"
       gradientUnits="userSpaceOnUse"
       gradientTransform="matrix(3.7721,0,0,3.170653,-3032.957,74.47686)" />
  </defs>
  <sodipodi:namedview
     id="base"
     pagecolor="#ffffff"
     bordercolor="#666666"
     borderopacity="1.0"
     inkscape:pageopacity="0.0"
     inkscape:pageshadow="2"
     inkscape:zoom="0.35"
     inkscape:cx="375"
     inkscape:cy="520"
     inkscape:document-units="px"
     inkscape:current-layer="layer1"
     inkscape:window-width="783"
     inkscape:window-height="581"
     inkscape:window-x="5"
     inkscape:window-y="49" />
  <metadata
     id="metadata2399">
    <rdf:RDF>
      <cc:Work
         rdf:about="">
        <dc:format>image/svg+xml</dc:format>
        <dc:type
           rdf:resource="http://purl.org/dc/dcmitype/StillImage" />
      </cc:Work>
    </rdf:RDF>
  </metadata>
  <g
     inkscape:label="Layer 1"
     inkscape:groupmode="layer"
     id="layer1">
    <rect
       inkscape:export-ydpi="31.58"
       inkscape:export-xdpi="31.58"
       inkscape:export-filename="/home/al/projects/centos-artwork/v2/info.png"
       ry="124.50844"
       y="60.15575"
       x="104.87962"
       height="398.42703"
       width="453.97147"
       id="rect3144"
       style="opacity:1;fill:#ffffff;fill-opacity:1;stroke:none;stroke-width:5;stroke-miterlimit:4;stroke-dasharray:none;stroke-dashoffset:0;stroke-opacity:1" />
    <path
       style="fill:#d3ebff;fill-opacity:1;fill-rule:evenodd;stroke:#2360a0;stroke-width:22.26912689;stroke-linecap:butt;stroke-linejoin:miter;stroke-miterlimit:4;stroke-dasharray:none;stroke-opacity:1"
       d="M 181.44125,397.92572 C 181.44125,397.92572 147.62351,554.92282 330.60145,554.92282 C 258.17112,485.51924 322.53869,397.92572 322.53869,397.92572 L 181.44125,397.92572 z "
       id="path3024"
       sodipodi:nodetypes="cccc"
       inkscape:export-filename="/home/al/projects/centos-artwork/v2/info.png"
       inkscape:export-xdpi="31.58"
       inkscape:export-ydpi="31.58" />
    <rect
       inkscape:export-ydpi="31.58"
       inkscape:export-xdpi="31.58"
       inkscape:export-filename="/home/al/projects/centos-artwork/v2/info.png"
       ry="124.50844"
       y="60.15575"
       x="104.87962"
       height="398.42703"
       width="453.97147"
       id="rect3152"
       style="opacity:1;fill:#ffffff;fill-opacity:1;stroke:none;stroke-width:3.64899874;stroke-miterlimit:4;stroke-dasharray:none;stroke-dashoffset:0;stroke-opacity:1" />
    <rect
       style="opacity:1;fill:url(#linearGradient2277);fill-opacity:1;stroke:#2360a0;stroke-width:22.26912689;stroke-miterlimit:4;stroke-dasharray:none;stroke-dashoffset:0;stroke-opacity:1"
       id="rect3030"
       width="453.97147"
       height="398.42703"
       x="104.87962"
       y="60.15575"
       ry="124.50844"
       inkscape:export-filename="/home/al/projects/centos-artwork/v2/info.png"
       inkscape:export-xdpi="31.58"
       inkscape:export-ydpi="31.58" />
    <rect
       ry="103.03358"
       y="94.515472"
       x="134.41939"
       height="329.70752"
       width="394.89194"
       id="rect2125"
       style="opacity:1;fill:#5d96d3;fill-opacity:1;stroke:none;stroke-width:5;stroke-miterlimit:4;stroke-dasharray:none;stroke-dashoffset:0;stroke-opacity:1"
       inkscape:export-filename="/home/al/projects/centos-artwork/v2/info.png"
       inkscape:export-xdpi="31.58"
       inkscape:export-ydpi="31.58" />
    <path
       style="opacity:0.13207547;fill:url(#linearGradient4790);fill-opacity:1;fill-rule:evenodd;stroke:none;stroke-width:1px;stroke-linecap:butt;stroke-linejoin:miter;stroke-opacity:1"
       d="M 455.3765,420.48683 C 491.90811,399.42163 542.77179,276.75139 329.40128,276.75139 C 170.44899,276.75139 136.6011,234.82521 136.6011,166.87548 C 170.28746,83.643599 227.31191,94.240196 333.18904,94.240196 C 415.94043,94.240196 482.08076,102.46695 497.48447,117.39538 C 529.60986,148.52951 584.04047,384.38153 455.3765,420.48683 z "
       id="path4782"
       sodipodi:nodetypes="cscscc"
       inkscape:export-filename="/home/al/projects/centos-artwork/v2/info.png"
       inkscape:export-xdpi="31.58"
       inkscape:export-ydpi="31.58" />
    <path
       inkscape:export-ydpi="31.58"
       inkscape:export-xdpi="31.58"
       inkscape:export-filename="/home/al/projects/centos-artwork/v2/info.png"
       sodipodi:nodetypes="cccc"
       id="path3137"
       d="M 191.28325,435.98639 C 191.28325,435.98639 188.63956,543.32379 310.22343,543.32379 C 269.60909,502.49785 292.37426,444.15292 292.37426,444.15292 L 191.28325,435.98639 z "
       style="fill:#66b2f1;fill-opacity:1;fill-rule:evenodd;stroke:none;stroke-width:4;stroke-linecap:butt;stroke-linejoin:miter;stroke-miterlimit:4;stroke-dasharray:none;stroke-opacity:1" />
    <text
       xml:space="preserve"
       style="font-size:395.85800171px;font-style:normal;font-variant:normal;font-weight:normal;font-stretch:normal;text-align:start;line-height:125%;writing-mode:lr-tb;text-anchor:start;fill:#ffffff;fill-opacity:1;stroke:#d3ebff;stroke-width:9.72533989;stroke-linecap:butt;stroke-linejoin:miter;stroke-miterlimit:4;stroke-dasharray:none;stroke-opacity:1;font-family:Denmark"
       x="237.97375"
       y="440.06439"
       id="text3019"
       sodipodi:linespacing="125%"
       inkscape:export-filename="/home/al/projects/centos-artwork/v2/info.png"
       inkscape:export-xdpi="31.58"
       inkscape:export-ydpi="31.58"
       transform="scale(1.162492,0.860221)"><tspan
         sodipodi:role="line"
         id="tspan3021"
         x="237.97375"
         y="440.06439">i</tspan></text>
  </g>
</svg>
