{
    "numero_preguntas": 8,
    "preguntas": [
        {
           "numero": 1,
           "pregunta":"el objetivo del abonado es" ,
           "respuestas" : [
               {
                "1":"aumentar la fertilidad natural del suelo y restituir los nutrientes absorbidos por los cultivos",
                "2":"crear defensas contra plagas y enfermedades",
                "3":"aumentar la capacidad de absorcion de agua del suelo",
                "4":"propiciar el aumento de la lluvia"
               }
           ],
           "respuesta_c":"aumentar la fertilidad natural del suelo y restituir los nutrientes absorbidos por los cultivos" 
        },
        {
            "numero": 2,
            "pregunta":"el crecimiento de la cocecha se ve afectado negativamente por",
            "respuestas": [
                {
                 "1":"exeso de exposicion al sol",
                 "2":"el exeso en los niveles nutrientes",
                 "3":"trabajos previos mal realizados",
                 "4":"todas las anteriores"
                }
            ],
            "respuesta_c":"el exeso en los niveles nutrientes"
        },
        {
            "numero": 3,
            "pregunta":"cuales son las evidencia de que falta nitrogeno en la nutricion del cultivo",
            "respuestas": [
                {
                 "1":"frutos enfermos",
                 "2":"efermedades",
                 "3":"crecimiento atrofiado, color amarillo en las hojas inferiores, tronco débil, color verde claro",
                 "4":"ninguna de las anteriores"
                }
            ],
            "respuesta_c":"crecimiento atrofiado, color amarillo en las hojas inferiores, tronco débil, color verde claro"
        },
        {
            "numero": 4,
            "pregunta":"la fertirrigacion es una tecnica que",
            "respuestas": [
                {
                 "1":"aplica mas etapas de fertilizante",
                 "2":"aplica fertilizante a travez del agua de riego",
                 "3":"aplica fertilizante en forma de caldo",
                 "4":"permite disminuir la cantidad de fertilizante agregada"
                }
            ],
            "respuesta_c":"aplica fertilizante a travez del agua de riego"
        },
        {
            "numero": 5,
            "pregunta":"que metodo de irrigacion es el adecuado para usar la fertirrigacion",
            "respuestas": [
                {
                 "1":"lluvia",
                 "2":"riego por goteo",
                 "3":"riego por inundacion",
                 "4":"ninguna de las anteriores"
                }
            ],
            "respuesta_c":"riego por goteo"
        },
        {
            "numero": 6,
            "pregunta":"si se rego durante 4 horas y 3.5 se debe fertilizar dejando 15 minutos al inicio y 15 al final con solo agua, que tiempo debe ser usado para fertilizar si se quiere regar por 2.5 horas",
            "respuestas": [
                {
                 "1":"1.3 hora",
                 "2":"2.5 horas",
                 "3":"7.3 horas",
                 "4":"2.18 horas"
                }
            ],
            "respuesta_c":"2.18 horas"
        },
        {
            "numero": 7,
            "pregunta":"el analisis folial permite detectar la deficiencia de un elemento debido a",
            "respuestas": [
                {
                 "1":"exeso de un elemento",
                 "2":"falta de agua",
                 "3":"bacterias de las hojas",
                 "4":"ninguna de las anteriores"
                }
            ],
            "respuesta_c":"exeso de un elemento"
        },
        {
            "numero": 8,
            "pregunta":"La fertilización más ajustada se consigue realizando análisis de suelo cada _______ años",
            "respuestas": [
                {
                 "1":"2-5",
                 "2":"3-4",
                 "3":"6-7",
                 "4":"anuales"
                }
            ],
            "respuesta_c":"3-4"
        }
    ]
}
