Firstname, Lastname, Pay Rate, Mon-hours, Tue-hours, Wed-hours, Thur-hours, Fri-hours
Mary, Joe, 11.20, 2:00, 3:40, 1:10, 0:40, 3:0
Paul, Sims, 12.50, 1:45, 2:0, 1:50, 3:30, 0:0
Jose, Mad, 7.00, 00:35, 2:55, 6:43, 8:00, 7:20
Joe, Schmuck, 9.00, 4:30, 8:00, 7:60, 8:00, 6:00
Colonel, Sanders, 25.00, 2:30, 3:20, 5:05, 6:32, 1:20
Duffy, Duck, 19.20, 10:00, 8:20, 4:30, 4:11, 12:12
