<svg version="1.1" class="clearos-svg clearfoundation app-vendor-clearcenter app-free app-category-network app-sub-category-device-management" viewBox="0 0 400 400" preserveAspectRatio="xMinYMin" xmlns="http://www.w3.org/2000/svg" xmlns:xlink= "http://www.w3.org/1999/xlink">
<path fill="#AA0707" d="M91.666,184.647"/>
<path fill="#AA0707" d="M123.245,247.805"/>
<path fill="#AA0707" d="M91.666,184.647"/>
<path fill="#AA0707" d="M123.245,247.805"/>
<g>
	<g>
		<path fill="#686868" d="M14.442,334.795c0-4.352,3.535-7.918,7.896-7.918h84.845c4.36,0,7.902,3.582,7.902,7.918v54.596
			c0,4.353-3.542,7.87-7.902,7.87H22.338c-4.359,0.031-7.896-3.52-7.896-7.84V334.795z"/>
		<path fill="#686868" d="M149.963,334.795c0-4.352,3.534-7.918,7.91-7.918h84.844c4.369,0,7.902,3.582,7.902,7.918v54.596
			c0,4.353-3.533,7.87-7.902,7.87h-84.844c-4.359,0-7.91-3.551-7.91-7.87V334.795z"/>
		<path fill="#686868" d="M284.899,334.795c0-4.352,3.565-7.918,7.901-7.918h84.838c4.367,0,7.919,3.582,7.919,7.918v54.596
			c0,4.353-3.552,7.87-7.919,7.87h-84.838c-4.366,0-7.901-3.551-7.901-7.87V334.795z"/>
	</g>
	<path fill="#686868" d="M364.066,240.831v-15.853H30.091v15.853h159.156v15.255H88.572c-21.993,0-39.817,17.814-39.817,39.844
		v19.889h15.153v-9.614c0-19.701,15.978-35.726,35.718-35.726h89.621v50.367h16.041v-50.367h85.725
		c19.748,0,35.728,16.022,35.728,35.726v9.614h15.16v-19.89c0-22.026-17.831-39.843-39.826-39.843h-96.802v-15.255H364.066
		L364.066,240.831z"/>
	<path fill="#686868" d="M125.974,193.889c0,8.751-7.109,15.882-15.876,15.882H45.976c-8.759,0-15.884-7.131-15.884-15.882V97.976
		c0-8.751,7.109-15.86,15.884-15.86h64.154c8.767,0,15.875,7.109,15.875,15.86L125.974,193.889L125.974,193.889z"/>
	<path fill="#686868" d="M364.066,193.889c0,8.751-7.069,15.882-15.868,15.882h-64.146c-8.768,0-15.854-7.131-15.854-15.882v-63.51
		c0-8.75,7.086-15.859,15.854-15.859h64.146c8.797,0,15.867,7.109,15.867,15.859V193.889L364.066,193.889z"/>
	<path fill="#686868" d="M245.013,193.889c0,8.751-7.102,15.882-15.867,15.882h-64.139c-8.751,0-15.868-7.131-15.868-15.882V18.614
		c0-8.767,7.117-15.875,15.868-15.875h64.17c8.75,0,15.867,7.109,15.867,15.875v175.275H245.013L245.013,193.889z"/>
</g>
</svg>
