ar,Arabic,ar,Arabic
bg,Bulgarian,bg,Bulgarian
cs_cac,Czech-CAC,cs,Czech
cs_cltt,Czech-CLTT,cs,Czech
cs,Czech,cs,Czech
en,English,en,English
es,Spanish,es,Spanish
et,Estonian,et,Estonian
eu,Basque,eu,Basque
fa,Persian,fa,Persian
fi,Finnish,fi,Finnish
fi_ftb,Finnish-FTB,fi,Finnish
fr,French,fr,French
fr_sequoia,French-Sequoia,fr,French
gl,Galician,gl,Galician
grc_proiel,Ancient_Greek-PROIEL,grc,Ancient_Greek
he,Hebrew,he,Hebrew
hr,Croatian,hr,Croatian
it,Italian,it,Italian
la_ittb,Latin-ITTB,la,Latin
nl,Dutch,nl,Dutch
nl_lassysmall,Dutch-LassySmall,nl,Dutch
pt,Portuguese,pt,Portuguese
ro,Romanian,ro,Romanian
sk,Slovak,sk,Slovak
ur,Urdu,ur,Urdu
