ar,Arabic,ar,Arabic
bg,Bulgarian,bg,Bulgarian
ca,Catalan,ca,Catalan
cs_cac,Czech-CAC,cs,Czech
cs_cltt,Czech-CLTT,cs,Czech
cs,Czech,cs,Czech
cu,Old_Church_Slavonic,cu,Old_Church_Slavonic
de,German,de,German
en_lines,English-LinES,en,English
en_partut,English-ParTUT,en,English
es_ancora,Spanish-AnCora,es,Spanish
fa,Persian,fa,Persian
fi_ftb,Finnish-FTB,fi,Finnish
fi,Finnish,fi,Finnish
gl,Galician,gl,Galician
grc_proiel,Ancient_Greek-PROIEL,grc,Ancient_Greek
grc,Ancient_Greek,grc,Ancient_Greek
hi,Hindi,hi,Hindi
it,Italian,it,Italian
ko,Korean,ko,Korean
la_ittb,Latin-ITTB,la,Latin
la_proiel,Latin-PROIEL,la,Latin
nl,Dutch,nl,Dutch
pl,Polish,pl,Polish
pt,Portuguese,pt,Portuguese
ro,Romanian,ro,Romanian
ru,Russian,ru,Russian
sk,Slovak,sk,Slovak
sl,Slovenian,sl,Slovenian
sv_lines,Swedish-LinES,sv,Swedish
sv,Swedish,sv,Swedish
tr,Turkish,tr,Turkish
