<?xml version="1.0" encoding="UTF-8" standalone="no"?>
<!-- Created with Inkscape (http://www.inkscape.org/) -->

<svg
   xmlns:dc="http://purl.org/dc/elements/1.1/"
   xmlns:cc="http://creativecommons.org/ns#"
   xmlns:rdf="http://www.w3.org/1999/02/22-rdf-syntax-ns#"
   xmlns:svg="http://www.w3.org/2000/svg"
   xmlns="http://www.w3.org/2000/svg"
   xmlns:xlink="http://www.w3.org/1999/xlink"
   xmlns:sodipodi="http://sodipodi.sourceforge.net/DTD/sodipodi-0.dtd"
   xmlns:inkscape="http://www.inkscape.org/namespaces/inkscape"
   version="1.1"
   id="svg947"
   xml:space="preserve"
   width="1550"
   height="2500"
   viewBox="0 0 1550 2500"
   sodipodi:docname="dew_2.svg"
   inkscape:version="0.92.3 (2405546, 2018-03-11)"
   inkscape:export-filename="/home/ole/Pictures/cloud/cloud.png"
   inkscape:export-xdpi="100"
   inkscape:export-ydpi="100"><metadata
     id="metadata953"><rdf:RDF><cc:Work
         rdf:about=""><dc:format>image/svg+xml</dc:format><dc:type
           rdf:resource="http://purl.org/dc/dcmitype/StillImage" /><dc:title></dc:title></cc:Work></rdf:RDF></metadata><defs
     id="defs951"><inkscape:path-effect
       overflow_perspective="false"
       vertical_mirror="false"
       horizontal_mirror="false"
       deform_type="perspective"
       is_visible="true"
       id="path-effect10326"
       down_right_point="715.69645,-103.2387"
       down_left_point="302.72407,-99.349946"
       up_right_point="711.54212,-154.89408"
       up_left_point="304.18557,-143.93089"
       effect="perspective-envelope" /><inkscape:path-effect
       bendpath-nodetypes="cc"
       vertical="false"
       scale_y_rel="false"
       prop_scale="1"
       bendpath="m 204.04419,-124.03536 c 206.43517,23.70154 368.3925,20.23662 502.89062,0"
       is_visible="true"
       id="path-effect10324"
       effect="bend_path" /><inkscape:path-effect
       overflow_perspective="false"
       vertical_mirror="false"
       horizontal_mirror="false"
       deform_type="perspective"
       is_visible="true"
       id="path-effect9150"
       down_right_point="715.69645,-103.2387"
       down_left_point="302.72407,-99.349946"
       up_right_point="711.54212,-154.89408"
       up_left_point="304.18557,-143.93089"
       effect="perspective-envelope" /><inkscape:path-effect
       bendpath-nodetypes="cc"
       vertical="false"
       scale_y_rel="false"
       prop_scale="1"
       bendpath="m 204.04419,-124.03536 c 206.43517,23.70154 368.3925,20.23662 502.89062,0"
       is_visible="true"
       id="path-effect9148"
       effect="bend_path" /><inkscape:path-effect
       effect="perspective-envelope"
       up_left_point="304.18557,-143.93089"
       up_right_point="711.54212,-154.89408"
       down_left_point="302.72407,-99.349946"
       down_right_point="715.69645,-103.2387"
       id="path-effect9044"
       is_visible="true"
       deform_type="perspective"
       horizontal_mirror="false"
       vertical_mirror="false"
       overflow_perspective="false" /><inkscape:path-effect
       effect="bend_path"
       id="path-effect9042"
       is_visible="true"
       bendpath="m 204.04419,-124.03536 c 206.43517,23.70154 368.3925,20.23662 502.89062,0"
       prop_scale="1"
       scale_y_rel="false"
       vertical="false"
       bendpath-nodetypes="cc" /><inkscape:path-effect
       overflow_perspective="false"
       vertical_mirror="false"
       horizontal_mirror="false"
       deform_type="perspective"
       is_visible="true"
       id="path-effect8937"
       down_right_point="715.69645,-103.2387"
       down_left_point="302.72407,-99.349946"
       up_right_point="711.54212,-154.89408"
       up_left_point="304.18557,-143.93089"
       effect="perspective-envelope" /><inkscape:path-effect
       bendpath-nodetypes="cc"
       vertical="false"
       scale_y_rel="false"
       prop_scale="1"
       bendpath="m 204.04419,-124.03536 c 206.43517,23.70154 368.3925,20.23662 502.89062,0"
       is_visible="true"
       id="path-effect8935"
       effect="bend_path" /><inkscape:path-effect
       effect="perspective-envelope"
       up_left_point="304.18557,-143.93089"
       up_right_point="711.54212,-154.89408"
       down_left_point="302.72407,-99.349946"
       down_right_point="715.69645,-103.2387"
       id="path-effect8780"
       is_visible="true"
       deform_type="perspective"
       horizontal_mirror="false"
       vertical_mirror="false"
       overflow_perspective="false" /><inkscape:path-effect
       effect="bend_path"
       id="path-effect8778"
       is_visible="true"
       bendpath="m 204.04419,-124.03536 c 206.43517,23.70154 368.3925,20.23662 502.89062,0"
       prop_scale="1"
       scale_y_rel="false"
       vertical="false"
       bendpath-nodetypes="cc" /><inkscape:path-effect
       effect="perspective-envelope"
       up_left_point="304.18557,-143.93089"
       up_right_point="711.54212,-154.89408"
       down_left_point="302.72407,-99.349946"
       down_right_point="715.69645,-103.2387"
       id="path-effect8442"
       is_visible="true"
       deform_type="perspective"
       horizontal_mirror="false"
       vertical_mirror="false"
       overflow_perspective="false" /><inkscape:path-effect
       effect="bend_path"
       id="path-effect8440"
       is_visible="true"
       bendpath="m 204.04419,-124.03536 c 206.43517,23.70154 368.3925,20.23662 502.89062,0"
       prop_scale="1"
       scale_y_rel="false"
       vertical="false"
       bendpath-nodetypes="cc" /><inkscape:path-effect
       overflow_perspective="false"
       vertical_mirror="false"
       horizontal_mirror="false"
       deform_type="perspective"
       is_visible="true"
       id="path-effect8336"
       down_right_point="715.69645,-103.2387"
       down_left_point="302.72407,-99.349946"
       up_right_point="711.54212,-154.89408"
       up_left_point="304.18557,-143.93089"
       effect="perspective-envelope" /><inkscape:path-effect
       bendpath-nodetypes="cc"
       vertical="false"
       scale_y_rel="false"
       prop_scale="1"
       bendpath="m 204.04419,-124.03536 c 206.43517,23.70154 368.3925,20.23662 502.89062,0"
       is_visible="true"
       id="path-effect8334"
       effect="bend_path" /><inkscape:path-effect
       overflow_perspective="false"
       vertical_mirror="false"
       horizontal_mirror="false"
       deform_type="perspective"
       is_visible="true"
       id="path-effect8230"
       down_right_point="715.69645,-103.2387"
       down_left_point="302.72407,-99.349946"
       up_right_point="711.54212,-154.89408"
       up_left_point="304.18557,-143.93089"
       effect="perspective-envelope" /><inkscape:path-effect
       bendpath-nodetypes="cc"
       vertical="false"
       scale_y_rel="false"
       prop_scale="1"
       bendpath="m 204.04419,-124.03536 c 206.43517,23.70154 368.3925,20.23662 502.89062,0"
       is_visible="true"
       id="path-effect8228"
       effect="bend_path" /><inkscape:path-effect
       effect="perspective-envelope"
       up_left_point="521.30004,-140.41072"
       up_right_point="608.78309,-139.60969"
       down_left_point="496.25755,-58.331912"
       down_right_point="589.68577,-85.005911"
       id="path-effect7270"
       is_visible="true"
       deform_type="perspective"
       horizontal_mirror="false"
       vertical_mirror="false"
       overflow_perspective="false" /><inkscape:path-effect
       effect="perspective-envelope"
       up_left_point="236.65753,-178.30285"
       up_right_point="541.72998,-137.49786"
       down_left_point="199.56784,-31.136337"
       down_right_point="533.98824,-111.81938"
       id="path-effect7216"
       is_visible="true"
       deform_type="perspective"
       horizontal_mirror="false"
       vertical_mirror="false"
       overflow_perspective="false" /><inkscape:path-effect
       effect="perspective-envelope"
       up_left_point="200.78975,-163.76497"
       up_right_point="711.54212,-163.76497"
       down_left_point="200.78975,-84.305742"
       down_right_point="711.54212,-84.305742"
       id="path-effect7214"
       is_visible="true"
       deform_type="perspective"
       horizontal_mirror="false"
       vertical_mirror="false"
       overflow_perspective="false" /><inkscape:path-effect
       effect="perspective-envelope"
       up_left_point="304.18557,-143.93089"
       up_right_point="711.54212,-154.89408"
       down_left_point="302.72407,-99.349946"
       down_right_point="715.69645,-103.2387"
       id="path-effect5686"
       is_visible="true"
       deform_type="perspective"
       horizontal_mirror="false"
       vertical_mirror="false"
       overflow_perspective="false" /><inkscape:path-effect
       effect="perspective-envelope"
       up_left_point="200.78975,-154.89408"
       up_right_point="711.54212,-154.89408"
       down_left_point="200.78975,-75.434849"
       down_right_point="711.54212,-75.434849"
       id="path-effect5684"
       is_visible="true"
       deform_type="perspective"
       horizontal_mirror="false"
       vertical_mirror="false"
       overflow_perspective="false" /><inkscape:path-effect
       effect="bend_path"
       id="path-effect5682"
       is_visible="true"
       bendpath="m 204.04419,-124.03536 c 206.43517,23.70154 368.3925,20.23662 502.89062,0"
       prop_scale="1"
       scale_y_rel="false"
       vertical="false"
       bendpath-nodetypes="cc" /><inkscape:path-effect
       effect="envelope"
       id="path-effect1976"
       is_visible="true"
       yy="true"
       xx="true"
       bendpath1="M 204.04419,-156.13692 H 706.93481"
       bendpath2="m 706.93481,-156.13692 v 64.203128"
       bendpath3="M 204.04419,-91.933792 H 706.93481"
       bendpath4="m 204.04419,-156.13692 v 64.203128" /><clipPath
       clipPathUnits="userSpaceOnUse"
       id="clipPath965"><path
         d="M 0,720 H 720 V 0 H 0 Z"
         id="path963"
         inkscape:connector-curvature="0" /></clipPath><inkscape:path-effect
       effect="bend_path"
       id="path-effect5682-2"
       is_visible="true"
       bendpath="m 204.04419,-124.03536 c 206.43517,23.70154 368.3925,20.23662 502.89062,0"
       prop_scale="1"
       scale_y_rel="false"
       vertical="false"
       bendpath-nodetypes="cc" /><inkscape:path-effect
       effect="perspective-envelope"
       up_left_point="200.78975,-154.89408"
       up_right_point="711.54212,-154.89408"
       down_left_point="195.74067,-62.088245"
       down_right_point="715.69645,-103.2387"
       id="path-effect5686-6"
       is_visible="true"
       deform_type="perspective"
       horizontal_mirror="false"
       vertical_mirror="false"
       overflow_perspective="false" /><inkscape:path-effect
       effect="bend_path"
       id="path-effect5682-3"
       is_visible="true"
       bendpath="m 204.04419,-124.03536 c 206.43517,23.70154 368.3925,20.23662 502.89062,0"
       prop_scale="1"
       scale_y_rel="false"
       vertical="false"
       bendpath-nodetypes="cc" /><inkscape:path-effect
       effect="perspective-envelope"
       up_left_point="200.78975,-154.89408"
       up_right_point="711.54212,-154.89408"
       down_left_point="195.74067,-62.088245"
       down_right_point="715.69645,-103.2387"
       id="path-effect5686-7"
       is_visible="true"
       deform_type="perspective"
       horizontal_mirror="false"
       vertical_mirror="false"
       overflow_perspective="false" /><inkscape:path-effect
       effect="bend_path"
       id="path-effect5682-37"
       is_visible="true"
       bendpath="m 204.04419,-124.03536 c 206.43517,23.70154 368.3925,20.23662 502.89062,0"
       prop_scale="1"
       scale_y_rel="false"
       vertical="false"
       bendpath-nodetypes="cc" /><inkscape:path-effect
       effect="perspective-envelope"
       up_left_point="200.78975,-154.89408"
       up_right_point="711.54212,-154.89408"
       down_left_point="195.74067,-62.088245"
       down_right_point="715.69645,-103.2387"
       id="path-effect5686-9"
       is_visible="true"
       deform_type="perspective"
       horizontal_mirror="false"
       vertical_mirror="false"
       overflow_perspective="false" /><inkscape:path-effect
       effect="bend_path"
       id="path-effect5682-5"
       is_visible="true"
       bendpath="m 204.04419,-124.03536 c 206.43517,23.70154 368.3925,20.23662 502.89062,0"
       prop_scale="1"
       scale_y_rel="false"
       vertical="false"
       bendpath-nodetypes="cc" /><inkscape:path-effect
       effect="perspective-envelope"
       up_left_point="200.78975,-154.89408"
       up_right_point="711.54212,-154.89408"
       down_left_point="195.74067,-62.088245"
       down_right_point="715.69645,-103.2387"
       id="path-effect5686-71"
       is_visible="true"
       deform_type="perspective"
       horizontal_mirror="false"
       vertical_mirror="false"
       overflow_perspective="false" /><filter
       id="g"
       x="-0.064259999"
       y="-0.19277"
       width="1.1285"
       height="1.3855"><feGaussianBlur
         stdDeviation=".8925"
         id="feGaussianBlur2" /></filter><linearGradient
       id="f"
       x1="288.41"
       x2="308.09"
       gradientUnits="userSpaceOnUse"
       spreadMethod="reflect"><stop
         stop-color="#c6c6c6"
         offset="0"
         id="stop10" /><stop
         stop-color="#e3e3e3"
         offset=".20485"
         id="stop12" /><stop
         stop-color="#a5a5a8"
         offset="1"
         id="stop14" /></linearGradient><linearGradient
       id="e"
       x1="282.35999"
       x2="286.63"
       y1="518.56"
       y2="527.34003"
       gradientUnits="userSpaceOnUse"><stop
         stop-color="#e3e3e3"
         offset="0"
         id="stop17" /><stop
         stop-color="#a5a5a8"
         offset="1"
         id="stop19" /></linearGradient><linearGradient
       id="d"
       x1="308.5"
       x2="327.78"
       y1="522.85999"
       y2="520.58002"
       gradientUnits="userSpaceOnUse"
       xlink:href="#a"
       spreadMethod="reflect" /><linearGradient
       id="a"><stop
         stop-color="#fff"
         offset="0"
         id="stop5" /><stop
         stop-color="#fff"
         stop-opacity="0"
         offset="1"
         id="stop7" /></linearGradient><linearGradient
       id="c"
       x1="308.5"
       x2="327.78"
       y1="534.60999"
       y2="532.33002"
       gradientUnits="userSpaceOnUse"
       xlink:href="#a"
       spreadMethod="reflect" /><linearGradient
       id="b"
       x1="308.5"
       x2="327.78"
       y1="544.60999"
       y2="542.33002"
       gradientUnits="userSpaceOnUse"
       xlink:href="#a"
       spreadMethod="reflect" /><linearGradient
       inkscape:collect="always"
       xlink:href="#f"
       id="linearGradient10164"
       gradientUnits="userSpaceOnUse"
       x1="288.41"
       x2="308.09"
       spreadMethod="reflect" /><linearGradient
       inkscape:collect="always"
       xlink:href="#e"
       id="linearGradient10166"
       gradientUnits="userSpaceOnUse"
       x1="282.35999"
       y1="518.56"
       x2="286.63"
       y2="527.34003" /><linearGradient
       inkscape:collect="always"
       xlink:href="#a"
       id="linearGradient10168"
       gradientUnits="userSpaceOnUse"
       x1="308.5"
       y1="522.85999"
       x2="327.78"
       y2="520.58002"
       spreadMethod="reflect" /><linearGradient
       inkscape:collect="always"
       xlink:href="#a"
       id="linearGradient10170"
       gradientUnits="userSpaceOnUse"
       x1="308.5"
       y1="534.60999"
       x2="327.78"
       y2="532.33002"
       spreadMethod="reflect" /><linearGradient
       inkscape:collect="always"
       xlink:href="#a"
       id="linearGradient10172"
       gradientUnits="userSpaceOnUse"
       x1="308.5"
       y1="544.60999"
       x2="327.78"
       y2="542.33002"
       spreadMethod="reflect" /><linearGradient
       inkscape:collect="always"
       xlink:href="#f"
       id="linearGradient8666"
       gradientUnits="userSpaceOnUse"
       x1="288.41"
       x2="308.09"
       spreadMethod="reflect" /><linearGradient
       inkscape:collect="always"
       xlink:href="#e"
       id="linearGradient8668"
       gradientUnits="userSpaceOnUse"
       x1="282.35999"
       y1="518.56"
       x2="286.63"
       y2="527.34003" /></defs><sodipodi:namedview
     pagecolor="#ffffff"
     bordercolor="#666666"
     borderopacity="1"
     objecttolerance="10"
     gridtolerance="10"
     guidetolerance="10"
     inkscape:pageopacity="0"
     inkscape:pageshadow="2"
     inkscape:window-width="1227"
     inkscape:window-height="745"
     id="namedview949"
     showgrid="false"
     inkscape:snap-bbox="true"
     inkscape:snap-page="true"
     inkscape:snap-grids="true"
     inkscape:snap-object-midpoints="true"
     inkscape:snap-center="true"
     inkscape:bbox-paths="true"
     inkscape:bbox-nodes="false"
     inkscape:snap-bbox-edge-midpoints="true"
     inkscape:snap-bbox-midpoints="true"
     inkscape:snap-global="true"
     inkscape:zoom="0.25"
     inkscape:cx="788.5901"
     inkscape:cy="1935.8266"
     inkscape:window-x="663"
     inkscape:window-y="1467"
     inkscape:window-maximized="1"
     inkscape:current-layer="layer1"
     fit-margin-top="0"
     fit-margin-left="0"
     fit-margin-right="0"
     fit-margin-bottom="0" /><g
     inkscape:groupmode="layer"
     id="layer1"
     inkscape:label="base"
     style="display:inline"
     transform="translate(0,26.186768)"><path
       d="M 0,2473.8133 H 1550 V -26.186768 H 0 Z"
       style="fill:#9dd4db;fill-opacity:1;fill-rule:nonzero;stroke:none;stroke-width:2.73403049"
       id="path957"
       inkscape:connector-curvature="0" /><g
       id="g1027"
       transform="matrix(-4.2499052,0,0,-4.2499052,333.44284,2030.6594)"><path
         d="m 0,0 c -0.676,6.226 -5.946,11.073 -12.352,11.073 -3.225,0 -6.154,-1.239 -8.363,-3.254 -1.127,6.093 -6.459,10.711 -12.878,10.711 -3.3,0 -6.307,-1.229 -8.611,-3.242 -1.723,12.428 -12.384,21.998 -25.286,21.998 -13.236,0 -24.118,-10.07 -25.407,-22.966 -0.986,0.233 -2.009,0.369 -3.066,0.369 -7.364,0 -13.333,-5.97 -13.333,-13.333 0,-0.458 0.024,-0.91 0.069,-1.356 z"
         style="fill:#ffffff;fill-opacity:1;fill-rule:nonzero;stroke:none"
         id="path1029"
         inkscape:connector-curvature="0" /></g><g
       id="g1015"
       transform="matrix(1.3333333,0,0,-1.3333333,256.68266,1575.0693)"><path
         d="m 0,0 c -0.833,7.671 -7.326,13.643 -15.219,13.643 -3.974,0 -7.583,-1.527 -10.305,-4.01 -1.388,7.508 -7.958,13.199 -15.868,13.199 -4.066,0 -7.77,-1.514 -10.609,-3.995 -2.124,15.313 -15.259,27.105 -31.156,27.105 -16.308,0 -29.717,-12.408 -31.304,-28.298 -1.215,0.287 -2.476,0.454 -3.779,0.454 -9.072,0 -16.427,-7.355 -16.427,-16.427 0,-0.564 0.029,-1.122 0.084,-1.671 z"
         style="fill:#ffffff;fill-opacity:1;fill-rule:nonzero;stroke:none"
         id="path1017"
         inkscape:connector-curvature="0" /></g><g
       id="g1019"
       transform="matrix(1.3333333,0,0,-1.3333333,691.35878,2139.7956)"><path
         d="m 0,0 c -0.398,3.668 -3.503,6.523 -7.276,6.523 -1.901,0 -3.626,-0.73 -4.927,-1.917 -0.664,3.589 -3.805,6.31 -7.587,6.31 -1.944,0 -3.715,-0.724 -5.072,-1.91 -1.015,7.321 -7.296,12.959 -14.896,12.959 -7.797,0 -14.208,-5.932 -14.967,-13.529 -0.581,0.137 -1.184,0.217 -1.806,0.217 -4.338,0 -7.855,-3.516 -7.855,-7.854 0,-0.27 0.014,-0.536 0.041,-0.799 z"
         style="fill:#ffffff;fill-opacity:1;fill-rule:nonzero;stroke:none"
         id="path1021"
         inkscape:connector-curvature="0" /></g><g
       id="g1023"
       transform="matrix(1.3333333,0,0,-1.3333333,611.9968,1725.7828)"><path
         d="m 0,0 c -0.284,2.612 -2.495,4.646 -5.183,4.646 -1.353,0 -2.582,-0.52 -3.509,-1.365 -0.473,2.557 -2.711,4.494 -5.404,4.494 -1.385,0 -2.647,-0.515 -3.613,-1.36 -0.723,5.215 -5.197,9.231 -10.611,9.231 -5.553,0 -10.12,-4.226 -10.661,-9.637 -0.413,0.097 -0.843,0.154 -1.286,0.154 -3.09,0 -5.595,-2.504 -5.595,-5.594 0,-0.192 0.01,-0.382 0.029,-0.569 z"
         style="fill:#ffffff;fill-opacity:1;fill-rule:nonzero;stroke:none"
         id="path1025"
         inkscape:connector-curvature="0" /></g><g
       id="g1031"
       transform="matrix(1.3333333,0,0,-1.3333333,620.42692,2281.8823)"><path
         d="m 0,0 c 0.045,0.346 0.071,0.697 0.071,1.055 0,4.473 -3.627,8.1 -8.1,8.1 -1.495,0 -2.895,-0.407 -4.097,-1.113 -1.633,3.991 -5.553,6.805 -10.132,6.805 -2.612,0 -5.009,-0.917 -6.89,-2.443 -2.866,8.057 -10.558,13.826 -19.598,13.826 -9.257,0 -17.1,-6.049 -19.796,-14.409 -1.719,1.86 -4.179,3.026 -6.912,3.026 -3.259,0 -6.131,-1.658 -7.821,-4.175 -2.004,2.541 -5.109,4.175 -8.597,4.175 -6.045,0 -10.945,-4.901 -10.945,-10.946 0,-1.375 0.255,-2.689 0.718,-3.901 z"
         style="fill:#ffffff;fill-opacity:1;fill-rule:nonzero;stroke:none"
         id="path1033"
         inkscape:connector-curvature="0" /></g><g
       id="g1035"
       transform="matrix(1.3333333,0,0,-1.3333333,756.89113,1564.9293)"><path
         d="m 0,0 c 0.045,0.346 0.071,0.697 0.071,1.055 0,4.474 -3.627,8.1 -8.1,8.1 -1.495,0 -2.895,-0.407 -4.097,-1.113 -1.633,3.991 -5.553,6.804 -10.132,6.804 -2.612,0 -5.009,-0.916 -6.89,-2.442 -2.866,8.057 -10.558,13.826 -19.598,13.826 -9.257,0 -17.1,-6.049 -19.796,-14.409 -1.719,1.86 -4.179,3.025 -6.911,3.025 -3.26,0 -6.133,-1.657 -7.822,-4.174 -2.004,2.541 -5.109,4.174 -8.597,4.174 -6.045,0 -10.945,-4.9 -10.945,-10.945 0,-1.375 0.255,-2.689 0.718,-3.901 z"
         style="fill:#ffffff;fill-opacity:1;fill-rule:nonzero;stroke:none"
         id="path1037"
         inkscape:connector-curvature="0" /></g><g
       id="g1019-4"
       transform="matrix(1.3333333,0,0,-1.3333333,738.56838,1117.744)"><path
         d="m 0,0 c -0.398,3.668 -3.503,6.523 -7.276,6.523 -1.901,0 -3.626,-0.73 -4.927,-1.917 -0.664,3.589 -3.805,6.31 -7.587,6.31 -1.944,0 -3.715,-0.724 -5.072,-1.91 -1.015,7.321 -7.296,12.959 -14.896,12.959 -7.797,0 -14.208,-5.932 -14.967,-13.529 -0.581,0.137 -1.184,0.217 -1.806,0.217 -4.338,0 -7.855,-3.516 -7.855,-7.854 0,-0.27 0.014,-0.536 0.041,-0.799 z"
         style="fill:#ffffff;fill-opacity:1;fill-rule:nonzero;stroke:none"
         id="path1021-9"
         inkscape:connector-curvature="0" /></g><g
       id="g1023-0"
       transform="matrix(1.3333333,0,0,-1.3333333,365.18708,1075.6572)"><path
         d="m 0,0 c -0.284,2.612 -2.495,4.646 -5.183,4.646 -1.353,0 -2.582,-0.52 -3.509,-1.365 -0.473,2.557 -2.711,4.494 -5.404,4.494 -1.385,0 -2.647,-0.515 -3.613,-1.36 -0.723,5.215 -5.197,9.231 -10.611,9.231 -5.553,0 -10.12,-4.226 -10.661,-9.637 -0.413,0.097 -0.843,0.154 -1.286,0.154 -3.09,0 -5.595,-2.504 -5.595,-5.594 0,-0.192 0.01,-0.382 0.029,-0.569 z"
         style="fill:#ffffff;fill-opacity:1;fill-rule:nonzero;stroke:none"
         id="path1025-9"
         inkscape:connector-curvature="0" /></g><g
       id="g1031-1"
       transform="matrix(1.3333333,0,0,-1.3333333,372.63652,1372.8307)"><path
         d="m 0,0 c 0.045,0.346 0.071,0.697 0.071,1.055 0,4.473 -3.627,8.1 -8.1,8.1 -1.495,0 -2.895,-0.407 -4.097,-1.113 -1.633,3.991 -5.553,6.805 -10.132,6.805 -2.612,0 -5.009,-0.917 -6.89,-2.443 -2.866,8.057 -10.558,13.826 -19.598,13.826 -9.257,0 -17.1,-6.049 -19.796,-14.409 -1.719,1.86 -4.179,3.026 -6.912,3.026 -3.259,0 -6.131,-1.658 -7.821,-4.175 -2.004,2.541 -5.109,4.175 -8.597,4.175 -6.045,0 -10.945,-4.901 -10.945,-10.946 0,-1.375 0.255,-2.689 0.718,-3.901 z"
         style="fill:#ffffff;fill-opacity:1;fill-rule:nonzero;stroke:none"
         id="path1033-7"
         inkscape:connector-curvature="0" /></g><g
       id="g1015-6-7"
       transform="matrix(1.853134,0,0,-1.853134,694.98758,1299.2705)"><path
         d="m 0,0 c -0.833,7.671 -7.326,13.643 -15.219,13.643 -3.974,0 -7.583,-1.527 -10.305,-4.01 -1.388,7.508 -7.958,13.199 -15.868,13.199 -4.066,0 -7.77,-1.514 -10.609,-3.995 -2.124,15.313 -15.259,27.105 -31.156,27.105 -16.308,0 -29.717,-12.408 -31.304,-28.298 -1.215,0.287 -2.476,0.454 -3.779,0.454 -9.072,0 -16.427,-7.355 -16.427,-16.427 0,-0.564 0.029,-1.122 0.084,-1.671 z"
         style="fill:#ffffff;fill-opacity:1;fill-rule:nonzero;stroke:none"
         id="path1017-4-1"
         inkscape:connector-curvature="0" /></g><g
       id="g1019-7"
       transform="matrix(1.3333333,0,0,-1.3333333,774.56839,507.74402)"><path
         d="m 0,0 c -0.398,3.668 -3.503,6.523 -7.276,6.523 -1.901,0 -3.626,-0.73 -4.927,-1.917 -0.664,3.589 -3.805,6.31 -7.587,6.31 -1.944,0 -3.715,-0.724 -5.072,-1.91 -1.015,7.321 -7.296,12.959 -14.896,12.959 -7.797,0 -14.208,-5.932 -14.967,-13.529 -0.581,0.137 -1.184,0.217 -1.806,0.217 -4.338,0 -7.855,-3.516 -7.855,-7.854 0,-0.27 0.014,-0.536 0.041,-0.799 z"
         style="fill:#ffffff;fill-opacity:1;fill-rule:nonzero;stroke:none"
         id="path1021-5"
         inkscape:connector-curvature="0" /></g><g
       id="g1023-4"
       transform="matrix(1.3333333,0,0,-1.3333333,321.18709,513.65722)"><path
         d="m 0,0 c -0.284,2.612 -2.495,4.646 -5.183,4.646 -1.353,0 -2.582,-0.52 -3.509,-1.365 -0.473,2.557 -2.711,4.494 -5.404,4.494 -1.385,0 -2.647,-0.515 -3.613,-1.36 -0.723,5.215 -5.197,9.231 -10.611,9.231 -5.553,0 -10.12,-4.226 -10.661,-9.637 -0.413,0.097 -0.843,0.154 -1.286,0.154 -3.09,0 -5.595,-2.504 -5.595,-5.594 0,-0.192 0.01,-0.382 0.029,-0.569 z"
         style="fill:#ffffff;fill-opacity:1;fill-rule:nonzero;stroke:none"
         id="path1025-8"
         inkscape:connector-curvature="0" /></g><g
       id="g1031-12"
       transform="matrix(1.3333333,0,0,-1.3333333,510.63653,738.83068)"><path
         d="m 0,0 c 0.045,0.346 0.071,0.697 0.071,1.055 0,4.473 -3.627,8.1 -8.1,8.1 -1.495,0 -2.895,-0.407 -4.097,-1.113 -1.633,3.991 -5.553,6.805 -10.132,6.805 -2.612,0 -5.009,-0.917 -6.89,-2.443 -2.866,8.057 -10.558,13.826 -19.598,13.826 -9.257,0 -17.1,-6.049 -19.796,-14.409 -1.719,1.86 -4.179,3.026 -6.912,3.026 -3.259,0 -6.131,-1.658 -7.821,-4.175 -2.004,2.541 -5.109,4.175 -8.597,4.175 -6.045,0 -10.945,-4.901 -10.945,-10.946 0,-1.375 0.255,-2.689 0.718,-3.901 z"
         style="fill:#ffffff;fill-opacity:1;fill-rule:nonzero;stroke:none"
         id="path1033-8"
         inkscape:connector-curvature="0" /></g><g
       id="g1015-6-9"
       transform="matrix(1.853134,0,0,-1.853134,300.98761,855.27041)"><path
         d="m 0,0 c -0.833,7.671 -7.326,13.643 -15.219,13.643 -3.974,0 -7.583,-1.527 -10.305,-4.01 -1.388,7.508 -7.958,13.199 -15.868,13.199 -4.066,0 -7.77,-1.514 -10.609,-3.995 -2.124,15.313 -15.259,27.105 -31.156,27.105 -16.308,0 -29.717,-12.408 -31.304,-28.298 -1.215,0.287 -2.476,0.454 -3.779,0.454 -9.072,0 -16.427,-7.355 -16.427,-16.427 0,-0.564 0.029,-1.122 0.084,-1.671 z"
         style="fill:#ffffff;fill-opacity:1;fill-rule:nonzero;stroke:none"
         id="path1017-4-3"
         inkscape:connector-curvature="0" /></g></g><g
     inkscape:groupmode="layer"
     id="layer4"
     inkscape:label="dew"
     style="display:inline"
     transform="translate(0,26.186768)"><g
   transform="matrix(1.8216172,0,0,-1.8216172,124.80197,3006.4435)"
   id="g9648"
   style="display:inline"><path
     inkscape:connector-curvature="0"
     style="fill:#4d4948;stroke:#4d4948;stroke-width:0.93740273"
     d="m 256.30462,604.8252 h 31.88984 c 5.85505,0 10.63003,-4.77498 10.63003,-10.63003 v -31.88984 c 0,-5.85505 -4.77498,-10.63003 -10.63003,-10.63003 h -31.88984 c -5.85505,0 -10.63003,4.77498 -10.63003,10.63003 v 31.88984 c 0,5.85505 4.77498,10.63003 10.63003,10.63003 z"
     id="path9586" /><path
     inkscape:connector-curvature="0"
     style="fill:none;stroke:#e77817;stroke-width:3.75007629;stroke-linecap:round"
     d="m 245.67482,567.62046 h -5.31489"
     id="path9588" /><path
     inkscape:connector-curvature="0"
     style="fill:none;stroke:#e77817;stroke-width:3.75007629;stroke-linecap:round"
     d="m 245.67482,572.93977 h -5.31489"
     id="path9590" /><path
     inkscape:connector-curvature="0"
     style="fill:none;stroke:#e77817;stroke-width:3.75007629;stroke-linecap:round"
     d="m 245.67482,583.56538 h -5.31489"
     id="path9592" /><path
     inkscape:connector-curvature="0"
     style="fill:none;stroke:#e77817;stroke-width:3.75007629;stroke-linecap:round"
     d="m 245.67482,578.25467 h -5.31489"
     id="path9594" /><path
     inkscape:connector-curvature="0"
     style="fill:none;stroke:#e77817;stroke-width:3.75007629;stroke-linecap:round"
     d="m 245.67482,588.8847 h -5.31489"
     id="path9596" /><path
     inkscape:connector-curvature="0"
     style="fill:none;stroke:#e77817;stroke-width:3.75007629;stroke-linecap:round"
     d="m 245.67482,594.19959 h -5.31489"
     id="path9598" /><path
     inkscape:connector-curvature="0"
     style="fill:none;stroke:#e77817;stroke-width:3.75007629;stroke-linecap:round"
     d="m 245.67482,562.30765 h -5.31489"
     id="path9600" /><path
     inkscape:connector-curvature="0"
     style="fill:none;stroke:#e77817;stroke-width:3.75007629;stroke-linecap:round"
     d="m 304.14008,567.62139 h -5.31489"
     id="path9602" /><path
     inkscape:connector-curvature="0"
     style="fill:none;stroke:#e77817;stroke-width:3.75007629;stroke-linecap:round"
     d="m 304.14008,572.93908 h -5.31489"
     id="path9604" /><path
     inkscape:connector-curvature="0"
     style="fill:none;stroke:#e77817;stroke-width:3.75007629;stroke-linecap:round"
     d="m 304.14008,583.56515 h -5.31489"
     id="path9606" /><path
     inkscape:connector-curvature="0"
     style="fill:none;stroke:#e77817;stroke-width:3.75007629;stroke-linecap:round"
     d="m 304.14008,578.25444 h -5.31489"
     id="path9608" /><path
     inkscape:connector-curvature="0"
     style="fill:none;stroke:#e77817;stroke-width:3.75007629;stroke-linecap:round"
     d="m 304.13939,588.8847 h -5.3149"
     id="path9610" /><path
     inkscape:connector-curvature="0"
     style="fill:none;stroke:#e77817;stroke-width:3.75007629;stroke-linecap:round"
     d="m 304.13939,594.19959 h -5.3149"
     id="path9612" /><path
     inkscape:connector-curvature="0"
     style="fill:none;stroke:#e77817;stroke-width:3.75007629;stroke-linecap:round"
     d="m 304.14008,562.30835 h -5.31489"
     id="path9614" /><path
     inkscape:connector-curvature="0"
     style="fill:none;stroke:#e77817;stroke-width:3.75007629;stroke-linecap:round"
     d="m 261.61975,546.36064 v 5.31489"
     id="path9616" /><path
     inkscape:connector-curvature="0"
     style="fill:none;stroke:#e77817;stroke-width:3.75007629;stroke-linecap:round"
     d="m 266.93953,546.35994 v 5.31489"
     id="path9618" /><path
     inkscape:connector-curvature="0"
     style="fill:none;stroke:#e77817;stroke-width:3.75007629;stroke-linecap:round"
     d="m 277.5656,546.35994 v 5.31489"
     id="path9620" /><path
     inkscape:connector-curvature="0"
     style="fill:none;stroke:#e77817;stroke-width:3.75007629;stroke-linecap:round"
     d="m 272.25489,546.35994 v 5.31489"
     id="path9622" /><path
     inkscape:connector-curvature="0"
     style="fill:none;stroke:#e77817;stroke-width:3.75007629;stroke-linecap:round"
     d="m 282.88329,546.35994 v 5.31489"
     id="path9624" /><path
     inkscape:connector-curvature="0"
     style="fill:none;stroke:#e77817;stroke-width:3.75007629;stroke-linecap:round"
     d="m 288.19865,546.35994 v 5.31489"
     id="path9626" /><path
     inkscape:connector-curvature="0"
     style="fill:none;stroke:#e77817;stroke-width:3.75007629;stroke-linecap:round"
     d="m 256.30694,546.36064 v 5.31489"
     id="path9628" /><path
     inkscape:connector-curvature="0"
     style="fill:none;stroke:#e77817;stroke-width:3.75007629;stroke-linecap:round"
     d="m 261.61742,604.8252 v 5.31489"
     id="path9630" /><path
     inkscape:connector-curvature="0"
     style="fill:none;stroke:#e77817;stroke-width:3.75007629;stroke-linecap:round"
     d="m 266.93674,604.8252 v 5.31489"
     id="path9632" /><path
     inkscape:connector-curvature="0"
     style="fill:none;stroke:#e77817;stroke-width:3.75007629;stroke-linecap:round"
     d="m 277.56258,604.8252 v 5.31489"
     id="path9634" /><path
     inkscape:connector-curvature="0"
     style="fill:none;stroke:#e77817;stroke-width:3.75007629;stroke-linecap:round"
     d="m 272.25163,604.8252 v 5.31489"
     id="path9636" /><path
     inkscape:connector-curvature="0"
     style="fill:none;stroke:#e77817;stroke-width:3.75007629;stroke-linecap:round"
     d="m 282.88166,604.8252 v 5.31489"
     id="path9638" /><path
     inkscape:connector-curvature="0"
     style="fill:none;stroke:#e77817;stroke-width:3.75007629;stroke-linecap:round"
     d="m 288.19656,604.8252 v 5.31489"
     id="path9640" /><path
     inkscape:connector-curvature="0"
     style="fill:none;stroke:#e77817;stroke-width:3.75007629;stroke-linecap:round"
     d="m 256.30462,604.8252 v 5.31489"
     id="path9642" /><path
     inkscape:connector-curvature="0"
     style="fill:#75c5f0;stroke:#007cc3;stroke-width:1.87480545"
     d="m 259.4936,597.38439 h 25.51188 c 3.51293,0 6.37797,-2.86504 6.37797,-6.37797 v -25.51188 c 0,-3.51293 -2.86504,-6.37797 -6.37797,-6.37797 H 259.4936 c -3.51293,0 -6.37797,2.86504 -6.37797,6.37797 v 25.51188 c 0,3.51293 2.86504,6.37797 6.37797,6.37797 z"
     id="path9644" /><path
     inkscape:connector-curvature="0"
     style="fill:#ffffff;fill-rule:nonzero;stroke-width:23.27216339"
     d="m 264.70866,589.40343 c 0,-0.75797 -0.0596,-1.44031 -0.18175,-2.05051 -0.12218,-0.61019 -0.32325,-1.12986 -0.59856,-1.55946 -0.27531,-0.42961 -0.63464,-0.76007 -1.07681,-0.98977 -0.44217,-0.2297 -0.98232,-0.34326 -1.62323,-0.34326 -0.64092,0 -1.18409,0.11054 -1.60927,0.33279 -0.42518,0.22225 -0.76216,0.54317 -1.00978,0.95997 -0.24762,0.41681 -0.42518,0.9281 -0.52502,1.53061 -0.0998,0.60252 -0.14987,1.28416 -0.14987,2.04726 0,0.76309 0.0626,1.43496 0.1871,2.04725 0.12451,0.61229 0.32535,1.13219 0.60066,1.56249 0.27531,0.4303 0.63463,0.76007 1.0768,0.98977 0.44217,0.22969 0.97999,0.34233 1.61579,0.34233 0.63579,0 1.18734,-0.10938 1.61462,-0.33163 0.42728,-0.22225 0.76426,-0.54317 1.01188,-0.96091 0.24761,-0.41773 0.42308,-0.92693 0.5199,-1.52968 0.0968,-0.60274 0.14777,-1.28508 0.14777,-2.04725 z m -1.93997,-0.0947 c 0,0.44961 -0.0128,0.84501 -0.0372,1.18944 -0.0244,0.34442 -0.0626,0.64301 -0.11263,0.89714 l -0.19246,0.64533 c -0.0754,0.17548 -0.16803,0.31581 -0.27206,0.41983 l -0.3677,0.22528 -0.45497,0.0649 c -0.28811,0 -0.52502,-0.0701 -0.71213,-0.20736 l -0.44752,-0.62716 c -0.11054,-0.27741 -0.18804,-0.62509 -0.23062,-1.04073 -0.0426,-0.41565 -0.067,-0.89715 -0.067,-1.44986 0,-0.67489 0.0277,-1.23203 0.0819,-1.6721 0.0542,-0.44008 0.13823,-0.79521 0.25296,-1.05563 0.11474,-0.26042 0.26251,-0.44427 0.44218,-0.54946 0.17966,-0.10519 0.39748,-0.15732 0.65278,-0.15732 l 0.50501,0.0924 0.38468,0.27206 0.27322,0.46241 0.17966,0.64534 c 0.0479,0.24226 0.0775,0.5199 0.0947,0.82709 0.0172,0.3072 0.0277,0.64837 0.0277,1.01839 z m 9.26512,-3.94789 c 0,-0.13708 -0.007,-0.25204 -0.0223,-0.34769 l -0.0626,-0.22737 -0.0924,-0.12008 -0.11683,-0.0372 h -5.22786 l -0.11054,0.0372 -0.0924,0.12008 -0.0617,0.22737 c -0.0149,0.0956 -0.0223,0.21038 -0.0223,0.34769 0,0.1373 0.007,0.26041 0.0191,0.35513 l 0.0575,0.22969 0.0924,0.13079 0.11799,0.0393 h 1.76449 v 6.16759 l -1.52432,-0.84198 -0.27531,-0.0998 -0.16803,0.0447 c -0.0426,0.0405 -0.0691,0.11264 -0.084,0.21481 -0.0149,0.10216 -0.0202,0.24761 -0.0202,0.43263 0,0.18501 0.002,0.2127 0.007,0.2902 0.005,0.0775 0.0149,0.14033 0.0351,0.19246 l 0.0798,0.13288 0.14033,0.10938 2.03678,1.31814 0.0903,0.0468 0.14243,0.0298 0.23272,0.016 0.37003,0.002 0.44962,-0.01 0.26041,-0.0382 0.11683,-0.067 0.0277,-0.11054 v -7.8299 h 1.5455 l 0.12218,-0.0393 0.0947,-0.13079 0.0575,-0.22969 c 0.0128,-0.0947 0.0202,-0.21271 0.0202,-0.35514 z m 7.87995,4.0426 c 0,-0.75797 -0.0596,-1.44031 -0.18175,-2.05051 -0.12218,-0.61019 -0.32325,-1.12986 -0.59856,-1.55946 -0.27531,-0.42961 -0.63464,-0.76007 -1.07681,-0.98977 -0.44217,-0.2297 -0.98231,-0.34326 -1.62323,-0.34326 -0.64092,0 -1.18409,0.11054 -1.60927,0.33279 -0.42518,0.22225 -0.76216,0.54317 -1.00978,0.95997 -0.24762,0.41681 -0.42518,0.9281 -0.52502,1.53061 -0.0998,0.60252 -0.14987,1.28416 -0.14987,2.04726 0,0.76309 0.0626,1.43496 0.18711,2.04725 0.1245,0.61229 0.32534,1.13219 0.60065,1.56249 0.27531,0.4303 0.63463,0.76007 1.0768,0.98977 0.44217,0.22969 0.97999,0.34233 1.61579,0.34233 0.6358,0 1.18735,-0.10938 1.61462,-0.33163 0.42728,-0.22225 0.76426,-0.54317 1.01188,-0.96091 0.24761,-0.41773 0.42308,-0.92693 0.5199,-1.52968 0.0968,-0.60274 0.14778,-1.28508 0.14778,-2.04725 z m -1.93997,-0.0947 c 0,0.44961 -0.0128,0.84501 -0.0372,1.18944 -0.0244,0.34442 -0.0626,0.64301 -0.11263,0.89714 l -0.19246,0.64533 c -0.0754,0.17548 -0.16803,0.31581 -0.27205,0.41983 l -0.3677,0.22528 -0.45497,0.0649 c -0.28811,0 -0.52502,-0.0701 -0.71213,-0.20736 l -0.44753,-0.62718 c -0.11054,-0.27741 -0.18803,-0.62509 -0.23062,-1.04073 -0.0426,-0.41565 -0.067,-0.89715 -0.067,-1.44986 0,-0.67489 0.0277,-1.23203 0.0819,-1.6721 0.0542,-0.44008 0.13823,-0.79521 0.25297,-1.05563 0.11473,-0.26042 0.26251,-0.44427 0.44217,-0.54946 0.17966,-0.10519 0.39749,-0.15732 0.65278,-0.15732 l 0.50501,0.0924 0.38469,0.27206 0.27321,0.46241 0.17966,0.64534 c 0.0479,0.24226 0.0775,0.5199 0.0947,0.82709 0.0172,0.3072 0.0277,0.64837 0.0277,1.01839 z m 9.26512,-3.94789 c 0,-0.13708 -0.007,-0.25204 -0.0223,-0.34769 l -0.0626,-0.22737 -0.0924,-0.12008 -0.11683,-0.0372 h -5.22786 l -0.11054,0.0372 -0.0924,0.12008 -0.0617,0.22737 c -0.0149,0.0956 -0.0223,0.21038 -0.0223,0.34769 0,0.1373 0.007,0.26041 0.0191,0.35513 l 0.0575,0.22969 0.0924,0.13079 0.11799,0.0393 h 1.7645 v 6.16759 l -1.52433,-0.84198 -0.27531,-0.0998 -0.16803,0.0447 c -0.0426,0.0405 -0.0691,0.11264 -0.084,0.21481 -0.0149,0.10216 -0.0202,0.24761 -0.0202,0.43263 0,0.18501 0.002,0.2127 0.007,0.2902 0.005,0.0775 0.0149,0.14033 0.0351,0.19246 l 0.0798,0.13288 0.14034,0.10938 2.03677,1.31814 0.0903,0.0468 0.14243,0.0298 0.23272,0.016 0.37003,0.002 0.44962,-0.01 0.26041,-0.0382 0.11683,-0.067 0.0277,-0.11054 v -7.8299 h 1.5455 l 0.12218,-0.0393 0.0947,-0.13079 0.0575,-0.22969 c 0.0128,-0.0947 0.0202,-0.21271 0.0202,-0.35514 z m -22.80765,-10.9861 c 0,-0.13707 -0.007,-0.25203 -0.0223,-0.34768 l -0.0626,-0.22737 -0.0924,-0.12008 -0.11683,-0.0372 h -5.22786 l -0.11054,0.0372 -0.0924,0.12008 -0.0617,0.22737 c -0.0149,0.0956 -0.0223,0.21038 -0.0223,0.34768 0,0.13731 0.007,0.26042 0.0191,0.35514 l 0.0575,0.22969 0.0924,0.13079 0.11799,0.0393 h 1.76449 v 6.16759 l -1.52432,-0.84198 -0.27531,-0.0998 -0.16803,0.0447 c -0.0426,0.0405 -0.0691,0.11264 -0.084,0.21481 -0.0149,0.10216 -0.0202,0.24761 -0.0202,0.43263 0,0.18501 0.002,0.2127 0.007,0.2902 0.005,0.0775 0.0149,0.14033 0.0351,0.19246 l 0.0798,0.13288 0.14033,0.10938 2.03678,1.31814 0.0903,0.0468 0.14243,0.0298 0.23272,0.0161 0.37003,0.002 0.44962,-0.01 0.26041,-0.0382 0.11683,-0.067 0.0277,-0.11054 v -7.8299 h 1.5455 l 0.12218,-0.0393 0.0947,-0.13079 0.0575,-0.22969 c 0.0128,-0.0947 0.0202,-0.21271 0.0202,-0.35514 z m 7.87995,4.04261 c 0,-0.75797 -0.0596,-1.44031 -0.18175,-2.05051 -0.12218,-0.61019 -0.32325,-1.12986 -0.59856,-1.55947 -0.27531,-0.4296 -0.63464,-0.76006 -1.07681,-0.98976 -0.44217,-0.2297 -0.98232,-0.34326 -1.62323,-0.34326 -0.64092,0 -1.18409,0.11054 -1.60927,0.33279 -0.42518,0.22225 -0.76216,0.54317 -1.00978,0.95997 -0.24762,0.41681 -0.42518,0.9281 -0.52502,1.53061 -0.0998,0.60252 -0.14987,1.28416 -0.14987,2.04726 0,0.76309 0.0626,1.43496 0.18711,2.04725 0.1245,0.61229 0.32534,1.13219 0.60065,1.56249 0.27531,0.4303 0.63463,0.76007 1.0768,0.98977 0.44217,0.22969 0.97999,0.34233 1.61579,0.34233 0.63579,0 1.18735,-0.10938 1.61462,-0.33163 0.42728,-0.22225 0.76426,-0.54317 1.01188,-0.96091 0.24761,-0.41773 0.42308,-0.92693 0.5199,-1.52968 0.0968,-0.60274 0.14777,-1.28508 0.14777,-2.04725 z m -1.93997,-0.0947 c 0,0.44962 -0.0128,0.84502 -0.0372,1.18945 -0.0244,0.34442 -0.0626,0.643 -0.11263,0.89714 l -0.19246,0.64533 c -0.0754,0.17548 -0.16803,0.31581 -0.27205,0.41983 l -0.3677,0.22528 -0.45498,0.0649 c -0.2881,0 -0.52502,-0.0701 -0.71212,-0.20736 l -0.44753,-0.62718 c -0.11054,-0.27741 -0.18804,-0.62509 -0.23062,-1.04073 -0.0426,-0.41565 -0.067,-0.89715 -0.067,-1.44986 0,-0.67489 0.0277,-1.23203 0.0819,-1.67211 0.0542,-0.44007 0.13823,-0.7952 0.25296,-1.05562 0.11474,-0.26042 0.26251,-0.44427 0.44217,-0.54946 0.17967,-0.10519 0.39749,-0.15732 0.65279,-0.15732 l 0.50501,0.0924 0.38468,0.27206 0.27322,0.46241 0.17966,0.64534 c 0.0479,0.24226 0.0775,0.5199 0.0947,0.82709 0.0172,0.3072 0.0277,0.64837 0.0277,1.01839 z m 9.26512,-3.94789 c 0,-0.13707 -0.007,-0.25203 -0.0223,-0.34768 l -0.0626,-0.22737 -0.0924,-0.12008 -0.11683,-0.0372 h -5.22786 l -0.11054,0.0372 -0.0924,0.12008 -0.0617,0.22737 c -0.0149,0.0956 -0.0223,0.21038 -0.0223,0.34768 0,0.13731 0.007,0.26042 0.0191,0.35514 l 0.0575,0.22969 0.0924,0.13079 0.11799,0.0393 h 1.76451 v 6.16759 l -1.52433,-0.84198 -0.27531,-0.0998 -0.16803,0.0447 c -0.0426,0.0405 -0.0691,0.11264 -0.084,0.21481 -0.0149,0.10216 -0.0202,0.24761 -0.0202,0.43263 0,0.18501 0.002,0.2127 0.007,0.2902 0.005,0.0775 0.0149,0.14033 0.0351,0.19246 l 0.0798,0.13288 0.14033,0.10938 2.03678,1.31814 0.0903,0.0468 0.14243,0.0298 0.23272,0.0161 0.37003,0.002 0.44962,-0.01 0.26041,-0.0382 0.11683,-0.067 0.0277,-0.11054 v -7.8299 h 1.5455 l 0.12218,-0.0393 0.0947,-0.13079 0.0575,-0.22969 c 0.0128,-0.0947 0.0202,-0.21271 0.0202,-0.35514 z m 7.87995,4.04261 c 0,-0.75797 -0.0596,-1.44031 -0.18175,-2.05051 -0.12218,-0.61019 -0.32325,-1.12986 -0.59856,-1.55947 -0.27531,-0.4296 -0.63464,-0.76006 -1.07681,-0.98976 -0.44217,-0.2297 -0.98231,-0.34326 -1.62323,-0.34326 -0.64091,0 -1.18409,0.11054 -1.60927,0.33279 -0.42518,0.22225 -0.76216,0.54317 -1.00978,0.95997 -0.24761,0.41681 -0.42518,0.9281 -0.52502,1.53061 -0.0998,0.60252 -0.14987,1.28416 -0.14987,2.04726 0,0.76309 0.0626,1.43496 0.18711,2.04725 0.1245,0.61229 0.32534,1.13219 0.60065,1.56249 0.27531,0.4303 0.63463,0.76007 1.0768,0.98977 0.44218,0.22969 0.97999,0.34233 1.61579,0.34233 0.6358,0 1.18735,-0.10938 1.61462,-0.33163 0.42728,-0.22225 0.76426,-0.54317 1.01188,-0.96091 0.24761,-0.41773 0.42308,-0.92693 0.5199,-1.52968 0.0968,-0.60274 0.14777,-1.28508 0.14777,-2.04725 z m -1.93996,-0.0947 c 0,0.44962 -0.0128,0.84502 -0.0372,1.18945 -0.0244,0.34442 -0.0626,0.643 -0.11264,0.89714 l -0.19246,0.64533 c -0.0754,0.17548 -0.16803,0.31581 -0.27205,0.41983 l -0.3677,0.22528 -0.45497,0.0649 c -0.28811,0 -0.52502,-0.0701 -0.71213,-0.20736 l -0.44753,-0.62718 c -0.11054,-0.27741 -0.18803,-0.62509 -0.23062,-1.04073 -0.0426,-0.41565 -0.067,-0.89715 -0.067,-1.44986 0,-0.67489 0.0277,-1.23203 0.0819,-1.67211 0.0542,-0.44007 0.13823,-0.7952 0.25297,-1.05562 0.11473,-0.26042 0.26251,-0.44427 0.44217,-0.54946 0.17966,-0.10519 0.39749,-0.15732 0.65278,-0.15732 l 0.50501,0.0924 0.38469,0.27206 0.27321,0.46241 0.17966,0.64534 c 0.0479,0.24226 0.0775,0.5199 0.0947,0.82709 0.0172,0.3072 0.0277,0.64837 0.0277,1.01839 z m -20.86769,-10.89143 c 0,-0.75797 -0.0596,-1.44031 -0.18175,-2.05051 -0.12218,-0.61019 -0.32325,-1.12986 -0.59856,-1.55947 -0.27531,-0.4296 -0.63464,-0.76006 -1.07681,-0.98976 -0.44217,-0.2297 -0.98232,-0.34327 -1.62323,-0.34327 -0.64092,0 -1.18409,0.11055 -1.60927,0.3328 -0.42518,0.22225 -0.76216,0.54317 -1.00978,0.95997 -0.24762,0.41681 -0.42518,0.9281 -0.52502,1.53061 -0.0998,0.60252 -0.14987,1.28416 -0.14987,2.04726 0,0.76309 0.0626,1.43496 0.1871,2.04725 0.12451,0.61229 0.32535,1.13219 0.60066,1.56249 0.27531,0.4303 0.63463,0.76007 1.0768,0.98977 0.44217,0.22969 0.97999,0.34233 1.61579,0.34233 0.63579,0 1.18734,-0.10938 1.61462,-0.33163 0.42728,-0.22225 0.76426,-0.54317 1.01188,-0.96091 0.24761,-0.41773 0.42308,-0.92693 0.5199,-1.52968 0.0968,-0.60274 0.14777,-1.28508 0.14777,-2.04725 z m -1.93997,-0.0947 c 0,0.44962 -0.0128,0.84502 -0.0372,1.18945 -0.0244,0.34442 -0.0626,0.643 -0.11263,0.89714 l -0.19246,0.64533 c -0.0754,0.17548 -0.16803,0.31581 -0.27205,0.41983 l -0.3677,0.22528 -0.45497,0.0649 c -0.28811,0 -0.52502,-0.0701 -0.71213,-0.20736 l -0.44753,-0.62718 c -0.11054,-0.27741 -0.18804,-0.6251 -0.23062,-1.04074 -0.0426,-0.41564 -0.067,-0.89714 -0.067,-1.44985 0,-0.67489 0.0277,-1.23203 0.0819,-1.67211 0.0542,-0.44007 0.13823,-0.79521 0.25296,-1.05562 0.11474,-0.26042 0.26251,-0.44427 0.44218,-0.54946 0.17966,-0.10519 0.39748,-0.15732 0.65278,-0.15732 l 0.50501,0.0924 0.38469,0.27205 0.27321,0.46242 0.17966,0.64534 c 0.0479,0.24226 0.0775,0.5199 0.0947,0.82709 0.0172,0.30719 0.0277,0.64836 0.0277,1.01839 z m 9.26512,-3.94789 c 0,-0.13707 -0.007,-0.25203 -0.0223,-0.34768 l -0.0626,-0.22737 -0.0924,-0.12008 -0.11683,-0.0372 h -5.22786 l -0.11054,0.0372 -0.0924,0.12008 -0.0617,0.22737 c -0.0149,0.0956 -0.0223,0.21038 -0.0223,0.34768 0,0.13731 0.007,0.26042 0.0191,0.35514 l 0.0575,0.22969 0.0924,0.13079 0.11799,0.0393 h 1.76449 v 6.16759 l -1.52432,-0.84198 -0.27531,-0.0998 -0.16803,0.0447 c -0.0426,0.0405 -0.0691,0.11264 -0.084,0.21481 -0.0149,0.10216 -0.0202,0.24761 -0.0202,0.43262 0,0.18502 0.002,0.21271 0.007,0.29021 0.005,0.0775 0.0149,0.14033 0.0351,0.19246 l 0.0798,0.13288 0.14033,0.10938 2.03678,1.31814 0.0903,0.0468 0.14243,0.0298 0.23272,0.0161 0.37003,0.002 0.44962,-0.01 0.26041,-0.0382 0.11683,-0.067 0.0277,-0.11055 v -7.8299 h 1.5455 l 0.12218,-0.0393 0.0947,-0.13079 0.0575,-0.22969 c 0.0128,-0.0947 0.0202,-0.21271 0.0202,-0.35514 z m 7.60255,0 c 0,-0.13707 -0.007,-0.25203 -0.0223,-0.34768 l -0.0626,-0.22737 -0.0924,-0.12008 -0.11683,-0.0372 h -5.22786 l -0.11054,0.0372 -0.0924,0.12008 -0.0617,0.22737 c -0.0149,0.0956 -0.0223,0.21038 -0.0223,0.34768 0,0.13731 0.007,0.26042 0.0191,0.35514 l 0.0575,0.22969 0.0924,0.13079 0.11799,0.0393 h 1.76451 v 6.16759 l -1.52433,-0.84198 -0.27531,-0.0998 -0.16803,0.0447 c -0.0426,0.0405 -0.0691,0.11264 -0.084,0.21481 -0.0149,0.10216 -0.0202,0.24761 -0.0202,0.43262 0,0.18502 0.002,0.21271 0.007,0.29021 0.005,0.0775 0.0149,0.14033 0.0351,0.19246 l 0.0798,0.13288 0.14033,0.10938 2.03678,1.31814 0.0903,0.0468 0.14243,0.0298 0.23272,0.0161 0.37003,0.002 0.44962,-0.01 0.26041,-0.0382 0.11683,-0.067 0.0277,-0.11055 v -7.8299 h 1.5455 l 0.12218,-0.0393 0.0947,-0.13079 0.0575,-0.22969 c 0.0128,-0.0947 0.0202,-0.21271 0.0202,-0.35514 z m 7.87995,4.04261 c 0,-0.75797 -0.0596,-1.44031 -0.18175,-2.05051 -0.12218,-0.61019 -0.32325,-1.12986 -0.59856,-1.55947 -0.27531,-0.4296 -0.63464,-0.76006 -1.07681,-0.98976 -0.44217,-0.2297 -0.98231,-0.34327 -1.62323,-0.34327 -0.64091,0 -1.18409,0.11055 -1.60927,0.3328 -0.42518,0.22225 -0.76216,0.54317 -1.00978,0.95997 -0.24761,0.41681 -0.42518,0.9281 -0.52502,1.53061 -0.0998,0.60252 -0.14987,1.28416 -0.14987,2.04726 0,0.76309 0.0626,1.43496 0.18711,2.04725 0.1245,0.61229 0.32534,1.13219 0.60065,1.56249 0.27531,0.4303 0.63463,0.76007 1.0768,0.98977 0.44218,0.22969 0.97999,0.34233 1.61579,0.34233 0.6358,0 1.18735,-0.10938 1.61462,-0.33163 0.42728,-0.22225 0.76426,-0.54317 1.01188,-0.96091 0.24761,-0.41773 0.42308,-0.92693 0.5199,-1.52968 0.0968,-0.60274 0.14777,-1.28508 0.14777,-2.04725 z m -1.93996,-0.0947 c 0,0.44962 -0.0128,0.84502 -0.0372,1.18945 -0.0244,0.34442 -0.0626,0.643 -0.11264,0.89714 l -0.19246,0.64533 c -0.0754,0.17548 -0.16803,0.31581 -0.27205,0.41983 l -0.3677,0.22528 -0.45497,0.0649 c -0.28811,0 -0.52502,-0.0701 -0.71213,-0.20736 l -0.44753,-0.62718 c -0.11054,-0.27741 -0.18803,-0.6251 -0.23062,-1.04074 -0.0426,-0.41564 -0.067,-0.89714 -0.067,-1.44985 0,-0.67489 0.0277,-1.23203 0.0819,-1.67211 0.0542,-0.44007 0.13823,-0.79521 0.25297,-1.05562 0.11473,-0.26042 0.26251,-0.44427 0.44217,-0.54946 0.17966,-0.10519 0.39749,-0.15732 0.65278,-0.15732 l 0.50501,0.0924 0.38469,0.27205 0.27321,0.46242 0.17966,0.64534 c 0.0479,0.24226 0.0775,0.5199 0.0947,0.82709 0.0172,0.30719 0.0277,0.64836 0.0277,1.01839 z"
     id="path9646" /></g><g
   transform="matrix(1.3045413,0,0,1.3045413,70.428212,1298.6182)"
   id="g47"><path
     style="fill:#2e3436;filter:url(#g)"
     inkscape:connector-curvature="0"
     transform="matrix(1.1818,0,0,1.1818,-30.649,-65.984)"
     d="m 303.3,521.78 c 0,3.0684 -7.4623,5.5558 -16.668,5.5558 -9.2057,0 -16.668,-2.4874 -16.668,-5.5558 0,-3.0684 7.4623,-5.5558 16.668,-5.5558 9.2057,0 16.668,2.4874 16.668,5.5558 z"
     id="path27" /><path
     inkscape:connector-curvature="0"
     style="fill:url(#linearGradient8666)"
     d="m 288.40625,517.5 v 30.09191 h 0.125 c -0.0806,0.24126 -0.125,0.47032 -0.125,0.71875 0,3.6263 8.80861,6.5625 19.6875,6.5625 10.87889,0 19.6875,-2.9362 19.6875,-6.5625 0,-0.24879 -0.0442,-0.47715 -0.125,-0.71875 h 0.125 V 517.5 Z"
     id="path29" /><path
     inkscape:connector-curvature="0"
     style="fill:url(#linearGradient8668)"
     transform="matrix(1.1818,0,0,1.1818,-30.649,-99.394)"
     d="m 303.3,521.78 c 0,3.0684 -7.4623,5.5558 -16.668,5.5558 -9.2057,0 -16.668,-2.4874 -16.668,-5.5558 0,-3.0684 7.4623,-5.5558 16.668,-5.5558 9.2057,0 16.668,2.4874 16.668,5.5558 z"
     id="path31" /><path
     style="fill:#565656"
     inkscape:connector-curvature="0"
     d="m 288.38,539.09 c 0.14735,3.584 8.9318,6.4688 19.719,6.4688 10.756,0 19.492,-2.8677 19.688,-6.4375 -3.4515,2.9359 -10.959,4.9688 -19.688,4.9688 -8.7461,0 -16.277,-2.0544 -19.719,-5 z"
     id="path33" /><path
     inkscape:connector-curvature="0"
     style="fill:url(#d)"
     d="m 288.38,517.34 c 0.14735,3.584 8.9318,6.4688 19.719,6.4688 10.756,0 19.492,-2.8677 19.688,-6.4375 -0.21572,0.18349 -0.44078,0.35509 -0.6875,0.53125 l -0.0312,0.0312 c -2.2921,2.7774 -9.9035,4.8125 -18.969,4.8125 -9.122,0 -16.786,-2.0707 -19.031,-4.875 l -0.0625,-0.0625 c -0.21872,-0.15969 -0.43159,-0.30323 -0.625,-0.46875 z"
     id="path35" /><g
     transform="translate(0,-0.52315)"
     id="g41"><path
       style="fill:#565656"
       inkscape:connector-curvature="0"
       d="m 288.38,529.09 c 0.14735,3.584 8.9318,6.4688 19.719,6.4688 10.756,0 19.492,-2.8677 19.688,-6.4375 -3.4515,2.9359 -10.959,4.9688 -19.688,4.9688 -8.7461,0 -16.277,-2.0544 -19.719,-5 z"
       id="path37" /><path
       inkscape:connector-curvature="0"
       style="fill:url(#c)"
       d="m 288.38,529.09 c 0.14735,3.584 8.9318,6.4688 19.719,6.4688 10.756,0 19.492,-2.8677 19.688,-6.4375 l -0.15625,0.125 c -1.2422,3.2268 -9.5106,5.7188 -19.531,5.7188 -10.113,0 -18.468,-2.5112 -19.594,-5.7812 l -0.125,-0.0937 z"
       id="path39" /></g><path
     inkscape:connector-curvature="0"
     style="fill:url(#b)"
     d="m 288.38,539.09 c 0.14735,3.584 8.9318,6.4688 19.719,6.4688 10.756,0 19.492,-2.8677 19.688,-6.4375 l -0.15625,0.125 c -1.2422,3.2268 -9.5106,5.7188 -19.531,5.7188 -10.113,0 -18.468,-2.5112 -19.594,-5.7812 l -0.125,-0.0937 z"
     id="path43" /><path
     style="fill:#565656"
     inkscape:connector-curvature="0"
     d="m 288.5,549.94 c 1.126,3.27 9.481,5.7812 19.594,5.7812 10.021,0 18.289,-2.492 19.531,-5.7188 -3.5163,2.8678 -10.929,4.8438 -19.531,4.8438 -8.6478,0 -16.1,-2.0137 -19.594,-4.9062 z"
     id="path45" /></g><path
   style="fill:#535353;stroke:#535353;stroke-width:0.06096765"
   inkscape:connector-curvature="0"
   d="m 59.872265,2254.7098 c -0.04471,-2.9793 2.617544,-5.6354 5.584636,-5.6395 19.920164,-0.01 39.840329,0 59.760489,0 1.20919,0 2.47326,-0.1016 3.60929,0.3984 2.11151,0.8129 3.64789,2.9711 3.63164,5.2493 0.002,24.1818 0.002,48.3616 0,72.5434 -0.004,1.0283 0.0467,2.0627 -0.0854,3.0869 -0.76209,-1.6766 -1.08725,-3.5056 -1.77822,-5.2066 -1.28439,-3.337 -2.42651,-6.7268 -3.73935,-10.0515 -0.004,-0.6158 0.004,-1.2316 -0.0142,-1.8473 -0.16258,0.01 -0.48977,0.02 -0.65438,0.026 -0.0671,-0.1829 -0.1382,-0.3618 -0.21339,-0.5365 0.29265,-0.014 0.58732,-0.026 0.882,-0.039 0.0305,-10.8604 -0.0305,-21.7208 0.0305,-32.5791 0.0325,-0.7377 0.0305,-1.4754 -0.002,-2.2111 -0.0752,-3.9934 0.0386,-7.9888 -0.0549,-11.9802 l -0.0203,-0.1768 c -20.41807,0.016 -40.838167,-0.016 -61.256233,0.016 l -0.063,0.1463 -0.04471,0.1463 c -0.268258,0.7276 -0.17071,1.512 -0.174774,2.2701 0.0081,2.2354 -0.002,4.4709 0.0041,6.7064 0.01829,0.9674 -0.121935,1.9591 0.172742,2.9 0.07519,0.6646 0.06706,1.3332 0.06503,2.0018 3.708866,0.1138 7.423828,0.014 11.134725,0.047 h 47.55476 c 0.83323,-0.014 1.67661,-0.057 2.49968,0.1281 -1.03442,0.126 -2.07493,0.079 -3.10935,0.081 -17.74972,0 -35.497397,0 -53.24508,0 -1.64003,0.032 -3.282092,-0.063 -4.918057,0.041 -0.09552,0.2866 -0.164613,0.5833 -0.164613,0.8861 0.01219,4.6823 0.01626,9.3626 0,14.0429 -0.0041,0.3007 0.09348,0.5873 0.184935,0.8698 -0.971418,1.2112 -1.723352,2.583 -2.467157,3.9425 -0.398322,0.6991 -0.510096,1.512 -0.851515,2.2335 -0.656418,1.1604 -1.093353,2.4285 -1.737578,3.5971 -0.132097,-0.3516 -0.284516,-0.7073 -0.280451,-1.0893 0.0061,-5.6253 0.0041,-11.2526 0.0041,-16.8779 -0.002,-0.8495 0.09958,-1.7213 -0.184935,-2.5423 -0.103645,-0.7743 -0.0569,-1.5568 -0.063,-2.3351 0.0041,-9.4154 -0.002,-18.8309 0.0041,-28.2443 m 31.477597,1.0954 c -1.058805,0.2114 -1.188869,1.888 -0.280451,2.3696 0.447096,0.1971 0.951095,0.1443 1.428675,0.1606 3.578801,-0.039 7.161667,0.041 10.74046,-0.039 1.18481,-0.032 1.41852,-1.8818 0.45116,-2.3919 -0.51416,-0.2276 -1.09741,-0.1402 -1.64003,-0.1585 -3.566599,0.053 -7.139303,-0.073 -10.699814,0.059 m 31.711304,0.01 c -1.59939,0.2398 -2.898,1.7375 -2.87564,3.3593 -0.0711,1.829 1.57296,3.4995 3.40403,3.4426 1.91641,0.1118 3.65399,-1.7518 3.42841,-3.654 -0.0671,-1.9428 -2.04242,-3.5239 -3.9568,-3.1479 m -6.75318,3.2495 c -0.56089,0 -0.97549,0.5589 -0.84542,1.0995 0.11584,0.7499 1.35754,0.947 1.65222,0.2296 0.33532,-0.5629 -0.15039,-1.3799 -0.8068,-1.3291 z"
   id="path10013" /><path
   style="fill:#303030;stroke:#303030;stroke-width:0.06096765"
   inkscape:connector-curvature="0"
   d="m 91.349862,2255.8052 c 3.560511,-0.1321 7.133215,-0.01 10.699818,-0.059 0.54262,0.018 1.12587,-0.069 1.64003,0.1585 0.96736,0.5101 0.73365,2.3594 -0.45116,2.3919 -3.578797,0.079 -7.161663,0 -10.740464,0.039 -0.47758,-0.016 -0.981579,0.037 -1.428675,-0.1606 -0.908418,-0.4816 -0.778354,-2.1582 0.280451,-2.3696 z"
   id="path10015" /><path
   style="fill:#949494;stroke:#949494;stroke-width:0.06096765"
   inkscape:connector-curvature="0"
   d="m 123.06117,2255.8154 c 1.91438,-0.376 3.88974,1.2051 3.9568,3.1479 0.22558,1.9022 -1.512,3.7658 -3.42841,3.654 -1.83107,0.057 -3.47516,-1.6136 -3.40403,-3.4426 -0.0224,-1.6218 1.27625,-3.1195 2.87564,-3.3593 m -0.0224,0.5853 c -1.22748,0.2194 -2.1989,1.3331 -2.28425,2.5728 -0.18697,1.5973 1.23561,3.1256 2.835,3.1012 1.54857,0.059 2.92848,-1.3596 2.8858,-2.898 0.0366,-1.7254 -1.74569,-3.2008 -3.43655,-2.776 z"
   id="path10017" /><path
   style="fill:#303030;stroke:#303030;stroke-width:0.06096765"
   inkscape:connector-curvature="0"
   d="m 123.03881,2256.4007 c 1.69082,-0.4248 3.47313,1.0506 3.43655,2.776 0.0427,1.5384 -1.33723,2.9569 -2.8858,2.898 -1.59939,0.024 -3.02197,-1.5039 -2.835,-3.1012 0.0854,-1.2397 1.05677,-2.3534 2.28425,-2.5728 z"
   id="path10019" /><path
   style="fill:#303030;stroke:#303030;stroke-width:0.06096765"
   inkscape:connector-curvature="0"
   d="m 116.30799,2259.0649 c 0.65641,-0.051 1.14214,0.7662 0.8068,1.3291 -0.29468,0.7174 -1.53638,0.5203 -1.65222,-0.2296 -0.13007,-0.5406 0.28451,-1.0974 0.84542,-1.0995 z"
   id="path10021" /><path
   style="fill:#303030;stroke:#303030;stroke-width:0.06096765"
   inkscape:connector-curvature="0"
   d="m 65.552417,2265.7592 c 20.418066,-0.032 40.838163,0 61.256233,-0.016 l 0.0203,0.1768 c -11.91918,0.02 -23.83632,0 -35.753462,0.01 -8.529374,-0.014 -17.058749,0.03 -25.586091,-0.022 z"
   id="path10023" /><path
   style="fill:#ffffff;stroke:#ffffff;stroke-width:0.06096765"
   inkscape:connector-curvature="0"
   d="m 65.489417,2265.9055 c 8.527342,0.053 17.056717,0.01 25.586091,0.022 11.917142,-0.01 23.834282,0.012 35.753462,-0.01 0.0935,3.9914 -0.0203,7.9868 0.0549,11.9802 -11.39485,-0.012 -22.78971,0 -34.182528,0 -9.086212,0.022 -18.172424,-0.047 -27.254572,0.033 0.142258,-2.7903 0.02439,-5.5907 0.06097,-8.3871 -0.0041,-1.1624 0.03861,-2.329 -0.063,-3.4894 l 0.04471,-0.1463 m 49.96908,2.6399 c -0.0508,0.3353 -0.0549,0.6727 -0.0224,1.0121 1.02019,0.126 2.04851,0.047 3.0748,0.065 1.827,-0.043 3.66212,0.095 5.48506,-0.075 0.0122,-0.3312 0.008,-0.6645 -0.0142,-0.9938 -1.07506,-0.1341 -2.15825,-0.059 -3.23535,-0.075 -1.76196,0.039 -3.53003,-0.081 -5.28793,0.067 m 0.0325,2.8797 c -0.0366,0.3049 -0.0528,0.6138 -0.006,0.9206 1.60955,0.1911 3.23738,0.041 4.85506,0.087 1.16855,-0.047 2.35132,0.1158 3.50767,-0.1077 l 0.15242,0.012 c -0.004,-0.3048 -0.002,-0.6097 0.004,-0.9145 l -0.16055,0.018 c -2.78013,-0.083 -5.56838,-0.057 -8.35257,-0.016 m -0.004,2.8452 c -0.0386,0.3007 -0.0427,0.6076 0,0.9104 1.06897,0.1545 2.15013,0.065 3.22723,0.087 1.70912,-0.055 3.43247,0.1199 5.13144,-0.1036 l 0.16055,0.016 c -0.004,-0.3048 -0.004,-0.6076 0,-0.9104 l -0.15852,0.014 c -0.95922,-0.1707 -1.93267,-0.083 -2.89799,-0.1 -1.8209,0.041 -3.6479,-0.096 -5.46271,0.085 z"
   id="path10025" /><path
   style="fill:#3c3c3c;stroke:#3c3c3c;stroke-width:0.06096765"
   inkscape:connector-curvature="0"
   d="m 65.269934,2268.3219 c 0.0041,-0.7581 -0.09348,-1.5425 0.174774,-2.2701 0.101613,1.1604 0.05893,2.327 0.063,3.4894 -0.03658,2.7964 0.08129,5.5968 -0.06097,8.3871 -0.294677,-0.9409 -0.154451,-1.9326 -0.172742,-2.9 -0.0061,-2.2355 0.0041,-4.471 -0.0041,-6.7064 z"
   id="path10027" /><path
   style="fill:#818181;stroke:#818181;stroke-width:0.06096765"
   inkscape:connector-curvature="0"
   d="m 115.4585,2268.5454 c 1.7579,-0.1483 3.52597,-0.028 5.28793,-0.067 1.0771,0.016 2.16029,-0.059 3.23535,0.075 0.0224,0.3293 0.0264,0.6626 0.0142,0.9938 -1.82294,0.1707 -3.65806,0.032 -5.48506,0.075 -1.02629,-0.018 -2.05461,0.061 -3.0748,-0.065 -0.0325,-0.3394 -0.0284,-0.6768 0.0224,-1.0121 z"
   id="path10029" /><path
   style="fill:#303030;stroke:#303030;stroke-width:0.06096765"
   inkscape:connector-curvature="0"
   d="m 115.49102,2271.4251 c 2.78419,-0.041 5.57244,-0.067 8.35257,0.016 -2.73745,0.1544 -5.48709,-0.033 -8.2286,0.089 0,0.1768 -0.002,0.5284 -0.002,0.7052 2.74355,0.1158 5.49319,-0.065 8.2347,0.089 -1.15635,0.2235 -2.33912,0.061 -3.50767,0.1077 -1.61768,-0.047 -3.24551,0.1037 -4.85506,-0.087 -0.0467,-0.3068 -0.0305,-0.6157 0.006,-0.9206 z"
   id="path10031" /><path
   style="fill:#838383;stroke:#838383;stroke-width:0.06096765"
   inkscape:connector-curvature="0"
   d="m 123.84359,2271.4414 0.16055,-0.018 c -0.006,0.3048 -0.008,0.6097 -0.004,0.9145 l -0.15242,-0.012 c -2.74151,-0.1544 -5.49115,0.026 -8.2347,-0.089 0,-0.1768 0.002,-0.5284 0.002,-0.7052 2.74151,-0.1219 5.49115,0.065 8.2286,-0.089 z"
   id="path10033" /><path
   style="fill:#303030;stroke:#303030;stroke-width:0.06096765"
   inkscape:connector-curvature="0"
   d="m 115.48695,2274.2703 c 1.81481,-0.1809 3.64181,-0.045 5.46271,-0.085 0.96532,0.016 1.93877,-0.071 2.89799,0.1 -2.74151,0.1382 -5.49115,-0.035 -8.23266,0.083 0,0.1789 -0.002,0.5345 -0.002,0.7113 2.74152,0.1199 5.49116,-0.057 8.23267,0.085 -1.69897,0.2235 -3.42232,0.049 -5.13144,0.1036 -1.0771,-0.022 -2.15826,0.067 -3.22723,-0.087 -0.0427,-0.3028 -0.0386,-0.6097 0,-0.9104 z"
   id="path10035" /><path
   style="fill:#828282;stroke:#828282;stroke-width:0.06096765"
   inkscape:connector-curvature="0"
   d="m 123.84765,2274.2845 0.15852,-0.014 c -0.004,0.3028 -0.004,0.6056 0,0.9104 l -0.16055,-0.016 c -2.74151,-0.1423 -5.49115,0.035 -8.23267,-0.085 0,-0.1768 0.002,-0.5324 0.002,-0.7113 2.74151,-0.1179 5.49115,0.055 8.23266,-0.083 z"
   id="path10037" /><path
   style="fill:#818181;stroke:#818181;stroke-width:0.06096765"
   inkscape:connector-curvature="0"
   d="m 65.44674,2277.9283 c 9.082148,-0.079 18.16836,-0.01 27.254572,-0.033 11.392818,0 22.787678,-0.01 34.182528,0 0.0325,0.7357 0.0345,1.4734 0.002,2.2111 l -0.18493,-0.01 c -0.82307,-0.185 -1.66645,-0.1423 -2.49968,-0.1281 H 76.646497 c -3.710897,-0.032 -7.425859,0.067 -11.134725,-0.047 0.002,-0.6686 0.01016,-1.3372 -0.06503,-2.0018 z"
   id="path10039" /><path
   style="fill:#ffffff;stroke:#ffffff;stroke-width:0.06096765"
   inkscape:connector-curvature="0"
   d="m 65.42845,2280.2268 c 1.635965,-0.1036 3.278027,-0.01 4.918057,-0.041 17.747683,0 35.495363,0 53.245083,0 1.03442,0 2.07493,0.045 3.10935,-0.081 l 0.18493,0.01 c -0.061,10.8583 0,21.7187 -0.0305,32.5791 -0.29468,0.012 -0.58935,0.024 -0.882,0.039 -0.26622,-0.5711 -0.53855,-1.1381 -0.76209,-1.7254 -0.69908,-1.7965 -1.65629,-3.4752 -2.44887,-5.229 0.16055,-3.4711 0.0285,-6.9503 0.0711,-10.4234 -0.0183,-3.5341 0.0386,-7.0682 -0.0264,-10.6003 -10.57586,-0.069 -21.15578,-0.01 -31.731632,-0.03 -7.184022,0.02 -14.366011,-0.039 -21.548,0.028 -0.03048,2.3899 -0.02032,4.7798 -0.002,7.1698 -0.670644,0.6036 -1.221385,1.3331 -1.92861,1.9001 -0.796644,0.6524 -1.493708,1.4124 -2.148094,2.2071 0.138194,-3.4732 0.02235,-6.9544 0.06097,-10.4296 -0.04064,-1.7884 0.08942,-3.5849 -0.08129,-5.3692 z"
   id="path10041" /><path
   style="fill:#3c3c3c;stroke:#3c3c3c;stroke-width:0.06096765"
   inkscape:connector-curvature="0"
   d="m 65.263837,2281.1129 c 0,-0.3028 0.0691,-0.5995 0.164613,-0.8861 0.170709,1.7843 0.04064,3.5808 0.08129,5.3692 -0.03861,3.4752 0.07723,6.9564 -0.06097,10.4296 -0.09145,-0.2825 -0.188999,-0.5691 -0.184935,-0.8698 0.01626,-4.6803 0.01219,-9.3606 0,-14.0429 z"
   id="path10043" /><path
   style="fill:#f29b75;stroke:#f29b75;stroke-width:0.06096765"
   inkscape:connector-curvature="0"
   d="m 69.527508,2284.7486 c 7.181989,-0.067 14.363978,-0.01 21.548,-0.028 10.575852,0.02 21.155772,-0.039 31.731632,0.03 0.065,3.5321 0.008,7.0662 0.0264,10.6003 -0.0427,3.4731 0.0894,6.9523 -0.0711,10.4234 -1.41039,-2.3534 -2.54642,-4.9343 -4.54616,-6.869 -1.60751,-1.9022 -4.32667,-3.1704 -6.79179,-2.3107 -1.26203,0.3312 -2.16435,1.3413 -3.09716,2.1867 -0.85151,0.7743 -1.53842,1.7355 -1.83106,2.8594 -0.693,1.7498 -0.45929,3.6621 -0.3211,5.4871 -8.488727,0.063 -16.979488,0 -25.468217,0.03 0.762095,-3.1866 1.61361,-6.4829 1.046611,-9.7772 -0.07926,-0.626 -0.536515,-1.0873 -0.867773,-1.5892 -0.445064,-0.6422 -0.729579,-1.4084 -1.345353,-1.9165 -0.853547,-0.7234 -1.682707,-1.5384 -2.755737,-1.9245 -2.310674,-0.9166 -4.918057,-0.7316 -7.259215,-0.032 -0.01829,-2.39 -0.02845,-4.7799 0.002,-7.1698 z"
   id="path10045" /><path
   style="fill:#303030;stroke:#303030;stroke-width:0.06096765"
   inkscape:connector-curvature="0"
   d="m 59.9312,2285.2892 c 0.284516,0.821 0.182903,1.6928 0.184935,2.5423 0,5.6253 0.002,11.2526 -0.0041,16.8779 -0.0041,0.382 0.148354,0.7377 0.280451,1.0893 -0.119903,0.2215 -0.278419,0.4166 -0.440999,0.6097 -0.142258,-1.8535 -0.02845,-3.715 -0.063,-5.5705 0.02642,-5.1822 -0.05894,-10.3665 0.04268,-15.5487 z"
   id="path10049" /><path
   style="fill:#ffffff;stroke:#ffffff;stroke-width:0.06096765"
   inkscape:connector-curvature="0"
   d="m 80.706943,2307.1583 c 8.488729,-0.028 16.97949,0.032 25.468217,-0.03 0.2581,1.8757 0.76819,3.7027 1.11571,5.5602 -8.114794,0.039 -16.229588,0.01 -24.344382,0.016 -1.375837,-0.02 -2.755738,0.065 -4.129542,-0.071 0.70316,-1.7985 1.255933,-3.6519 1.889997,-5.4748 z"
   id="path10057" /><path
   style="fill:#727272;stroke:#727272;stroke-width:0.06096765"
   inkscape:connector-curvature="0"
   d="m 78.538527,2313.2794 c 0.08942,-0.2174 0.186967,-0.4308 0.278419,-0.6463 1.373804,0.1362 2.753705,0.051 4.129542,0.071 8.114794,-0.01 16.229588,0.022 24.344382,-0.016 0.0264,0.1321 0.0793,0.3943 0.10568,0.5264 -3.26787,0.1544 -6.5459,0.026 -9.817826,0.067 -6.346733,0 -12.693465,0 -19.040197,0 z"
   id="path10059" /><path
   style="fill:#ffffff;stroke:#ffffff;stroke-width:0.06096765"
   inkscape:connector-curvature="0"
   d="m 78.538527,2313.2794 c 6.346732,0.01 12.693464,0 19.040197,0 3.271926,-0.041 6.549956,0.087 9.817826,-0.067 0.12803,0.6036 0.22964,1.2132 0.39832,1.8087 -4.82661,0.1 -9.657276,0.014 -14.483882,0.043 -5.157863,-0.014 -10.315726,0.028 -15.473589,-0.022 0.247935,-0.5833 0.457257,-1.1807 0.701128,-1.764 z"
   id="path10061" /><path
   style="fill:#faf8f6;stroke:#faf8f6;stroke-width:0.06096765"
   inkscape:connector-curvature="0"
   d="m 126.18678,2313.2652 c 0.16461,-0.01 0.4918,-0.018 0.65438,-0.026 0.0183,0.6157 0.0102,1.2315 0.0142,1.8473 -0.26623,-0.5914 -0.47758,-1.2031 -0.66861,-1.8209 z"
   id="path10063" /><path
   style="fill:#808080;stroke:#808080;stroke-width:0.06096765"
   inkscape:connector-curvature="0"
   d="m 77.837399,2315.0434 c 5.157863,0.051 10.315726,0.01 15.473589,0.022 4.826606,-0.028 9.657272,0.057 14.483882,-0.043 0.13819,0.4837 0.28248,0.9673 0.40035,1.4571 -5.09486,0.081 -10.193787,0.012 -15.290683,0.035 -5.222895,-0.012 -10.443758,0.026 -15.664621,-0.018 0.195096,-0.4878 0.392225,-0.9715 0.597483,-1.4531 z"
   id="path10065" /><path
   style="fill:#ffffff;stroke:#ffffff;stroke-width:0.06096765"
   inkscape:connector-curvature="0"
   d="m 77.239916,2316.4965 c 5.220863,0.045 10.441726,0.01 15.664621,0.018 5.096896,-0.022 10.195823,0.047 15.290683,-0.035 0.35565,1.5669 0.89623,3.085 1.22749,4.6579 -3.12968,0.1667 -6.26951,0.028 -9.40325,0.073 -6.927955,-0.01 -13.855912,0.02 -20.781838,-0.014 0.01016,0.2398 0.02439,0.4796 0.03861,0.7214 10.112501,-0.051 20.22297,0.01 30.333438,-0.026 0.31907,1.4653 0.79462,2.8878 1.20513,4.3287 0.27639,0.9206 0.33126,1.894 0.64423,2.8065 -4.284,0.091 -8.57206,-0.016 -12.856053,0.055 0.01219,5.4729 -0.03455,10.9457 0.02439,16.4166 5.476923,0 10.955883,-0.051 16.432813,0.024 0.14632,1.3575 0.22965,2.7212 0.38613,4.0787 -3.81251,0.01 -7.62502,-0.031 -11.43753,0.018 -1.41039,-0.081 -2.79029,-0.4308 -4.206769,-0.4532 -2.156223,-0.1646 -4.422187,-0.3292 -6.491023,0.4166 -5.757378,0.035 -11.516789,0.01 -17.274167,0.014 -2.1989,-0.02 -4.399832,0.051 -6.598732,-0.043 0.353612,-1.2499 0.575128,-2.5302 0.89216,-3.7882 4.879444,0.124 9.764985,0.018 14.648494,0.053 2.975221,-0.024 5.950442,0.051 8.923632,-0.035 0.002,-5.5582 0.01422,-11.1164 -0.0061,-16.6746 -6.893409,-0.022 -13.786818,-0.012 -20.680227,0 0.392225,-1.7396 1.001902,-3.4406 1.113676,-5.229 0.45116,-2.6399 1.914384,-4.9343 2.910189,-7.3811 z"
   id="path10067" /><path
   style="fill:#777777;stroke:#777777;stroke-width:0.06096765"
   inkscape:connector-curvature="0"
   d="m 79.237622,2321.1971 c 6.925926,0.035 13.853883,0.01 20.781838,0.014 3.13374,-0.045 6.27357,0.093 9.40325,-0.073 0.0589,0.25 0.12193,0.5 0.18696,0.754 -10.110465,0.032 -20.220934,-0.024 -30.333435,0.026 -0.01422,-0.2418 -0.02845,-0.4816 -0.03861,-0.7214 z"
   id="path10069" /><path
   style="fill:#7ecef4;stroke:#7ecef4;stroke-width:0.06096765"
   inkscape:connector-curvature="0"
   d="m 73.216051,2329.1066 c 6.893409,-0.01 13.786818,-0.018 20.680227,0 0.02032,5.5582 0.0081,11.1164 0.0061,16.6746 -2.97319,0.085 -5.948411,0.01 -8.923632,0.035 -4.883509,-0.035 -9.76905,0.071 -14.648494,-0.053 0.272322,-1.0303 0.457257,-2.083 0.554805,-3.1439 0.569032,-4.54 1.426643,-9.0354 2.330997,-13.5165 z"
   id="path10071" /><path
   style="fill:#fdf898;stroke:#fdf898;stroke-width:0.06096765"
   inkscape:connector-curvature="0"
   d="m 98.60298,2329.0822 c 4.28399,-0.071 8.57205,0.037 12.85605,-0.055 1.29048,3.1663 2.32286,6.4464 3.01586,9.7975 0.36784,1.573 0.004,3.1968 0.29671,4.7779 0.10365,0.6381 0.21339,1.2762 0.28858,1.9205 -5.47693,-0.075 -10.95589,-0.026 -16.432813,-0.024 -0.05894,-5.4709 -0.01219,-10.9437 -0.02439,-16.4166 z"
   id="path10073" /><g
   id="g10162"
   transform="matrix(1.3045413,0,0,1.3045413,-304.69194,1600.8179)"><path
     id="path10142"
     d="m 303.3,521.78 c 0,3.0684 -7.4623,5.5558 -16.668,5.5558 -9.2057,0 -16.668,-2.4874 -16.668,-5.5558 0,-3.0684 7.4623,-5.5558 16.668,-5.5558 9.2057,0 16.668,2.4874 16.668,5.5558 z"
     transform="matrix(1.1818,0,0,1.1818,-30.649,-65.984)"
     inkscape:connector-curvature="0"
     style="fill:#2e3436;filter:url(#g)" /><path
     id="path10144"
     d="m 288.40625,517.5 v 30.09191 h 0.125 c -0.0806,0.24126 -0.125,0.47032 -0.125,0.71875 0,3.6263 8.80861,6.5625 19.6875,6.5625 10.87889,0 19.6875,-2.9362 19.6875,-6.5625 0,-0.24879 -0.0442,-0.47715 -0.125,-0.71875 h 0.125 V 517.5 Z"
     style="fill:url(#linearGradient10164)"
     inkscape:connector-curvature="0" /><path
     id="path10146"
     d="m 303.3,521.78 c 0,3.0684 -7.4623,5.5558 -16.668,5.5558 -9.2057,0 -16.668,-2.4874 -16.668,-5.5558 0,-3.0684 7.4623,-5.5558 16.668,-5.5558 9.2057,0 16.668,2.4874 16.668,5.5558 z"
     transform="matrix(1.1818,0,0,1.1818,-30.649,-99.394)"
     style="fill:url(#linearGradient10166)"
     inkscape:connector-curvature="0" /><path
     id="path10148"
     d="m 288.38,539.09 c 0.14735,3.584 8.9318,6.4688 19.719,6.4688 10.756,0 19.492,-2.8677 19.688,-6.4375 -3.4515,2.9359 -10.959,4.9688 -19.688,4.9688 -8.7461,0 -16.277,-2.0544 -19.719,-5 z"
     inkscape:connector-curvature="0"
     style="fill:#565656" /><path
     id="path10150"
     d="m 288.38,517.34 c 0.14735,3.584 8.9318,6.4688 19.719,6.4688 10.756,0 19.492,-2.8677 19.688,-6.4375 -0.21572,0.18349 -0.44078,0.35509 -0.6875,0.53125 l -0.0312,0.0312 c -2.2921,2.7774 -9.9035,4.8125 -18.969,4.8125 -9.122,0 -16.786,-2.0707 -19.031,-4.875 l -0.0625,-0.0625 c -0.21872,-0.15969 -0.43159,-0.30323 -0.625,-0.46875 z"
     style="fill:url(#linearGradient10168)"
     inkscape:connector-curvature="0" /><g
     id="g10156"
     transform="translate(0,-0.52315)"><path
       id="path10152"
       d="m 288.38,529.09 c 0.14735,3.584 8.9318,6.4688 19.719,6.4688 10.756,0 19.492,-2.8677 19.688,-6.4375 -3.4515,2.9359 -10.959,4.9688 -19.688,4.9688 -8.7461,0 -16.277,-2.0544 -19.719,-5 z"
       inkscape:connector-curvature="0"
       style="fill:#565656" /><path
       id="path10154"
       d="m 288.38,529.09 c 0.14735,3.584 8.9318,6.4688 19.719,6.4688 10.756,0 19.492,-2.8677 19.688,-6.4375 l -0.15625,0.125 c -1.2422,3.2268 -9.5106,5.7188 -19.531,5.7188 -10.113,0 -18.468,-2.5112 -19.594,-5.7812 l -0.125,-0.0937 z"
       style="fill:url(#linearGradient10170)"
       inkscape:connector-curvature="0" /></g><path
     id="path10158"
     d="m 288.38,539.09 c 0.14735,3.584 8.9318,6.4688 19.719,6.4688 10.756,0 19.492,-2.8677 19.688,-6.4375 l -0.15625,0.125 c -1.2422,3.2268 -9.5106,5.7188 -19.531,5.7188 -10.113,0 -18.468,-2.5112 -19.594,-5.7812 l -0.125,-0.0937 z"
     style="fill:url(#linearGradient10172)"
     inkscape:connector-curvature="0" /><path
     id="path10160"
     d="m 288.5,549.94 c 1.126,3.27 9.481,5.7812 19.594,5.7812 10.021,0 18.289,-2.492 19.531,-5.7188 -3.5163,2.8678 -10.929,4.8438 -19.531,4.8438 -8.6478,0 -16.1,-2.0137 -19.594,-4.9062 z"
     inkscape:connector-curvature="0"
     style="fill:#565656" /></g><path
   style="fill:#7e7e7e;stroke:#7e7e7e;stroke-width:0.06096765"
   inkscape:connector-curvature="0"
   d="m 69.167799,2350.2888 c 0.09552,-0.2439 0.186967,-0.4877 0.27029,-0.7336 2.1989,0.093 4.399832,0.022 6.598732,0.043 5.757378,-0.01 11.516789,0.02 17.274167,-0.014 -0.329225,0.2683 -0.650321,0.5467 -0.953127,0.8434 -0.28858,-0.057 -0.577161,-0.1097 -0.867773,-0.1219 -7.440086,-0.01 -14.882204,0.024 -22.322289,-0.016 z"
   id="path10075" /><path
   style="fill:#7e7e7e;stroke:#7e7e7e;stroke-width:0.06096765"
   inkscape:connector-curvature="0"
   d="m 104.00878,2349.6202 c 3.81251,-0.049 7.62502,-0.012 11.43753,-0.018 0.0244,0.2784 0.0549,0.5568 0.0915,0.8393 -3.0118,0.1138 -6.0297,0.051 -9.0415,0.037 -0.82103,-0.3109 -1.66239,-0.5568 -2.48748,-0.8576 z"
   id="path10077" /><path
   style="fill:#303030;stroke:#303030;stroke-width:0.06096765"
   inkscape:connector-curvature="0"
   d="m 69.167799,2350.2888 c 7.440085,0.041 14.882203,0.01 22.322289,0.016 0.290612,0.012 0.579193,0.065 0.867773,0.1219 -4.828638,0.1 -9.661341,0.014 -14.492011,0.043 -2.922382,-0.014 -5.844765,0.03 -8.765115,-0.022 z"
   id="path10079" /><path
   style="fill:#ffffff;stroke:#ffffff;stroke-width:0.06096765"
   inkscape:connector-curvature="0"
   d="m 69.100735,2350.4473 c 2.92035,0.053 5.842733,0.01 8.765115,0.022 4.83067,-0.028 9.663373,0.057 14.492011,-0.043 -0.857612,0.9795 -1.717256,2.0851 -1.894062,3.4162 -5.960604,-0.063 -11.921208,-0.01 -17.881812,-0.026 -1.652223,0.028 -3.308511,-0.067 -4.95667,0.059 0.489774,-1.1441 1.016128,-2.272 1.475418,-3.4284 z"
   id="path10081" /><path
   style="fill:#ffffff;stroke:#ffffff;stroke-width:0.06096765"
   inkscape:connector-curvature="0"
   d="m 106.49626,2350.4778 c 3.0118,0.014 6.0297,0.077 9.0415,-0.037 0.17274,1.134 0.32923,2.27 0.50603,3.4061 -1.42054,-0.063 -2.84515,-0.063 -4.26367,0 -1.46729,-1.5303 -3.33493,-2.583 -5.28386,-3.3715 z"
   id="path10083" /><rect
   style="fill:#dadada;fill-opacity:1;stroke:none;stroke-width:6.38995171;stroke-linecap:round;stroke-miterlimit:4;stroke-dasharray:none;stroke-opacity:1"
   id="rect10216"
   width="61.427097"
   height="87.928276"
   x="65.489418"
   y="2265.9055" /><path
   style="fill:#535353;stroke:#535353;stroke-width:0.06096765"
   inkscape:connector-curvature="0"
   d="m 63.721356,2360.2631 c 1.735545,-1.825 2.936608,-4.0828 3.903961,-6.3874 0.654387,0.3293 1.408353,0.1728 2.111513,0.1972 6.907635,-0.01 13.813238,0 20.71884,-0.01 0.01219,0.8047 -0.03048,1.6197 0.111774,2.4163 0.308903,1.2356 1.058805,2.331 2.062739,3.1094 0.536515,0.5588 0.989708,1.1929 1.491675,1.7843 0.993773,1.4429 2.485448,2.4854 3.265834,4.0787 1.129934,1.4653 2.23548,2.9549 3.115448,4.5889 -6.633282,0.043 -13.266562,0.01 -19.899842,0.02 -5.109089,-0.091 -10.222243,0.01 -15.331332,-0.049 -2.63177,-0.073 -5.094863,-2.2924 -5.306218,-4.9303 0.951096,-1.8127 2.231416,-3.4548 3.755608,-4.8225 z"
   id="path10085" /><path
   style="fill:#383838;stroke:#383838;stroke-width:0.06096765"
   inkscape:connector-curvature="0"
   d="m 67.625317,2353.8757 c 1.648159,-0.126 3.304447,-0.03 4.95667,-0.059 5.960604,0.016 11.921208,-0.037 17.881812,0.026 l -0.0081,0.2236 c -6.905602,0.01 -13.811205,0 -20.71884,0.01 -0.70316,-0.024 -1.457126,0.1321 -2.111513,-0.1972 z"
   id="path10087" /><path
   style="fill:#535353;stroke:#535353;stroke-width:0.06096765"
   inkscape:connector-curvature="0"
   d="m 111.78012,2353.8493 c 1.41852,-0.065 2.84313,-0.065 4.26367,0 0.24591,2.3269 0.91249,4.5766 1.57906,6.8101 0.25607,0.8535 0.693,1.6786 0.65236,2.5952 -0.29063,-0.1687 -0.56903,-0.3659 -0.76413,-0.6422 -1.11367,-1.449 -2.07087,-3.0139 -2.87361,-4.6559 -0.72754,-1.51 -1.74367,-2.8594 -2.85735,-4.1052 z"
   id="path10089" /><path
   style="fill:#feefe8;stroke:#feefe8;stroke-width:0.06096765"
   inkscape:connector-curvature="0"
   d="m 92.630183,2359.5925 c 0.113806,-1.1605 1.003934,-2.4387 2.296448,-2.3005 2.003803,-0.2419 3.603188,1.14 5.013573,2.3533 0.516196,0.441 0.839326,1.195 0.611706,1.8615 -0.45522,0.4431 -1.042544,0.7215 -1.495737,1.1666 -0.457257,0.445 -0.733644,1.0344 -1.164482,1.4998 -0.211354,0.071 -0.420677,0.071 -0.627967,0 -1.168546,-0.8027 -1.751803,-2.2985 -3.141866,-2.7984 -0.501967,-0.5914 -0.95516,-1.2254 -1.491675,-1.7843 z"
   id="path10091" /><path
   style="fill:#ccb8d8;stroke:#ccb8d8;stroke-width:0.06096765"
   inkscape:connector-curvature="0"
   d="m 17.778167,2375.503 c 0.184935,-0.2398 0.406451,-0.5609 0.74787,-0.5447 1.133998,-0.03 2.263932,0.1382 3.39793,0.079 0.191032,0.1687 0.382064,0.3394 0.573096,0.5121 -0.542612,0.7967 -1.16245,1.5364 -1.774159,2.2802 -0.45116,0.4979 -0.554805,1.3149 -0.184935,1.8859 1.060837,1.4897 2.345222,2.7964 3.530027,4.1844 1.631901,1.9449 3.454833,3.717 5.233057,5.5278 1.505901,1.3453 3.04635,2.6582 4.64167,3.8958 2.963028,2.142 5.883378,4.3572 9.049632,6.1964 3.905994,2.1298 8.080245,3.6905 12.242304,5.231 0.569031,0.1869 1.347385,0.3373 1.776191,-0.2012 0.701128,-0.756 1.038482,-1.7538 1.507933,-2.6521 1.65832,0.4958 2.800447,2.4306 2.347254,4.1052 -1.392094,1.703 -2.999608,3.2129 -4.535993,4.7839 -1.233579,1.2762 -2.619577,2.4082 -3.696672,3.8287 -1.257966,1.2418 -1.995674,2.8737 -2.993511,4.3084 -1.203095,1.7193 -2.245642,3.5463 -3.542221,5.1985 -2.576899,3.7658 -5.273702,7.4483 -7.998955,11.1104 -2.522029,3.4812 -5.20867,6.8405 -7.899376,10.1917 -3.056511,3.839 -6.310151,7.5133 -9.460147,11.273 -4.916025,5.739 -9.947888,11.3745 -14.8964289,17.0851 H 0.03048384 v -77.122 c 3.71699436,-2.7842 7.26937616,-5.7859 10.65917716,-8.9582 0.72958,-0.6341 0.930773,-1.6278 1.459159,-2.4042 2.060707,-3.1561 3.745446,-6.5357 5.629347,-9.7954 z"
   id="path10093" /><path
   style="fill:#ccb8d8;stroke:#ccb8d8;stroke-width:0.06096765"
   inkscape:connector-curvature="0"
   d="m 182.69363,2410.3562 c 0.47961,-0.3232 1.08725,-0.3211 1.63393,-0.1972 1.11368,0.4004 2.06071,1.2235 2.74558,2.1725 0.0793,2.396 0.48571,4.7839 0.34142,7.1881 -0.0325,0.5833 -0.11381,1.1868 0.10771,1.7477 0.80274,2.3148 1.44899,4.6803 2.29848,6.9788 0.75396,2.2152 1.61564,4.3937 2.37977,6.6089 1.17261,3.5686 2.43667,7.1068 3.49751,10.712 1.27625,4.219 2.23345,8.5253 3.28412,12.8032 1.00597,4.3877 2.10948,8.7509 3.25771,13.102 v 2.3106 h -48.65219 c -2.28629,-9.5678 -4.4486,-19.1784 -5.93012,-28.9088 -0.75193,-4.666 -1.50996,-9.3321 -2.36961,-13.9799 -0.14429,-1.4957 -0.64625,-2.9305 -0.73364,-4.4303 -0.60767,-1.01 -1.33316,-1.9428 -2.10339,-2.8329 -0.64625,-0.6626 -0.41254,-1.6624 -0.14225,-2.4388 0.33329,-0.9185 0.5548,-1.9225 1.19699,-2.6866 0.30484,-0.3922 0.84136,-0.3902 1.27626,-0.5426 0.39223,1.4348 0.74787,2.8899 1.30064,4.2738 0.30078,0.7621 1.22952,0.6951 1.90219,0.7702 6.49712,0.7032 13.0166,-0.3759 19.34098,-1.8148 1.85951,-0.4552 3.6926,-1.0222 5.51757,-1.6014 3.46499,-1.2051 6.75725,-2.9345 9.68979,-5.1416 0.32516,-0.2926 0.8129,-0.5446 0.82711,-1.0364 0.0874,-1.067 -0.45726,-2.0363 -0.66658,-3.0565 z"
   id="path10095" /><path
   style="fill:#fcd8c5;stroke:#fcd8c5;stroke-width:0.06096765"
   inkscape:connector-curvature="0"
   d="m 56.994591,2290.7417 c 1.007999,-1.8026 1.816836,-3.715 2.936609,-5.4525 -0.101613,5.1822 -0.01626,10.3665 -0.04268,15.5487 0.03455,1.8555 -0.07926,3.717 0.063,5.5705 0.16258,-0.1931 0.321096,-0.3882 0.440999,-0.6097 0.644225,-1.1686 1.08116,-2.4367 1.737578,-3.5971 0.341419,-0.7215 0.453193,-1.5344 0.851515,-2.2335 0.743805,-1.3595 1.495739,-2.7313 2.467157,-3.9425 0.654386,-0.7947 1.35145,-1.5547 2.148094,-2.2071 0.707225,-0.567 1.257966,-1.2965 1.92861,-1.9001 2.341158,-0.6991 4.948541,-0.8841 7.259215,0.032 1.07303,0.3861 1.90219,1.2011 2.755737,1.9245 0.615774,0.5081 0.900289,1.2743 1.345353,1.9165 0.331258,0.5019 0.788515,0.9632 0.867773,1.5892 0.566999,3.2943 -0.284516,6.5906 -1.046611,9.7772 -0.634064,1.8229 -1.186837,3.6763 -1.889997,5.4748 -0.09145,0.2155 -0.189,0.4289 -0.278419,0.6463 -0.243871,0.5833 -0.453193,1.1807 -0.701128,1.764 -0.205258,0.4816 -0.402387,0.9653 -0.597483,1.4531 -0.995805,2.4468 -2.459029,4.7412 -2.910189,7.3811 -0.111774,1.7884 -0.721451,3.4894 -1.113676,5.229 -0.904354,4.4811 -1.761965,8.9765 -2.330997,13.5165 -0.09755,1.0609 -0.282483,2.1136 -0.554805,3.1439 -0.317032,1.258 -0.538548,2.5383 -0.89216,3.7882 -0.08332,0.2459 -0.174774,0.4897 -0.27029,0.7336 l -0.06706,0.1585 c -0.45929,1.1564 -0.985644,2.2843 -1.475418,3.4284 -0.967353,2.3046 -2.168416,4.5624 -3.903961,6.3874 -1.524192,1.3677 -2.804512,3.0098 -3.755608,4.8225 0.211355,2.6379 2.674448,4.8571 5.306218,4.9303 5.109089,0.055 10.222243,-0.043 15.331332,0.049 -0.66658,1.1706 -1.505901,2.2537 -2.585029,3.0707 -1.814803,1.4145 -3.629607,2.8838 -5.751281,3.8186 -1.589224,0.7967 -3.202834,1.5588 -4.885541,2.14 0.160548,1.7213 0.304838,3.4589 0.24387,5.1863 -0.422709,0.5243 -0.904353,0.9978 -1.300643,1.5465 -0.863708,1.2397 -2.022094,2.2965 -2.552512,3.7475 -0.658451,1.7132 -1.316901,3.4305 -1.999739,5.1376 -1.095385,2.3899 -1.981449,4.8774 -3.25364,7.186 -0.469451,0.8983 -0.806805,1.8961 -1.507933,2.6521 -0.428806,0.5386 -1.20716,0.3882 -1.776191,0.2012 -4.162059,-1.5404 -8.33631,-3.1012 -12.242304,-5.231 -3.166254,-1.8392 -6.086604,-4.0544 -9.049632,-6.1964 -1.59532,-1.2376 -3.135769,-2.5504 -4.64167,-3.8958 -1.778224,-1.8107 -3.601156,-3.5829 -5.233057,-5.5277 -1.184805,-1.3881 -2.46919,-2.6948 -3.530027,-4.1844 -0.36987,-0.5711 -0.266225,-1.3881 0.184935,-1.886 0.611709,-0.7438 1.231547,-1.4835 1.774159,-2.2802 3.448737,-4.54 6.005313,-9.6593 8.777309,-14.62 1.906255,-3.4427 3.115447,-7.2023 4.3348,-10.9295 0.146322,-0.4735 0.538548,-0.821 0.695031,-1.2905 0.237774,-0.7234 0.345484,-1.4855 0.638128,-2.1928 0.384097,-0.9612 0.428806,-2.0078 0.605612,-3.0179 0.412548,-3.2536 0.99987,-6.4829 1.43274,-9.7345 1.001902,-6.365 1.01816,-12.919 2.910189,-19.1154 1.205128,-1.8107 2.121675,-3.7942 3.351189,-5.5866 0.599515,-0.815 1.414449,-1.4348 2.0729,-2.1989 0.853547,-1.0385 1.967223,-1.8372 2.704931,-2.9773 0.959225,-1.0486 1.47745,-2.4082 2.442771,-3.4507 0.544644,-0.6626 0.804773,-1.4938 1.174643,-2.2559 0.938902,-2.5565 2.184674,-4.9851 3.357285,-7.438 m 14.270495,3.908 c -2.02819,0.8881 -3.078866,2.9671 -4.155961,4.7718 -0.266226,0.3861 -0.229645,0.8616 -0.115839,1.2945 1.201063,0.2337 2.420416,0.4613 3.55035,0.947 1.377868,0.6849 2.804511,1.3129 4.015735,2.2802 0.577161,0.3821 1.042547,1.1198 1.831062,0.9491 1.35145,-1.4693 2.184674,-3.4691 1.902191,-5.4851 -0.02845,-1.8066 -1.475417,-3.1459 -2.904093,-4.0279 -1.186836,-0.8231 -2.729318,-1.071 -4.123445,-0.7296 z"
   id="path10047" /><path
   style="fill:#fcd8c5;stroke:#fcd8c5;stroke-width:0.06096765"
   inkscape:connector-curvature="0"
   d="m 111.42448,2296.5946 c 2.46512,-0.8597 5.18428,0.4085 6.79179,2.3107 1.99974,1.9347 3.13577,4.5156 4.54616,6.869 0.79258,1.7538 1.74977,3.4325 2.44887,5.229 0.22354,0.5873 0.49587,1.1543 0.76209,1.7254 0.0752,0.1747 0.14632,0.3536 0.21339,0.5365 0.19103,0.6178 0.40238,1.2295 0.66861,1.8209 1.31284,3.3247 2.45496,6.7145 3.73935,10.0515 0.69097,1.701 1.01613,3.53 1.77822,5.2066 0.13413,1.006 0.57716,1.9287 0.85558,2.898 0.3089,1.1015 0.65845,2.1969 1.06084,3.2699 1.66442,-1.512 3.21909,-3.2008 5.19647,-4.3124 2.01803,0.034 4.12751,-0.2154 6.04596,0.5751 1.05474,0.5325 2.2741,0.8271 3.08497,1.7478 1.14009,-0.9085 2.43464,-1.5811 3.67025,-2.3453 1.8209,-1.071 4.02386,-1.0791 6.06628,-0.8718 1.6258,0.1545 3.11341,0.8779 4.67419,1.3006 0.82916,-0.2763 1.62377,-0.9449 2.55454,-0.569 1.99974,0.758 4.13767,1.3332 5.85696,2.6562 0.6991,0.6787 1.60955,1.2925 1.764,2.3289 1.60751,4.9364 3.0687,9.9256 4.13564,15.0103 0.73161,3.2374 1.42461,6.4869 1.92048,9.7711 0.59342,2.8817 0.84135,5.8163 1.17058,8.7366 0.1199,2.835 0.40441,5.6842 0.0488,8.5152 -0.18697,1.5364 -0.20119,3.2313 -1.17668,4.5217 -0.73974,0.9511 -1.41241,1.9591 -2.25986,2.8208 -0.52636,0.5955 -1.197,1.073 -1.56484,1.7965 0.65235,0.6239 1.31487,1.2539 1.80464,2.0241 0.41052,0.6341 0.96736,1.2499 0.94907,2.0567 0.26825,1.5831 0.10161,3.2272 0.60358,4.7697 0.72145,2.6663 1.75586,5.2351 2.4509,7.9095 0.51619,1.7864 1.02628,3.5788 1.40835,5.4018 0.20932,1.0202 0.75396,1.9895 0.66658,3.0565 -0.0142,0.4918 -0.50197,0.7438 -0.82711,1.0364 -2.93254,2.2071 -6.2248,3.9365 -9.68979,5.1416 -1.82497,0.5792 -3.65806,1.1462 -5.51757,1.6014 -6.32438,1.4389 -12.84386,2.518 -19.34098,1.8148 -0.67269,-0.075 -1.60141,-0.01 -1.90219,-0.7702 -0.55277,-1.3839 -0.90841,-2.839 -1.30064,-4.2738 -0.88403,-2.6968 -1.51606,-5.4668 -2.31271,-8.19 -1.08115,-3.5768 -1.86967,-7.243 -3.22722,-10.7303 -0.17883,-0.4837 -0.11583,-1.008 -0.13819,-1.5079 -2.31067,0.2113 -4.63761,0.3922 -6.95844,0.2946 -1.10354,-1.0527 -2.73745,-1.1238 -3.92022,-2.0485 -0.93077,-0.7011 -1.95097,-1.2742 -2.85532,-2.0099 -1.02222,-0.6523 -1.83512,-1.5607 -2.79435,-2.2903 -1.43884,-1.2621 -3.15406,-2.1278 -4.7128,-3.2211 -1.99161,-1.0365 -3.95477,-2.1807 -6.11912,-2.8289 -0.6808,-0.2419 -1.33519,-0.5488 -2.0099,-0.7967 -1.93064,-0.6666 -3.33493,-2.2761 -4.4486,-3.9202 -0.55075,-0.7824 -0.72349,-1.7742 -1.35958,-2.4997 -0.21339,-0.2378 -0.35362,-0.5243 -0.41662,-0.8332 -0.66048,-2.5688 -1.67051,-5.0441 -3.0057,-7.3364 -0.879967,-1.634 -1.985514,-3.1236 -3.115448,-4.5889 -0.780386,-1.5933 -2.272061,-2.6358 -3.265834,-4.0787 1.390063,0.4999 1.97332,1.9957 3.141867,2.7984 0.20729,0.069 0.416612,0.069 0.627966,0 0.430838,-0.4654 0.707225,-1.0548 1.164483,-1.4998 0.453192,-0.4451 1.040516,-0.7235 1.495736,-1.1666 0.22762,-0.6665 -0.0955,-1.4205 -0.611706,-1.8615 -1.410384,-1.2133 -3.009769,-2.5952 -5.013573,-2.3533 -1.292514,-0.1382 -2.182641,1.14 -2.296448,2.3005 -1.003934,-0.7784 -1.753836,-1.8738 -2.062739,-3.1094 -0.142257,-0.7966 -0.09958,-1.6116 -0.111774,-2.4163 l 0.0081,-0.2236 c 0.176807,-1.3311 1.03645,-2.4367 1.894062,-3.4162 0.302806,-0.2967 0.623902,-0.5751 0.953128,-0.8434 2.068835,-0.7458 4.3348,-0.5812 6.491022,-0.4166 1.416478,0.022 2.796378,0.3719 4.206768,0.4532 0.82509,0.3008 1.66645,0.5467 2.48748,0.8576 1.94893,0.7885 3.81657,1.8412 5.28386,3.3715 1.11368,1.2458 2.12981,2.5952 2.85735,4.1052 0.80274,1.642 1.75994,3.2069 2.87361,4.6559 0.1951,0.2763 0.47352,0.4735 0.76413,0.6422 0.0406,-0.9166 -0.39629,-1.7417 -0.65235,-2.5952 -0.66658,-2.2335 -1.33316,-4.4832 -1.57907,-6.8101 -0.1768,-1.1361 -0.33329,-2.2721 -0.50603,-3.4061 -0.0366,-0.2825 -0.0671,-0.5609 -0.0914,-0.8393 -0.15648,-1.3575 -0.23981,-2.7212 -0.38613,-4.0787 -0.0752,-0.6443 -0.18493,-1.2824 -0.28858,-1.9205 -0.29264,-1.5811 0.0711,-3.2049 -0.29671,-4.7779 -0.693,-3.3511 -1.72538,-6.6312 -3.01586,-9.7975 -0.31297,-0.9125 -0.36784,-1.8859 -0.64423,-2.8065 -0.41051,-1.4409 -0.88606,-2.8634 -1.20513,-4.3287 -0.065,-0.254 -0.12803,-0.504 -0.18696,-0.754 -0.33126,-1.5729 -0.87184,-3.091 -1.22749,-4.6579 -0.11787,-0.4898 -0.26216,-0.9734 -0.40035,-1.4571 -0.16868,-0.5955 -0.27029,-1.2051 -0.39832,-1.8087 -0.0264,-0.1321 -0.0793,-0.3943 -0.10568,-0.5264 -0.34751,-1.8575 -0.85761,-3.6845 -1.11571,-5.5602 -0.13819,-1.825 -0.3719,-3.7373 0.3211,-5.4871 0.29264,-1.1239 0.97955,-2.0851 1.83106,-2.8594 0.93281,-0.8455 1.83513,-1.8555 3.09716,-2.1867 m 2.07696,3.1012 c -1.6258,0.3089 -3.1378,1.2722 -4.00964,2.6907 -0.56293,0.9166 -0.27842,2.0363 0.004,2.9976 0.26419,0.8109 0.39019,1.6827 0.82306,2.4265 0.22152,0.3902 0.74584,0.3577 1.071,0.128 1.87577,-1.1726 3.92632,-2.0383 6.02564,-2.7191 0.34954,-0.1402 0.84541,-0.3049 0.89216,-0.7418 0.0122,-1.4978 -0.8881,-2.7679 -1.77823,-3.8897 -0.80884,-0.7296 -1.93877,-1.1767 -3.02806,-0.8922 z"
   id="path10053" /><path
   style="fill:#feefe8;stroke:#feefe8;stroke-width:0.06096765"
   inkscape:connector-curvature="0"
   d="m 71.265086,2294.6497 c 1.394127,-0.3414 2.936609,-0.093 4.123445,0.7296 1.428676,0.882 2.875641,2.2213 2.904093,4.0279 0.282483,2.016 -0.550741,4.0158 -1.902191,5.4851 -0.788515,0.1707 -1.253901,-0.567 -1.831062,-0.9491 -1.211224,-0.9673 -2.637867,-1.5953 -4.015735,-2.2802 -1.129934,-0.4857 -2.349287,-0.7133 -3.55035,-0.947 -0.113806,-0.4329 -0.150387,-0.9084 0.115839,-1.2945 1.077095,-1.8047 2.127771,-3.8837 4.155961,-4.7718 z"
   id="path10051" /><path
   style="fill:#feefe8;stroke:#feefe8;stroke-width:0.06096765"
   inkscape:connector-curvature="0"
   d="m 113.50144,2299.6958 c 1.08929,-0.2845 2.21922,0.1626 3.02806,0.8922 0.89013,1.1218 1.79042,2.3919 1.77822,3.8897 -0.0467,0.4369 -0.54261,0.6016 -0.89216,0.7418 -2.09931,0.6808 -4.14986,1.5465 -6.02563,2.7191 -0.32516,0.2297 -0.84948,0.2622 -1.071,-0.128 -0.43287,-0.7438 -0.55887,-1.6156 -0.82306,-2.4265 -0.28249,-0.9613 -0.567,-2.081 -0.004,-2.9976 0.87184,-1.4185 2.38384,-2.3818 4.00964,-2.6907 z"
   id="path10055" /><text
   xml:space="preserve"
   style="font-style:normal;font-variant:normal;font-weight:500;font-stretch:normal;font-size:26.66666603px;line-height:1.25;font-family:Ubuntu;-inkscape-font-specification:'Ubuntu, Medium';font-variant-ligatures:normal;font-variant-caps:normal;font-variant-numeric:normal;font-feature-settings:normal;text-align:start;letter-spacing:0px;word-spacing:0px;writing-mode:lr-tb;text-anchor:start;fill:#ffffff;fill-opacity:1;stroke:none"
   x="75.352386"
   y="2287.4033"
   id="text10220"><tspan
     sodipodi:role="line"
     id="tspan10218"
     x="75.352386"
     y="2287.4033">x_x</tspan></text>


</g><g
     style="display:inline"
     transform="matrix(1.3333333,0,0,-1.3333333,0,2500.0001)"
     inkscape:label="sun frown"
     inkscape:groupmode="layer"
     id="g7361"><g
       id="g7613"
       style="display:inline"><g
         style="display:inline"
         id="g7563"
         transform="translate(-317.11532,-114.74625)"><g
           transform="translate(617.033,616.8431)"
           id="g7517"><path
             inkscape:connector-curvature="0"
             id="path7515"
             style="fill:#ffde17;fill-opacity:1;fill-rule:nonzero;stroke:none"
             d="m 0,0 c 0,-36.013 -29.194,-65.207 -65.207,-65.207 -36.013,0 -65.208,29.194 -65.208,65.207 0,36.013 29.195,65.207 65.208,65.207 C -29.194,65.207 0,36.013 0,0" /></g><g
           transform="translate(527.625,638.6132)"
           id="g7521"><path
             inkscape:connector-curvature="0"
             id="path7519"
             style="fill:#f39e1e;fill-opacity:1;fill-rule:nonzero;stroke:none"
             d="m 0,0 c 0,-2.856 -2.316,-5.172 -5.172,-5.172 -2.856,0 -5.172,2.316 -5.172,5.172 0,2.856 2.316,5.172 5.172,5.172 C -2.316,5.172 0,2.856 0,0" /></g><g
           transform="translate(586.8682,638.6132)"
           id="g7525"><path
             inkscape:connector-curvature="0"
             id="path7523"
             style="fill:#f39e1e;fill-opacity:1;fill-rule:nonzero;stroke:none"
             d="m 0,0 c 0,-2.856 -2.316,-5.172 -5.172,-5.172 -2.856,0 -5.172,2.316 -5.172,5.172 0,2.856 2.316,5.172 5.172,5.172 C -2.316,5.172 0,2.856 0,0" /></g><g
           transform="translate(514.5433,611.5776)"
           id="g7529"><path
             inkscape:connector-curvature="0"
             id="path7527"
             style="fill:#f39e1e;fill-opacity:1;fill-rule:nonzero;stroke:none"
             d="m 0,0 c 2.568,-18.318 18.257,-32.427 37.282,-32.427 19.026,0 34.715,14.109 37.283,32.427 z" /></g><g
           transform="translate(542.1183,687.785)"
           id="g7533"><path
             inkscape:connector-curvature="0"
             id="path7531"
             style="fill:#ffcb0e;fill-opacity:1;fill-rule:nonzero;stroke:none"
             d="M 0,0 9.707,16.814 19.415,0 Z" /></g><g
           transform="translate(542.1183,546.6169)"
           id="g7537"><path
             inkscape:connector-curvature="0"
             id="path7535"
             style="fill:#ffcb0e;fill-opacity:1;fill-rule:nonzero;stroke:none"
             d="M 0,0 9.707,-16.814 19.415,0 Z" /></g><g
           transform="translate(594.872,673.9756)"
           id="g7541"><path
             inkscape:connector-curvature="0"
             id="path7539"
             style="fill:#ffcb0e;fill-opacity:1;fill-rule:nonzero;stroke:none"
             d="M 0,0 18.753,5.025 13.728,-13.728 Z" /></g><g
           transform="translate(495.0511,574.1547)"
           id="g7545"><path
             inkscape:connector-curvature="0"
             id="path7543"
             style="fill:#ffcb0e;fill-opacity:1;fill-rule:nonzero;stroke:none"
             d="m 0,0 -5.025,-18.753 18.753,5.025 z" /></g><g
           transform="translate(622.4098,626.9083)"
           id="g7549"><path
             inkscape:connector-curvature="0"
             id="path7547"
             style="fill:#ffcb0e;fill-opacity:1;fill-rule:nonzero;stroke:none"
             d="M 0,0 16.814,-9.707 0,-19.415 Z" /></g><g
           transform="translate(481.2416,626.9083)"
           id="g7553"><path
             inkscape:connector-curvature="0"
             id="path7551"
             style="fill:#ffcb0e;fill-opacity:1;fill-rule:nonzero;stroke:none"
             d="M 0,0 -16.814,-9.707 0,-19.415 Z" /></g><g
           transform="translate(608.6003,574.1547)"
           id="g7557"><path
             inkscape:connector-curvature="0"
             id="path7555"
             style="fill:#ffcb0e;fill-opacity:1;fill-rule:nonzero;stroke:none"
             d="m 0,0 5.025,-18.753 -18.753,5.025 z" /></g><g
           transform="translate(508.7794,673.9756)"
           id="g7561"><path
             inkscape:connector-curvature="0"
             id="path7559"
             style="fill:#ffcb0e;fill-opacity:1;fill-rule:nonzero;stroke:none"
             d="m 0,0 -18.753,5.025 5.025,-18.753 z" /></g></g><g
         transform="translate(299.91768,502.09688)"
         id="g7567"><path
           inkscape:connector-curvature="0"
           id="path7565"
           style="fill:#ffde17;fill-opacity:1;fill-rule:nonzero;stroke:none"
           d="m 0,0 c 0,-36.013 -29.194,-65.207 -65.207,-65.207 -36.013,0 -65.208,29.194 -65.208,65.207 0,36.013 29.195,65.207 65.208,65.207 C -29.194,65.207 0,36.013 0,0" /></g><g
         transform="translate(210.50968,523.86698)"
         id="g7571"><path
           inkscape:connector-curvature="0"
           id="path7569"
           style="fill:#f39e1e;fill-opacity:1;fill-rule:nonzero;stroke:none"
           d="m 0,0 c 0,-2.856 -2.316,-5.172 -5.172,-5.172 -2.856,0 -5.172,2.316 -5.172,5.172 0,2.856 2.316,5.172 5.172,5.172 C -2.316,5.172 0,2.856 0,0" /></g><g
         transform="translate(269.75288,523.86698)"
         id="g7575"><path
           inkscape:connector-curvature="0"
           id="path7573"
           style="fill:#f39e1e;fill-opacity:1;fill-rule:nonzero;stroke:none"
           d="m 0,0 c 0,-2.856 -2.316,-5.172 -5.172,-5.172 -2.856,0 -5.172,2.316 -5.172,5.172 0,2.856 2.316,5.172 5.172,5.172 C -2.316,5.172 0,2.856 0,0" /></g><g
         transform="matrix(1,0,0,-1,197.42798,464.40438)"
         id="g7579"><path
           inkscape:connector-curvature="0"
           id="path7577"
           style="fill:#f39e1e;fill-opacity:1;fill-rule:nonzero;stroke:none"
           d="m 0,0 c 2.568,-18.318 18.257,-32.427 37.282,-32.427 19.026,0 34.715,14.109 37.283,32.427 z" /></g><g
         transform="translate(225.00298,573.03878)"
         id="g7583"><path
           inkscape:connector-curvature="0"
           id="path7581"
           style="fill:#ffcb0e;fill-opacity:1;fill-rule:nonzero;stroke:none"
           d="M 0,0 9.707,16.814 19.415,0 Z" /></g><g
         transform="translate(225.00298,431.87068)"
         id="g7587"><path
           inkscape:connector-curvature="0"
           id="path7585"
           style="fill:#ffcb0e;fill-opacity:1;fill-rule:nonzero;stroke:none"
           d="M 0,0 9.707,-16.814 19.415,0 Z" /></g><g
         transform="translate(277.75668,559.22938)"
         id="g7591"><path
           inkscape:connector-curvature="0"
           id="path7589"
           style="fill:#ffcb0e;fill-opacity:1;fill-rule:nonzero;stroke:none"
           d="M 0,0 18.753,5.025 13.728,-13.728 Z" /></g><g
         transform="translate(177.93578,459.40848)"
         id="g7595"><path
           inkscape:connector-curvature="0"
           id="path7593"
           style="fill:#ffcb0e;fill-opacity:1;fill-rule:nonzero;stroke:none"
           d="m 0,0 -5.025,-18.753 18.753,5.025 z" /></g><g
         transform="translate(305.29448,512.16208)"
         id="g7599"><path
           inkscape:connector-curvature="0"
           id="path7597"
           style="fill:#ffcb0e;fill-opacity:1;fill-rule:nonzero;stroke:none"
           d="M 0,0 16.814,-9.707 0,-19.415 Z" /></g><g
         transform="translate(164.12628,512.16208)"
         id="g7603"><path
           inkscape:connector-curvature="0"
           id="path7601"
           style="fill:#ffcb0e;fill-opacity:1;fill-rule:nonzero;stroke:none"
           d="M 0,0 -16.814,-9.707 0,-19.415 Z" /></g><g
         transform="translate(291.48498,459.40848)"
         id="g7607"><path
           inkscape:connector-curvature="0"
           id="path7605"
           style="fill:#ffcb0e;fill-opacity:1;fill-rule:nonzero;stroke:none"
           d="m 0,0 5.025,-18.753 -18.753,5.025 z" /></g><g
         transform="translate(191.66408,559.22938)"
         id="g7611"><path
           inkscape:connector-curvature="0"
           id="path7609"
           style="fill:#ffcb0e;fill-opacity:1;fill-rule:nonzero;stroke:none"
           d="m 0,0 -18.753,5.025 5.025,-18.753 z" /></g></g></g></svg>