   100;  0.00013400
   200;  0.00056300
   300;  0.00089200
   400;  0.00157800
   500;  0.00126900
   600;  0.00281600
   700;  0.00468400
   800;  0.00561900
   900;  0.00898500
  1000;  0.01448500
  1100;  0.01340400
  1200;  0.01384900
  1300;  0.01886700
  1400;  0.01880500
  1500;  0.02551300
  1600;  0.02801300
  1700;  0.03385200
  1800;  0.03245700
  1900;  0.04274100
  2000;  0.04292000
  2100;  0.05365400
  2200;  0.05198000
  2300;  0.06512800
  2400;  0.06563600
  2500;  0.07918200
  2600;  0.07603100
  2700;  0.10650100
  2800;  0.09292400
  2900;  0.11044000
  3000;  0.10526400
  3100;  0.12768400
  3200;  0.17897500
  3300;  0.14748600
  3400;  0.14061900
  3500;  0.16786100
  3600;  0.16017600
  3700;  0.19074100
  3800;  0.18020800
  3900;  0.21200500
  4000;  0.20679500
  4100;  0.24063700
  4200;  0.22765100
  4300;  0.26938800
  4400;  0.25126800
  4500;  0.29032400
  4600;  0.27505800
  4700;  0.31761200
  4800;  0.37452400
  4900;  0.34636300
  5000;  0.32697800
  5100;  0.37608100
  5200;  0.35902500
  5300;  0.40666000
  5400;  0.38217600
  5500;  0.43892300
  5600;  0.44935700
  5700;  0.47384900
  5800;  0.44382100
  5900;  0.50603900
  6000;  0.49287200
  6100;  0.54494600
  6200;  0.51040300
  6300;  0.58131900
  6400;  0.99246100
  6500;  0.62706600
  6600;  0.58938700
  6700;  0.66536000
  6800;  0.64849900
  6900;  0.70945200
  7000;  0.68573000
  7100;  0.77166000
  7200;  0.82460100
  7300;  0.80214200
  7400;  0.75003200
  7500;  0.84964100
  7600;  0.82925800
  7700;  0.89401300
  7800;  0.83638800
  7900;  0.94044800
  8000;  1.42299100
  8100;  0.99147300
  8200;  0.94321400
  8300;  1.05789800
  8400;  1.05480600
  8500;  1.17946400
  8600;  1.08734800
  8700;  1.21609800
  8800;  1.36387700
  8900;  1.29981900
  9000;  1.26163700
  9100;  1.41101900
  9200;  1.38750500
  9300;  1.47149900
  9400;  1.35022800
  9500;  1.55321600
  9600;  2.41931600
  9700;  1.61358600
  9800;  1.51312400
  9900;  1.64849300
 10000;  1.74581900
 10100;  1.72820400
 10200;  1.70410300
 10300;  1.76682600
 10400;  2.19133700
 10500;  1.87300800
 10600;  1.80766600
 10700;  1.94852900
 10800;  2.02838600
 10900;  2.12544500
 11000;  2.01704400
 11100;  2.19225500
 11200;  3.21499500
 11300;  2.28411500
 11400;  2.22498300
 11500;  2.39290600
 11600;  2.49798700
 11700;  2.50202000
 11800;  2.43848400
 11900;  2.63184800
 12000;  3.43720600
 12100;  2.75883400
 12200;  2.69093200
 12300;  2.90816400
 12400;  3.03295100
 12500;  2.96066000
 12600;  2.87618000
 12700;  3.06436800
 12800;  4.13202000
 12900;  3.17672600
 13000;  3.07691700
 13100;  3.27745700
 13200;  3.53313100
 13300;  3.38203300
 13400;  3.26596500
 13500;  3.46193300
 13600;  4.76098600
 13700;  3.56489300
 13800;  3.46849800
 13900;  3.68467100
 14000;  4.05104700
 14100;  3.97240600
 14200;  3.95875400
 14300;  4.49223700
 14400;  5.67769000
 14500;  4.42937700
 14600;  4.21671400
 14700;  5.29737200
 14800;  5.84511600
 14900;  5.55139100
 15000;  5.56101600
 15100;  5.62099900
 15200;  6.30723800
 15300;  6.02443200
 15400;  6.17561100
 15500;  6.05074800
 15600;  6.43960900
 15700;  6.14696900
 15800;  6.10279300
 15900;  6.22412000
 16000;  6.71496200
 16100;  6.38660300
 16200;  6.38921600
 16300;  6.36350400
 16400;  6.85364700
 16500;  6.69441700
 16600;  6.57208600
 16700;  6.92796100
 16800;  7.36184500
 16900;  7.18906800
 17000;  7.20125100
 17100;  7.43313800
 17200;  8.07983700
 17300;  7.94586600
 17400;  7.51684400
 17500;  7.70861500
 17600;  8.52160900
 17700;  8.33222100
 17800;  8.12557700
 17900;  8.44245600
 18000;  8.52717500
 18100;  8.09808700
 18200;  8.06014300
 18300;  8.19370800
 18400;  8.95606900
 18500;  8.18111500
 18600;  8.27051500
 18700;  8.35627900
 18800;  9.15601600
 18900;  8.20771100
 19000;  8.21139800
 19100;  8.63339800
 19200;  9.95248500
 19300;  8.88469800
 19400;  8.75473100
 19500;  9.23794300
 19600; 10.77913900
 19700;  9.63532900
 19800;  8.90368800
 19900;  9.39465400
 20000; 10.69863000
 20100;  9.84819000
 20200;  9.14567600
 20300;  9.80849700
 20400; 11.02918800
 20500;  9.65210100
 20600;  9.46121100
 20700; 10.18940500
 20800; 12.44581200
 20900; 10.12447900
 21000;  9.53626500
 21100; 10.03192800
 21200; 11.97060700
 21300; 10.23854900
 21400; 10.35848500
 21500; 10.37571400
 21600; 12.70129500
 21700; 10.85624100
 21800; 10.77091000
 21900; 11.16129600
 22000; 13.10035000
 22100; 11.58103900
 22200; 11.23433400
 22300; 11.64133900
 22400; 14.39615600
 22500; 11.67585500
 22600; 11.50342500
 22700; 12.27857600
 22800; 14.09762700
 22900; 12.50057600
 23000; 12.12572600
 23100; 12.35664200
 23200; 14.75911900
 23300; 12.42195500
 23400; 13.34622900
 23500; 13.64540200
 23600; 15.23846600
 23700; 13.17192400
 23800; 13.00379500
 23900; 13.37887700
 24000; 15.87330200
 24100; 13.61698800
 24200; 14.83328300
 24300; 13.93893000
 24400; 16.43347800
 24500; 14.24426200
 24600; 13.93804400
 24700; 14.55459900
 24800; 17.70879300
 24900; 16.11975200
 25000; 15.84796800
 25100; 16.10378000
 25200; 18.45659200
 25300; 15.49875300
 25400; 15.03348700
 25500; 15.20758700
 25600; 16.95843300
 25700; 15.83265000
 25800; 15.53032500
 25900; 16.98206700
 26000; 19.07640200
 26100; 16.39096700
 26200; 15.97839600
 26300; 17.31623800
 26400; 18.88667200
 26500; 16.91872700
 26600; 16.34740800
 26700; 17.81354300
 26800; 21.85152500
 26900; 18.21330800
 27000; 16.90191100
 27100; 17.69763100
 27200; 20.36464700
 27300; 19.51190300
 27400; 17.39743900
 27500; 18.06236900
 27600; 21.86589600
 27700; 18.53245800
 27800; 18.23471200
 27900; 18.72500600
 28000; 22.20523500
 28100; 19.79219000
 28200; 18.12415400
 28300; 19.85275700
 28400; 26.41293700
 28500; 19.15924500
 28600; 18.62472700
 28700; 20.71669000
 28800; 25.06717000
 28900; 20.84338800
 29000; 19.76144500
 29100; 19.86921400
 29200; 27.49361700
 29300; 20.55294200
 29400; 20.50133700
 29500; 20.99156200
 29600; 23.82091100
 29700; 21.43645500
 29800; 20.89658200
 29900; 22.78823600
 30000; 27.20838800
 30100; 22.18033400
 30200; 22.01886800
 30300; 22.69237100
 30400; 25.81299900
 30500; 22.95374500
 30600; 23.12758000
 30700; 23.42893800
 30800; 28.02550200
 30900; 24.31771600
 31000; 26.06844300
 31100; 24.81858200
 31200; 26.68889400
 31300; 26.06417500
 31400; 27.18896700
 31500; 26.58480800
 31600; 27.50281300
 31700; 26.39800000
 31800; 27.53395500
 31900; 28.23316100
 32000; 28.07236700
 32100; 29.10145000
 32200; 29.25761300
 32300; 27.27895000
 32400; 28.39093600
 32500; 27.43029400
 32600; 27.64843200
 32700; 30.56868200
 32800; 29.24898200
 32900; 29.31897900
 33000; 29.48205100
 33100; 30.31325500
 33200; 30.21375700
 33300; 33.11132200
 33400; 30.41054600
 33500; 31.71284600
 33600; 32.80441900
 33700; 34.58542400
 33800; 31.53162500
 33900; 34.89445000
 34000; 31.64113900
 34100; 34.55891700
 34200; 32.69972900
 34300; 33.39728600
 34400; 32.73688500
 34500; 34.62476400
 34600; 34.68272500
 34700; 35.36511900
 34800; 34.81051800
 34900; 37.96635300
 35000; 37.74291800
 35100; 35.29683700
 35200; 36.93229500
 35300; 36.89092600
 35400; 37.42306800
 35500; 37.89720300
 35600; 35.12494100
 35700; 40.03302600
 35800; 37.83214600
 35900; 39.48207100
 36000; 36.30885500
 36100; 38.90130000
 36200; 38.53909000
 36300; 40.17790300
 36400; 36.86793600
 36500; 39.67041800
 36600; 42.98397100
 36700; 40.98043100
 36800; 40.38178600
 36900; 45.72656400
 37000; 42.30238200
 37100; 41.53939400
 37200; 38.52071600
 37300; 43.45333700
 37400; 40.95465300
 37500; 43.46431200
 37600; 42.04786300
 37700; 43.62412500
 37800; 45.77893900
 37900; 48.52688900
 38000; 41.33575500
 38100; 45.88718000
 38200; 43.12649600
 38300; 45.54850300
 38400; 38.27189900
 38500; 48.67070400
 38600; 47.92137400
 38700; 47.37430800
 38800; 42.35486600
 38900; 48.32404900
 39000; 48.25614000
 39100; 46.71704300
 39200; 44.32888000
 39300; 49.37068500
 39400; 54.12393300
 39500; 52.62246100
 39600; 45.20323400
 39700; 56.49535600
 39800; 53.91869000
 39900; 54.00448400
 40000; 50.46190800
