   100;  0.00018200
   200;  0.00044000
   300;  0.00069300
   400;  0.00124100
   500;  0.00094300
   600;  0.00131100
   700;  0.00181500
   800;  0.00235700
   900;  0.00298600
  1000;  0.00678500
  1100;  0.00442500
  1200;  0.00528300
  1300;  0.00620800
  1400;  0.00734600
  1500;  0.00846700
  1600;  0.00935400
  1700;  0.01074100
  1800;  0.01195000
  1900;  0.01412100
  2000;  0.01469700
  2100;  0.01632100
  2200;  0.01782800
  2300;  0.01965300
  2400;  0.02202400
  2500;  0.02405100
  2600;  0.02578300
  2700;  0.02864300
  2800;  0.02921000
  2900;  0.03163000
  3000;  0.03287700
  3100;  0.03565500
  3200;  0.03783800
  3300;  0.04016400
  3400;  0.04289500
  3500;  0.04527300
  3600;  0.04810300
  3700;  0.05015000
  3800;  0.05306700
  3900;  0.05581300
  4000;  0.05894100
  4100;  0.06300300
  4200;  0.06613700
  4300;  0.07216300
  4400;  0.07258700
  4500;  0.07528800
  4600;  0.07854100
  4700;  0.08232400
  4800;  0.08580400
  4900;  0.08911100
  5000;  0.09583100
  5100;  0.09807600
  5200;  0.10282500
  5300;  0.10713200
  5400;  0.11072900
  5500;  0.11435300
  5600;  0.11992800
  5700;  0.12257800
  5800;  0.12874400
  5900;  0.13147300
  6000;  0.13797500
  6100;  0.14043800
  6200;  0.14486000
  6300;  0.14894600
  6400;  0.15521400
  6500;  0.15901200
  6600;  0.16482400
  6700;  0.16850900
  6800;  0.17317600
  6900;  0.17879900
  7000;  0.19278700
  7100;  0.19088500
  7200;  0.21795300
  7300;  0.19990400
  7400;  0.20603100
  7500;  0.21111500
  7600;  0.21542900
  7700;  0.22070100
  7800;  0.22632900
  7900;  0.23262600
  8000;  0.24090600
  8100;  0.25301700
  8200;  0.25554300
  8300;  0.25900400
  8400;  0.26477200
  8500;  0.27224300
  8600;  0.27712600
  8700;  0.28462500
  8800;  0.29220400
  8900;  0.31669200
  9000;  0.30464700
  9100;  0.31062800
  9200;  0.31801100
  9300;  0.32186000
  9400;  0.32839300
  9500;  0.33556200
  9600;  0.35896400
  9700;  0.35805100
  9800;  0.36644100
  9900;  0.36810500
 10000;  0.37647800
 10100;  0.38172200
 10200;  0.38756800
 10300;  0.39354000
 10400;  0.40255600
 10500;  0.41141500
 10600;  0.41740600
 10700;  0.42369500
 10800;  0.45096200
 10900;  0.44507800
 11000;  0.45566400
 11100;  0.46299600
 11200;  0.46788200
 11300;  0.47801700
 11400;  0.48608000
 11500;  0.49311400
 11600;  0.50291700
 11700;  0.51255900
 11800;  0.52132300
 11900;  0.52886300
 12000;  0.53679300
 12100;  0.55665000
 12200;  0.56703800
 12300;  0.57560300
 12400;  0.57641800
 12500;  0.58590400
 12600;  0.59352400
 12700;  0.60267700
 12800;  0.61420000
 12900;  0.62399600
 13000;  0.63297200
 13100;  0.64151700
 13200;  0.65074400
 13300;  0.65625200
 13400;  0.67538000
 13500;  0.68201700
 13600;  0.69547700
 13700;  0.69877000
 13800;  0.71136500
 13900;  0.72315400
 14000;  0.73227000
 14100;  0.74322200
 14200;  0.74801300
 14300;  0.75793600
 14400;  0.77353300
 14500;  0.78864400
 14600;  0.80425400
 14700;  0.80240900
 14800;  0.81413100
 14900;  0.83038500
 15000;  0.84341400
 15100;  0.84806900
 15200;  0.86140000
 15300;  0.87109200
 15400;  0.88406600
 15500;  0.89336500
 15600;  0.90460200
 15700;  0.92700100
 15800;  0.92752200
 15900;  0.93859400
 16000;  0.95007800
 16100;  0.96833600
 16200;  0.97383000
 16300;  0.98339200
 16400;  0.99934000
 16500;  1.01036300
 16600;  1.02353500
 16700;  1.03479500
 16800;  1.05495100
 16900;  1.07136100
 17000;  1.08752700
 17100;  1.10313700
 17200;  1.09899900
 17300;  1.10993500
 17400;  1.12583900
 17500;  1.14448900
 17600;  1.15682000
 17700;  1.16191700
 17800;  1.20028900
 17900;  1.21376900
 18000;  1.21665600
 18100;  1.21724000
 18200;  1.23660100
 18300;  1.24225400
 18400;  1.25368700
 18500;  1.27676700
 18600;  1.28451800
 18700;  1.29300200
 18800;  1.31354600
 18900;  1.33301100
 19000;  1.35499000
 19100;  1.36122700
 19200;  1.38311700
 19300;  1.38927600
 19400;  1.40777600
 19500;  1.41336700
 19600;  1.42525400
 19700;  1.43840900
 19800;  1.45279000
 19900;  1.46926000
 20000;  1.51868400
 20100;  1.49755800
 20200;  1.51209900
 20300;  1.52961400
 20400;  1.54579900
 20500;  1.55887900
 20600;  1.57052200
 20700;  1.57825900
 20800;  1.60367100
 20900;  1.61388300
 21000;  1.63262200
 21100;  1.66205700
 21200;  1.67952300
 21300;  1.69101400
 21400;  1.71673500
 21500;  1.74303800
 21600;  1.76386800
 21700;  1.75780500
 21800;  1.77694700
 21900;  1.78798500
 22000;  1.80276500
 22100;  1.81477600
 22200;  1.83035200
 22300;  1.84983800
 22400;  1.88034000
 22500;  1.89239600
 22600;  1.90442500
 22700;  1.91028800
 22800;  1.92659100
 22900;  1.95363800
 23000;  1.97092600
 23100;  1.99162800
 23200;  2.00866600
 23300;  2.01096900
 23400;  2.05999000
 23500;  2.05731500
 23600;  2.07453500
 23700;  2.08840400
 23800;  2.10993300
 23900;  2.13005800
 24000;  2.14417400
 24100;  2.15809200
 24200;  2.18528600
 24300;  2.19823800
 24400;  2.21782200
 24500;  2.23331300
 24600;  2.26072700
 24700;  2.28430800
 24800;  2.31406900
 24900;  2.32783000
 25000;  2.34250600
 25100;  2.36046900
 25200;  2.37566300
 25300;  2.40356700
 25400;  2.42033700
 25500;  2.42810300
 25600;  2.47864500
 25700;  2.49960700
 25800;  2.49803300
 25900;  2.52170400
 26000;  2.51547200
 26100;  2.54203000
 26200;  2.57222000
 26300;  2.57919300
 26400;  2.60889500
 26500;  2.62308000
 26600;  2.63202800
 26700;  2.65012600
 26800;  2.68971700
 26900;  2.68914700
 27000;  2.70870600
 27100;  2.72730200
 27200;  2.75840100
 27300;  2.77218800
 27400;  2.79639000
 27500;  2.82529100
 27600;  2.82941100
 27700;  2.85246400
 27800;  2.88416800
 27900;  2.91874300
 28000;  2.92050400
 28100;  2.95372100
 28200;  2.96870300
 28300;  3.00112200
 28400;  3.01082300
 28500;  3.05429900
 28600;  3.04788100
 28700;  3.08252700
 28800;  3.08651100
 28900;  3.13367100
 29000;  3.14937700
 29100;  3.16274400
 29200;  3.18927800
 29300;  3.21708500
 29400;  3.23820300
 29500;  3.25847800
 29600;  3.27730100
 29700;  3.30581400
 29800;  3.31739100
 29900;  3.35518400
 30000;  3.38365700
 30100;  3.40075800
 30200;  3.42489600
 30300;  3.45310900
 30400;  3.46277100
 30500;  3.50761700
 30600;  3.53865800
 30700;  3.53343000
 30800;  3.57338200
 30900;  3.58406600
 31000;  3.59516600
 31100;  3.63170900
 31200;  3.67700600
 31300;  3.67887100
 31400;  3.69240100
 31500;  3.74168700
 31600;  3.75273800
 31700;  3.78694500
 31800;  3.79411300
 31900;  3.89932300
 32000;  3.86677600
 32100;  3.86891200
 32200;  3.88580400
 32300;  3.93053300
 32400;  3.93434800
 32500;  3.95739800
 32600;  3.98207400
 32700;  4.02172800
 32800;  4.02788800
 32900;  4.07975400
 33000;  4.09933200
 33100;  4.11830800
 33200;  4.17491000
 33300;  4.17139800
 33400;  4.20434900
 33500;  4.29171100
 33600;  4.24340100
 33700;  4.24586500
 33800;  4.27191700
 33900;  4.32093500
 34000;  4.34694100
 34100;  4.34929500
 34200;  4.37426300
 34300;  4.40304600
 34400;  4.42304300
 34500;  4.49878400
 34600;  4.51146400
 34700;  4.54226000
 34800;  4.60728100
 34900;  4.61899200
 35000;  4.61605600
 35100;  4.66102200
 35200;  4.66644800
 35300;  4.68504800
 35400;  4.71296400
 35500;  4.72962300
 35600;  4.75940100
 35700;  4.77280700
 35800;  4.80390900
 35900;  4.83748900
 36000;  4.86246300
 36100;  4.87813800
 36200;  4.93238000
 36300;  4.94255600
 36400;  4.96452600
 36500;  5.01270100
 36600;  5.01193700
 36700;  5.09820000
 36800;  5.08118500
 36900;  5.08687400
 37000;  5.12427600
 37100;  5.15330300
 37200;  5.18550700
 37300;  5.23760100
 37400;  5.25526300
 37500;  5.28016800
 37600;  5.32564300
 37700;  5.39017400
 37800;  5.38025700
 37900;  5.43421100
 38000;  5.41161200
 38100;  5.43557300
 38200;  5.50761500
 38300;  5.50882000
 38400;  5.54624300
 38500;  5.59122500
 38600;  5.59005600
 38700;  5.67938900
 38800;  5.65839000
 38900;  5.67354600
 39000;  5.70307400
 39100;  5.72812800
 39200;  5.75101500
 39300;  5.78676600
 39400;  5.83953300
 39500;  5.87531200
 39600;  5.91077600
 39700;  5.93336400
 39800;  5.95279100
 39900;  5.97155500
 40000;  6.00176300
