[
    {
        "name": "id",
        "dbType": "increments",
        "htmlType": "",
        "validations": "",
        "searchable": false,
        "fillable": false,
        "primary": true,
        "inForm": false,
        "inIndex": false
    },
    {
        "name": "name",
        "dbType": "string",
        "htmlType": "text",
        "validations": "required|string",
        "searchable": true
    },
    {
        "name": "email",
        "dbType": "string:unique",
        "htmlType": "email",
        "searchable": true
    },
    {
        "name": "password",
        "dbType": "string",
        "htmlType": "text",
        "searchable": false
    },
    {
        "name": "role",
        "dbType": "integer",
        "htmlType": "select",
        "searchable": true
    },
    {
        "name": "created_at",
        "dbType": "timestamp",
        "htmlType": "",
        "validations": "",
        "searchable": false,
        "fillable": false,
        "primary": false,
        "inForm": false,
        "inIndex": false
    },
    {
        "name": "updated_at",
        "dbType": "timestamp",
        "htmlType": "",
        "validations": "",
        "searchable": false,
        "fillable": false,
        "primary": false,
        "inForm": false,
        "inIndex": false
    }
]