Source	TypeSource	Target	TypeTarget	Sign	FC	SNP
BCL6	TF	chr12:42468600-42471319	Enhancer	+	-1.05682981575209	rs74081707
BCL6	TF	chr4:76205669-76215919	Enhancer	+	2.27080206230116	rs72857097
CREB1	TF	chr12:42468600-42471319	Enhancer	+	3.29461055003162	rs74081707
CREB1	TF	chr3:64223200-64226459	Enhancer	+	2.11461486937269	rs142388795
CREB1	TF	chr7:66625550-66632156	Enhancer	-	1.46153626775906	rs35526611
ETV1	TF	chr4:76205669-76215919	Enhancer	+	1.24747435357582	rs72857097
MXI1	TF	chr3:64223200-64226459	Enhancer	+	-1.06222615968419	rs697287
CREB1	TF	KCTD7	Promoter	-	1.46153626775906	rs35526611
CREB1	TF	KCTD7	Promoter	-	-1.68276097536156	rs117194263
CREB1	TF	PRICKLE2	Promoter	+	2.11461486937269	rs142388795
CREB1	TF	RBFOX1	Promoter	+	2.27030372379005	rs7187508
CREB1	TF	SCN9A	Promoter	+	-1.81129737825107	rs4369876
STAT1	TF	SCARB2	Promoter	+	1.39012204863253	rs72857097
chr12:42468600-42471319	Enhancer	PRICKLE1	Promoter	+	0	
chr3:64223200-64226459	Enhancer	PRICKLE2	Promoter	+	0	
chr4:76205669-76215919	Enhancer	SCARB2	Promoter	+	0	
chr7:66625550-66632156	Enhancer	KCTD7	Promoter	-	0	
