Source	TypeSource	Target	TypeTarget	Sign	FC	SNP
MXI1	TF	chr21:26166164-26172001	Enhancer	-	-1.31544393293655	rs459543
MXI1	TF	chr21:26166164-26172001	Enhancer	-	2.6359428615169	rs45476095
STAT3	TF	chr14:73135401-73138601	Enhancer	+	2.03071028380412	rs1800839
MXI1	TF	APP	Promoter	-	-1.31544393293655	rs459543
MXI1	TF	APP	Promoter	-	2.6359428615169	rs45476095
STAT3	TF	PSEN1	Promoter	+	2.03071028380412	rs1800839
chr14:73135401-73138601	Enhancer	PSEN1	Promoter	+	0	
chr21:26166164-26172001	Enhancer	APP	Promoter	+	0	
