Comparison	LengthGS	LengthPredictions	NumberGenes	TP	FP	FN	PPV	TPR	F1score
CLR	268268	351629	750	23340	328289	244928	0.0663767777970531	0.0870025496891169	0.0753028325673459
GENIE3	268268	305046	750	19059	285987	249209	0.0624791015125588	0.0710446270147763	0.0664871257286583
PIDC	268268	352457	750	25828	326629	242440	0.0732798610894379	0.0962768574708873	0.0832188167062709
PPCOR	268268	353531	750	26900	326631	241368	0.0760895084165179	0.100272861466891	0.0865231368979365
SCENIC	268268	1023401	248	136588	886813	131680	0.133464790438938	0.509147568849061	0.211490714726451
RNetDys	268268	239010.5	171.5	100354.5	138656	167913.5	0.419869638598786	0.374083006545693	0.395530761762865
