Source	Target	IntType	Sign	SNP	Ref	Alt	FC	RSID
CREB1	chr4:41255600-41259401	TF-Enhancer	+	chr4:41257132-41257132	T	C	0.11845147219193	rs11556273
MXI1	chr4:41255600-41259401	TF-Enhancer	+	chr4:41256961-41256961	C	T	0.115653483910824	rs9321
MXI1	chr4:41255600-41259401	TF-Enhancer	+	chr4:41257616-41257616	C	A	4.207574101069	rs5030732
CREB1	PRKAG2	TF-Promoter	+	chr7:151876710-151876710	C	A	0.307887222616596	rs76351165
CREB1	UCHL1	TF-Promoter	+	chr4:41257132-41257132	T	C	0.11845147219193	rs11556273
chr4:41255600-41259401	UCHL1	Enhancer-Promoter	+	chr4:41256953-41256953	A	G	NA	rs11556271
chr4:41255600-41259401	UCHL1	Enhancer-Promoter	+	chr4:41256961-41256961	C	T	NA	rs9321
chr4:41255600-41259401	UCHL1	Enhancer-Promoter	+	chr4:41257132-41257132	T	C	NA	rs11556273
chr4:41255600-41259401	UCHL1	Enhancer-Promoter	+	chr4:41257616-41257616	C	A	NA	rs5030732
