Source	Target	IntType	Sign	SNP	Ref	Alt	FC	RSID
MXI1	chr22:32473200-32478044	TF-Enhancer	+	chr22:32474782-32474782	C	T	0.149058429377267	rs2072814
MXI1	chr4:41255600-41259401	TF-Enhancer	+	chr4:41256961-41256961	C	T	0.115653483910824	rs9321
MXI1	chr4:41255600-41259401	TF-Enhancer	+	chr4:41257616-41257616	C	A	4.207574101069	rs5030732
chr22:32473200-32478044	FBXO7	Enhancer-Promoter	+	chr22:32474782-32474782	C	T	NA	rs2072814
chr22:32473200-32478044	FBXO7	Enhancer-Promoter	+	chr22:32474819-32474819	C	T	NA	rs11538371
chr22:32473200-32478044	FBXO7	Enhancer-Promoter	+	chr22:32475396-32475396	T	G	NA	rs8137714
chr4:41255600-41259401	LIMCH1	Enhancer-Promoter	+	chr4:41256953-41256953	A	G	NA	rs11556271
chr4:41255600-41259401	LIMCH1	Enhancer-Promoter	+	chr4:41256961-41256961	C	T	NA	rs9321
chr4:41255600-41259401	LIMCH1	Enhancer-Promoter	+	chr4:41257132-41257132	T	C	NA	rs11556273
chr4:41255600-41259401	LIMCH1	Enhancer-Promoter	+	chr4:41257616-41257616	C	A	NA	rs5030732
