RS	Chromosome	Start	Stop	ReferenceAlleleVCF	AlternateAlleleVCF	Name	ClinicalSignificance	ClinSigSimple	RCVaccession	MAF
rs1005753	chr1	17444769	17444769	G	T	NM_007365.3(PADI2):c.92+1006C>A	association	0	RCV001249178	0.3984
rs11203366	chr1	17657534	17657534	G	A	NM_012387.3(PADI4):c.163G>A (p.Gly55Ser)	association	0	RCV001249179	0.4754
rs11203367	chr1	17657616	17657616	T	C	NM_012387.3(PADI4):c.245T>C (p.Val82Ala)	association	0	RCV001249180	0.4667
rs1748033	chr1	17662662	17662662	T	C	NM_012387.3(PADI4):c.349T>C (p.Leu117=)	association	0	RCV001249181	0.4081
rs1800795	chr7	22766645	22766645	C	G	NG_011640.1:g.4880C>G	risk factor	0	RCV000015834|RCV000015837|RCV000015838|RCV000015833|RCV001281345|RCV001281346	0.1412
rs2057094	chr1	17405949	17405949	C	T	NM_007365.3(PADI2):c.1159-39G>A	association	0	RCV001249176	0.4952
rs2076615	chr1	17413121	17413121	A	C	NM_007365.3(PADI2):c.729T>G (p.Gly243=)	association	0	RCV001249177	0.3636
rs2235926	chr1	17395281	17395281	T	A	NM_007365.3(PADI2):c.*258A>T	association	0	RCV001249175	0.4113
rs2240340	chr1	17662639	17662639	T	C	NM_012387.3(PADI4):c.341-15T>C	association	0	RCV000721936	0.4848
rs2476601	chr1	114377568	114377568	A	A	NM_015967.7(PTPN22):c.1858C>T (p.Arg620Trp)	Benign	0	RCV000009464|RCV000009460|RCV000009461|RCV000009462|RCV000009463|RCV000954217|RCV001254797	0.02736
rs3087456	chr16	10970902	10970902	G	G	NM_000246.3(CIITA):c.-286G=	risk factor	0	RCV000010154	0.3742
rs3766379	chr1	160807715	160807715	T	C	NM_016382.4(CD244):c.834+526A>G	risk factor	0	RCV000005173	0.4385
rs3792876	chr5	131637309	131637309	C	T	NM_003059.3(SLC22A4):c.393+6607C>T	risk factor	0	RCV000006105	0.1098
rs874881	chr1	17660499	17660499	G	C	NM_012387.3(PADI4):c.335G>C (p.Gly112Ala)	association	0	RCV001249182	0.478
