Comparison	LengthGS	LengthPredictions	NumberGenes	TP	FP	FN	PPV	TPR	F1score
CLR	114113	121599	436	10518	111081	103595	0.0864974218537981	0.0921717946246265	0.0892445017648656
GENIE3	114113	121514	436	10954	110560	103159	0.0901459914083974	0.095992568769553	0.0929774601382694
PIDC	114113	123760	436	11516	112244	102597	0.0930510665804783	0.100917511589389	0.0968247762461482
PPCOR	114113	123287	436	11550	111737	102563	0.093683843389814	0.101215461866746	0.0973041280539174
SCENIC	114113	207541	89	42957	164584	71156	0.20698078933801	0.376442648953231	0.267100673394393
RNetDys	114113	112668	114	46427	66241	67686	0.412053461126007	0.406851103730513	0.409300639034523
