Source	Target	IntType	Sign	SNP	Ref	Alt	FC	RSID
BCL6	chr12:40222200-40227694	TF-Enhancer	+	chr12:40225008-40225008	G	C	0.217585353583423	rs112643657
BCL6	chr22:32473200-32478044	TF-Enhancer	+	chr22:32474819-32474819	C	T	0.371044840305	rs11538371
BCL6	chr22:32473200-32478044	TF-Enhancer	+	chr22:32475396-32475396	T	G	0.392047354853928	rs8137714
ETV1	chr22:32473200-32478044	TF-Enhancer	+	chr22:32474782-32474782	C	T	0.102978953252479	rs2072814
ETV1	chr22:32473200-32478044	TF-Enhancer	+	chr22:32474819-32474819	C	T	0.11045683598939	rs11538371
MXI1	chr22:32473200-32478044	TF-Enhancer	+	chr22:32474782-32474782	C	T	0.149058429377267	rs2072814
BCL6	FBXO7	TF-Promoter	+	chr22:32474819-32474819	C	T	0.371044840305	rs11538371
BCL6	FBXO7	TF-Promoter	+	chr22:32475396-32475396	T	G	0.392047354853928	rs8137714
chr12:40222200-40227694	LRRK2	Enhancer-Promoter	+	chr12:40225008-40225008	G	C	NA	rs112643657
chr12:40222200-40227694	LRRK2	Enhancer-Promoter	+	chr12:40225280-40225280	G	G	NA	rs2256408
chr22:32473200-32478044	FBXO7	Enhancer-Promoter	+	chr22:32474782-32474782	C	T	NA	rs2072814
chr22:32473200-32478044	FBXO7	Enhancer-Promoter	+	chr22:32474819-32474819	C	T	NA	rs11538371
chr22:32473200-32478044	FBXO7	Enhancer-Promoter	+	chr22:32475396-32475396	T	G	NA	rs8137714
