HierarchicalLevel	CellPopulation	ValidatedMarkers
Celltype	basal_epithelial_cell	Cd24a,Itga6
Celltype	basophil	Mcpt8
Celltype	Bcell	Cd79a,Ms4a1,Cd24a,Ptprc
Celltype	cardiomyocyte	Tnnt2,Ryr2,Actc1,Nppa,Tnnc1,Myh6,Atp2a2,Actn2
Celltype	dendritic_cell	Cd74,H2-Ab1
Celltype	endothelial_cell	Egfl7,Fabp4,Cdh5,Pecam1,Eng,Emcn,Epas1,Plvap,Tie1,Cd34,Ednrb,Lyve1
Celltype	epithelial_cell	Ly6a,Cd24a,Epcam
Celltype	erythroblast	Tfrc
Celltype	fibroblast	Gsn,Sparc,Vim,Fstl1,Mmp2,Fbln2,Col3a1,Col1a2
Celltype	granulocyte	Itgam
Celltype	hematopoietic_precursor_cell	Cd47,Cd48,Kit,Cd34
Celltype	hepatocyte	Alb
Celltype	luminal_epithelial_cell	Cd24a
Celltype	macrophage	Cd74,H2-Ab1,Lyz1,Lgals3,S100a4,Csf1r,S100a10,Fcgr3,S100a9,S100a8
Celltype	mesenchymal_stem_cell	Ly6a,Cd34,Thy1,Itgb1,Pdgfra,Vcam1
Celltype	monocyte	Cd48,Itgam
Celltype	skeletal_muscle_satellite_cell	Cav1,Cdh15
Celltype	smooth_muscle_cell	Rgs5
Celltype	stromal_cell	Cd34
Celltype	T_cell	Cd3d,Thy1,Cd2,Cd3e,Cd5,Cd8a
Celltype	Thymocyte	Cd8a,Cd4,Cd5
Subtype	T_cell_CD4+	Ptprc
Subtype	mesenchymal_cell_Car3+	Car3
Subtype	mesenchymal_cell_Scara5+	Scara5
