IdentityGene	GeneSymbol	Level
ENSG00000003402	CFLAR	high
ENSG00000006015	REX1BD	high
ENSG00000006652	IFRD1	high
ENSG00000007168	PAFAH1B1	high
ENSG00000008294	SPAG9	high
ENSG00000009954	BAZ1B	high
ENSG00000010256	UQCRC1	high
ENSG00000010404	IDS	high
ENSG00000012223	LTF	high
ENSG00000014641	MDH1	high
ENSG00000017427	IGF1	high
ENSG00000023287	RB1CC1	high
ENSG00000023445	BIRC3	high
ENSG00000024048	UBR2	high
ENSG00000025796	SEC63	high
ENSG00000026297	RNASET2	high
ENSG00000033170	FUT8	high
ENSG00000034152	MAP2K3	high
ENSG00000034677	RNF19A	high
ENSG00000035862	TIMP2	high
ENSG00000042753	AP2S1	high
ENSG00000047346	FAM214A	high
ENSG00000048828	FAM120A	high
ENSG00000049860	HEXB	high
ENSG00000050405	LIMA1	high
ENSG00000051620	HEBP2	high
ENSG00000053254	FOXN3	high
ENSG00000054282	SDCCAG8	high
ENSG00000055044	NOP58	high
ENSG00000058262	SEC61A1	high
ENSG00000062716	VMP1	high
ENSG00000065308	TRAM2	high
ENSG00000065526	SPEN	high
ENSG00000067066	SP100	high
ENSG00000067082	KLF6	high
ENSG00000072364	AFF4	high
ENSG00000072682	P4HA2	high
ENSG00000072694	FCGR2B	high
ENSG00000073849	ST6GAL1	high
ENSG00000076043	REXO2	high
ENSG00000076662	ICAM3	high
ENSG00000077147	TM9SF3	high
ENSG00000078808	SDF4	high
ENSG00000080200	CRYBG3	high
ENSG00000080371	RAB21	high
ENSG00000080824	HSP90AA1	high
ENSG00000081041	CXCL2	high
ENSG00000081803	CADPS2	high
ENSG00000082153	BZW1	high
ENSG00000083799	CYLD	high
ENSG00000087074	PPP1R15A	high
ENSG00000087502	ERGIC2	high
ENSG00000090104	RGS1	high
ENSG00000090266	NDUFB2	high
ENSG00000090615	GOLGA3	high
ENSG00000091409	ITGA6	high
ENSG00000091490	SEL1L3	high
ENSG00000092096	SLC22A17	high
ENSG00000096696	DSP	high
ENSG00000097033	SH3GLB1	high
ENSG00000100299	ARSA	high
ENSG00000100300	TSPO	high
ENSG00000100354	TNRC6B	high
ENSG00000100852	ARHGAP5	high
ENSG00000101443	WFDC2	high
ENSG00000102531	FNDC3A	high
ENSG00000102554	KLF5	high
ENSG00000102760	RGCC	high
ENSG00000103275	UBE2I	high
ENSG00000103342	GSPT1	high
ENSG00000103966	EHD4	high
ENSG00000104164	BLOC1S6	high
ENSG00000104388	RAB2A	high
ENSG00000104805	NUCB1	high
ENSG00000104870	FCGRT	high
ENSG00000105176	URI1	high
ENSG00000105185	PDCD5	high
ENSG00000105379	ETFB	high
ENSG00000105518	TMEM205	high
ENSG00000105701	FKBP8	high
ENSG00000105835	NAMPT	high
ENSG00000106211	HSPB1	high
ENSG00000106244	PDAP1	high
ENSG00000106355	LSM5	high
ENSG00000106400	ZNHIT1	high
ENSG00000106565	TMEM176B	high
ENSG00000107263	RAPGEF1	high
ENSG00000108055	SMC3	high
ENSG00000108256	NUFIP2	high
ENSG00000108588	CCDC47	high
ENSG00000108622	ICAM2	high
ENSG00000109046	WSB1	high
ENSG00000109083	IFT20	high
ENSG00000109180	OCIAD1	high
ENSG00000109321	AREG	high
ENSG00000109458	GAB1	high
ENSG00000110321	EIF4G2	high
ENSG00000110696	C11orf58	high
ENSG00000110717	NDUFS8	high
ENSG00000111057	KRT18	high
ENSG00000111145	ELK3	high
ENSG00000111276	CDKN1B	high
ENSG00000111341	MGP	high
ENSG00000111371	SLC38A1	high
ENSG00000111666	CHPT1	high
ENSG00000111670	GNPTAB	high
ENSG00000111843	TMEM14C	high
ENSG00000111859	NEDD9	high
ENSG00000112096	SOD2	high
ENSG00000112137	PHACTR1	high
ENSG00000112739	PRPF4B	high
ENSG00000112893	MAN2A1	high
ENSG00000113282	CLINT1	high
ENSG00000113384	GOLPH3	high
ENSG00000113575	PPP2CA	high
ENSG00000113580	NR3C1	high
ENSG00000113621	TXNDC15	high
ENSG00000114439	BBX	high
ENSG00000114796	KLHL24	high
ENSG00000115307	AUP1	high
ENSG00000115310	RTN4	high
ENSG00000115524	SF3B1	high
ENSG00000116044	NFE2L2	high
ENSG00000116717	GADD45A	high
ENSG00000116731	PRDM2	high
ENSG00000116748	AMPD1	high
ENSG00000117335	CD46	high
ENSG00000117614	SYF2	high
ENSG00000117691	NENF	high
ENSG00000117899	MESD	high
ENSG00000118482	PHF3	high
ENSG00000118503	TNFAIP3	high
ENSG00000118640	VAMP8	high
ENSG00000118689	FOXO3	high
ENSG00000118785	SPP1	high
ENSG00000119707	RBM25	high
ENSG00000120675	DNAJC15	high
ENSG00000120694	HSPH1	high
ENSG00000120725	SIL1	high
ENSG00000120727	PAIP2	high
ENSG00000120738	EGR1	high
ENSG00000120875	DUSP4	high
ENSG00000120885	CLU	high
ENSG00000121335	PRB2	high
ENSG00000121774	KHDRBS1	high
ENSG00000121858	TNFSF10	high
ENSG00000122042	UBL3	high
ENSG00000122224	LY9	high
ENSG00000122884	P4HA1	high
ENSG00000123104	ITPR2	high
ENSG00000123200	ZC3H13	high
ENSG00000123240	OPTN	high
ENSG00000123352	SPATS2	high
ENSG00000123358	NR4A1	high
ENSG00000123505	AMD1	high
ENSG00000124107	SLPI	high
ENSG00000124155	PIGT	high
ENSG00000124214	STAU1	high
ENSG00000124766	SOX4	high
ENSG00000124767	GLO1	high
ENSG00000124788	ATXN1	high
ENSG00000124942	AHNAK	high
ENSG00000125730	C3	high
ENSG00000125740	FOSB	high
ENSG00000125827	TMX4	high
ENSG00000125970	RALY	high
ENSG00000126456	IRF3	high
ENSG00000126550	HTN1	high
ENSG00000126698	DNAJC8	high
ENSG00000126777	KTN1	high
ENSG00000127603	MACF1	high
ENSG00000127884	ECHS1	high
ENSG00000128524	ATP6V1F	high
ENSG00000129071	MBD4	high
ENSG00000129235	TXNDC17	high
ENSG00000129351	ILF3	high
ENSG00000129534	MIS18BP1	high
ENSG00000129657	SEC14L1	high
ENSG00000130396	AFDN	high
ENSG00000130724	CHMP2A	high
ENSG00000130775	THEMIS2	high
ENSG00000130779	CLIP1	high
ENSG00000130844	ZNF331	high
ENSG00000131002	TXLNGY	high
ENSG00000131050	BPIFA2	high
ENSG00000131236	CAP1	high
ENSG00000131370	SH3BP5	high
ENSG00000131686	CA6	high
ENSG00000132002	DNAJB1	high
ENSG00000132465	JCHAIN	high
ENSG00000132470	ITGB4	high
ENSG00000134046	MBD2	high
ENSG00000134109	EDEM1	high
ENSG00000134324	LPIN1	high
ENSG00000134352	IL6ST	high
ENSG00000134480	CCNH	high
ENSG00000134551	PRH2	high
ENSG00000134884	ARGLU1	high
ENSG00000135480	KRT7	high
ENSG00000135679	MDM2	high
ENSG00000135720	DYNC1LI2	high
ENSG00000135837	CEP350	high
ENSG00000135842	NIBAN1	high
ENSG00000135968	GCC2	high
ENSG00000136238	RAC1	high
ENSG00000136603	SKIL	high
ENSG00000136628	EPRS1	high
ENSG00000137076	TLN1	high
ENSG00000137331	IER3	high
ENSG00000137509	PRCP	high
ENSG00000137801	THBS1	high
ENSG00000137941	TTLL7	high
ENSG00000138069	RAB1A	high
ENSG00000138166	DUSP5	high
ENSG00000138398	PPIG	high
ENSG00000138674	SEC31A	high
ENSG00000138760	SCARB2	high
ENSG00000138821	SLC39A8	high
ENSG00000139083	ETV6	high
ENSG00000139193	CD27	high
ENSG00000139218	SCAF11	high
ENSG00000139722	VPS37B	high
ENSG00000139793	MBNL2	high
ENSG00000141232	TOB1	high
ENSG00000141552	ANAPC11	high
ENSG00000141682	PMAIP1	high
ENSG00000141867	BRD4	high
ENSG00000142694	EVA1B	high
ENSG00000143013	LMO4	high
ENSG00000143183	TMCO1	high
ENSG00000143549	TPM3	high
ENSG00000143603	KCNN3	high
ENSG00000143799	PARP1	high
ENSG00000144224	UBXN4	high
ENSG00000144381	HSPD1	high
ENSG00000144655	CSRNP1	high
ENSG00000144747	TMF1	high
ENSG00000144867	SRPRB	high
ENSG00000145088	EAF2	high
ENSG00000145241	CENPC	high
ENSG00000145354	CISD2	high
ENSG00000145494	NDUFS6	high
ENSG00000145730	PAM	high
ENSG00000146247	PHIP	high
ENSG00000146425	DYNLT1	high
ENSG00000147162	OGT	high
ENSG00000147454	SLC25A37	high
ENSG00000147862	NFIB	high
ENSG00000148248	SURF4	high
ENSG00000148346	LCN2	high
ENSG00000148834	GSTO1	high
ENSG00000150961	SEC24D	high
ENSG00000151135	TMEM263	high
ENSG00000151882	CCL28	high
ENSG00000151914	DST	high
ENSG00000151929	BAG3	high
ENSG00000152689	RASGRP3	high
ENSG00000152767	FARP1	high
ENSG00000153147	SMARCA5	high
ENSG00000154099	DNAAF1	high
ENSG00000154305	MIA3	high
ENSG00000154589	LY96	high
ENSG00000155096	AZIN1	high
ENSG00000155792	DEPTOR	high
ENSG00000156256	USP16	high
ENSG00000156273	BACH1	high
ENSG00000156273	GRIK1-AS2	high
ENSG00000157637	SLC38A10	high
ENSG00000157954	WIPI2	high
ENSG00000158050	DUSP2	high
ENSG00000158195	WASF2	high
ENSG00000158615	PPP1R15B	high
ENSG00000159110	IFNAR2	high
ENSG00000159128	IFNGR2	high
ENSG00000159763	PIP	high
ENSG00000159884	CCDC107	high
ENSG00000160209	PDXK	high
ENSG00000160209	LOC105372824	high
ENSG00000160710	ADAR	high
ENSG00000160789	LMNA	high
ENSG00000161405	IKZF3	high
ENSG00000162078	ZG16B	high
ENSG00000162368	CMPK1	high
ENSG00000162521	RBBP4	high
ENSG00000162772	ATF3	high
ENSG00000162783	IER5	high
ENSG00000162896	PIGR	high
ENSG00000163320	CGGBP1	high
ENSG00000163382	NAXE	high
ENSG00000163435	ELF3	high
ENSG00000163602	RYBP	high
ENSG00000163644	PPM1K	high
ENSG00000163694	RBM47	high
ENSG00000163714	U2SURP	high
ENSG00000163956	LRPAP1	high
ENSG00000164308	ERAP2	high
ENSG00000164442	CITED2	high
ENSG00000164754	RAD21	high
ENSG00000164932	CTHRC1	high
ENSG00000164938	TP53INP1	high
ENSG00000164949	GEM	high
ENSG00000165030	NFIL3	high
ENSG00000165215	CLDN3	high
ENSG00000165283	STOML2	high
ENSG00000165410	CFL2	high
ENSG00000165527	ARF6	high
ENSG00000165644	COMTD1	high
ENSG00000165813	CCDC186	high
ENSG00000166326	TRIM44	high
ENSG00000166734	GOLM2	high
ENSG00000167077	MEI1	high
ENSG00000167110	GOLGA2	high
ENSG00000167397	VKORC1	high
ENSG00000167470	MIDN	high
ENSG00000167476	JSRP1	high
ENSG00000167476	LOC105372240	high
ENSG00000167792	NDUFV1	high
ENSG00000167797	CDK2AP2	high
ENSG00000167969	ECI1	high
ENSG00000168081	PNOC	high
ENSG00000168283	BMI1	high
ENSG00000168300	PCMTD1	high
ENSG00000168610	STAT3	high
ENSG00000168701	TMEM208	high
ENSG00000169504	CLIC4	high
ENSG00000169926	KLF13	high
ENSG00000170160	CCDC144A	high
ENSG00000170345	FOS	high
ENSG00000170421	KRT8	high
ENSG00000170430	MGMT	high
ENSG00000170542	SERPINB9	high
ENSG00000170571	EMB	high
ENSG00000170759	KIF5B	high
ENSG00000170776	AKAP13	high
ENSG00000171067	C11orf24	high
ENSG00000171159	C9orf16	high
ENSG00000171475	WIPF2	high
ENSG00000171490	RSL1D1	high
ENSG00000171604	CXXC5	high
ENSG00000171634	BPTF	high
ENSG00000171988	JMJD1C	high
ENSG00000172071	EIF2AK3	high
ENSG00000172081	MOB3A	high
ENSG00000172216	CEBPB	high
ENSG00000172578	KLHL6	high
ENSG00000173110	HSPA6	high
ENSG00000173120	KDM2A	high
ENSG00000173193	PARP14	high
ENSG00000173272	MZT2A	high
ENSG00000173540	GMPPB	high
ENSG00000174501	ANKRD36C	high
ENSG00000174718	RESF1	high
ENSG00000174953	DHX36	high
ENSG00000175203	DCTN2	high
ENSG00000175354	PTPN2	high
ENSG00000175984	DENND2C	high
ENSG00000176261	ZBTB8OS	high
ENSG00000176533	GNG7	high
ENSG00000176915	ANKLE2	high
ENSG00000176978	DPP7	high
ENSG00000177200	CHD9	high
ENSG00000177556	ATOX1	high
ENSG00000177606	JUN	high
ENSG00000177885	GRB2	high
ENSG00000178913	TAF7	high
ENSG00000178980	SELENOW	high
ENSG00000179271	GADD45GIP1	high
ENSG00000180398	MCFD2	high
ENSG00000180817	PPA1	high
ENSG00000181788	SIAH2	high
ENSG00000182154	MRPL41	high
ENSG00000182158	CREB3L2	high
ENSG00000182551	ADI1	high
ENSG00000182670	TTC3	high
ENSG00000182985	CADM1	high
ENSG00000183291	SELENOF	high
ENSG00000184292	TACSTD2	high
ENSG00000184557	SOCS3	high
ENSG00000184787	UBE2G2	high
ENSG00000184863	RBM33	high
ENSG00000184983	NDUFA6	high
ENSG00000185129	PURA	high
ENSG00000185418	TARS3	high
ENSG00000185650	ZFP36L1	high
ENSG00000185651	UBE2L3	high
ENSG00000185862	EVI2B	high
ENSG00000186352	ANKRD37	high
ENSG00000186891	TNFRSF18	high
ENSG00000187735	TCEA1	high
ENSG00000189143	CLDN4	high
ENSG00000196396	PTPN1	high
ENSG00000196684	HSH2D	high
ENSG00000196781	TLE1	high
ENSG00000197006	METTL9	high
ENSG00000197324	LRP10	high
ENSG00000197329	PELI1	high
ENSG00000197448	GSTK1	high
ENSG00000197870	PRB3	high
ENSG00000197982	C1orf122	high
ENSG00000198162	MAN1A2	high
ENSG00000198171	DDRGK1	high
ENSG00000198625	MDM4	high
ENSG00000198743	SLC5A3	high
ENSG00000198816	ZNF358	high
ENSG00000198937	CCDC167	high
ENSG00000203709	NA	high
ENSG00000203930	LINC00632	high
ENSG00000204120	GIGYF2	high
ENSG00000204388	HSPA1B	high
ENSG00000204389	HSPA1A	high
ENSG00000205649	HTN3	high
ENSG00000210184	NA	high
ENSG00000210196	NA	high
ENSG00000211592	IGKC	high
ENSG00000211640	IGLV6-57	high
ENSG00000211677	IGLC2	high
ENSG00000211679	IGLC3	high
ENSG00000211890	IGHA2	high
ENSG00000211895	IGHA1	high
ENSG00000211949	IGHV3-23	high
ENSG00000213442	RPL18AP3	high
ENSG00000213639	PPP1CB	high
ENSG00000214253	FIS1	high
ENSG00000221869	CEBPD	high
ENSG00000222724	RNU2-63P	high
ENSG00000225921	NOL7	high
ENSG00000226380	NA	high
ENSG00000230657	PRB4	high
ENSG00000231721	LINC-PINT	high
ENSG00000231887	PRH1	high
ENSG00000231925	TAPBP	high
ENSG00000234741	GAS5	high
ENSG00000244754	N4BP2L2	high
ENSG00000246705	H2AJ	high
ENSG00000249096	NA	high
ENSG00000251655	PRB1	high
ENSG00000254709	IGLL5	high
ENSG00000257727	CNPY2	high
ENSG00000259772	LOC283710	high
ENSG00000260032	NORAD	high
ENSG00000265241	RBM8A	high
ENSG00000267519	NA	high
ENSG00000268205	NA	high
ENSG00000271204	NA	high
ENSG00000272398	CD24	high
ENSG00000272888	NA	high
ENSG00000275302	CCL4	high
ENSG00000277632	CCL3	high
ENSG00000277791	PSMB3	high
ENSG00000004799	PDK4	medium
ENSG00000005020	SKAP2	medium
ENSG00000006712	PAF1	medium
ENSG00000011114	BTBD7	medium
ENSG00000011405	PIK3C2A	medium
ENSG00000014216	CAPN1	medium
ENSG00000016864	GLT8D1	medium
ENSG00000021355	SERPINB1	medium
ENSG00000024862	CCDC28A	medium
ENSG00000035141	FAM136A	medium
ENSG00000049449	RCN1	medium
ENSG00000051108	HERPUD1	medium
ENSG00000060749	QSER1	medium
ENSG00000061936	SFSWAP	medium
ENSG00000065882	TBC1D1	medium
ENSG00000069667	RORA	medium
ENSG00000071054	MAP4K4	medium
ENSG00000071082	RPL31	medium
ENSG00000072135	PTPN18	medium
ENSG00000074696	HACD3	medium
ENSG00000075239	ACAT1	medium
ENSG00000075568	TMEM131	medium
ENSG00000076685	NT5C2	medium
ENSG00000078177	N4BP2	medium
ENSG00000078618	NRDC	medium
ENSG00000078674	PCM1	medium
ENSG00000083937	CHMP2B	medium
ENSG00000084207	GSTP1	medium
ENSG00000085063	CD59	medium
ENSG00000089009	RPL6	medium
ENSG00000089157	RPLP0	medium
ENSG00000092841	MYL6	medium
ENSG00000095139	ARCN1	medium
ENSG00000099246	RAB18	medium
ENSG00000099958	DERL3	medium
ENSG00000099995	SF3A1	medium
ENSG00000100342	APOL1	medium
ENSG00000100393	EP300	medium
ENSG00000100523	DDHD1	medium
ENSG00000100647	SUSD6	medium
ENSG00000100941	PNN	medium
ENSG00000100979	PLTP	medium
ENSG00000101017	CD40	medium
ENSG00000101752	MIB1	medium
ENSG00000102317	RBM3	medium
ENSG00000102871	TRADD	medium
ENSG00000102908	NFAT5	medium
ENSG00000102921	N4BP1	medium
ENSG00000103202	NME4	medium
ENSG00000103769	RAB11A	medium
ENSG00000105612	DNASE2	medium
ENSG00000105699	LSR	medium
ENSG00000107104	KANK1	medium
ENSG00000107438	PDLIM1	medium
ENSG00000107957	SH3PXD2A	medium
ENSG00000108091	CCDC6	medium
ENSG00000109475	RPL34	medium
ENSG00000109846	CRYAB	medium
ENSG00000110422	HIPK3	medium
ENSG00000111897	SERINC1	medium
ENSG00000112200	ZNF451	medium
ENSG00000112379	ARFGEF3	medium
ENSG00000112406	HECA	medium
ENSG00000113269	RNF130	medium
ENSG00000113658	SMAD5	medium
ENSG00000114315	HES1	medium
ENSG00000114354	TFG	medium
ENSG00000114867	EIF4G1	medium
ENSG00000115446	UNC50	medium
ENSG00000116161	CACYBP	medium
ENSG00000116191	RALGPS2	medium
ENSG00000116209	TMEM59	medium
ENSG00000116539	ASH1L	medium
ENSG00000116741	RGS2	medium
ENSG00000118363	SPCS2	medium
ENSG00000118849	RARRES1	medium
ENSG00000119537	KDSR	medium
ENSG00000119900	OGFRL1	medium
ENSG00000120438	TCP1	medium
ENSG00000121104	FAM117A	medium
ENSG00000121644	DESI2	medium
ENSG00000122026	RPL21	medium
ENSG00000122482	ZNF644	medium
ENSG00000122565	CBX3	medium
ENSG00000123131	PRDX4	medium
ENSG00000123146	ADGRE5	medium
ENSG00000123395	ATG101	medium
ENSG00000123636	BAZ2B	medium
ENSG00000124145	SDC4	medium
ENSG00000124357	NAGK	medium
ENSG00000124570	SERPINB6	medium
ENSG00000124813	RUNX2	medium
ENSG00000125611	CHCHD5	medium
ENSG00000125812	GZF1	medium
ENSG00000126549	STATH	medium
ENSG00000126773	PCNX4	medium
ENSG00000128228	SDF2L1	medium
ENSG00000128585	MKLN1	medium
ENSG00000129422	MTUS1	medium
ENSG00000130024	PHF10	medium
ENSG00000131375	CAPN7	medium
ENSG00000132185	FCRLA	medium
ENSG00000132463	GRSF1	medium
ENSG00000132704	FCRL2	medium
ENSG00000134107	BHLHE40	medium
ENSG00000134285	FKBP11	medium
ENSG00000134308	YWHAQ	medium
ENSG00000134982	APC	medium
ENSG00000135046	ANXA1	medium
ENSG00000135185	TMEM243	medium
ENSG00000135373	EHF	medium
ENSG00000135829	DHX9	medium
ENSG00000135956	TMEM127	medium
ENSG00000136758	YME1L1	medium
ENSG00000136826	KLF4	medium
ENSG00000136997	MYC	medium
ENSG00000137106	GRHPR	medium
ENSG00000137845	ADAM10	medium
ENSG00000138600	SPPL2A	medium
ENSG00000138646	HERC5	medium
ENSG00000138670	RASGEF1B	medium
ENSG00000139318	DUSP6	medium
ENSG00000139697	SBNO1	medium
ENSG00000141367	CLTC	medium
ENSG00000142949	PTPRF	medium
ENSG00000143162	CREG1	medium
ENSG00000143322	ABL2	medium
ENSG00000143545	RAB13	medium
ENSG00000143870	PDIA6	medium
ENSG00000145012	LPP	medium
ENSG00000146376	ARHGAP18	medium
ENSG00000146729	NIPSNAP2	medium
ENSG00000147872	PLIN2	medium
ENSG00000148154	UGCG	medium
ENSG00000148303	RPL7A	medium
ENSG00000148516	ZEB1	medium
ENSG00000150625	GPM6A	medium
ENSG00000152219	ARL14EP	medium
ENSG00000152332	UHMK1	medium
ENSG00000152818	UTRN	medium
ENSG00000153208	MERTK	medium
ENSG00000153234	NR4A2	medium
ENSG00000154265	ABCA5	medium
ENSG00000154511	DIPK1A	medium
ENSG00000155304	HSPA13	medium
ENSG00000155465	SLC7A7	medium
ENSG00000156650	KAT6B	medium
ENSG00000157259	GATAD1	medium
ENSG00000159388	BTG2	medium
ENSG00000160058	BSDC1	medium
ENSG00000160714	UBE2Q1	medium
ENSG00000161055	SCGB3A1	medium
ENSG00000161091	MFSD12	medium
ENSG00000161970	RPL26	medium
ENSG00000162413	KLHL21	medium
ENSG00000162613	FUBP1	medium
ENSG00000162734	PEA15	medium
ENSG00000163468	CCT3	medium
ENSG00000163479	SSR2	medium
ENSG00000163597	SNHG16	medium
ENSG00000163659	TIPARP	medium
ENSG00000164091	WDR82	medium
ENSG00000164221	CCDC112	medium
ENSG00000164244	PRRC1	medium
ENSG00000164587	RPS14	medium
ENSG00000164713	BRI3	medium
ENSG00000164733	CTSB	medium
ENSG00000164897	TMUB1	medium
ENSG00000164930	FZD6	medium
ENSG00000165312	OTUD1	medium
ENSG00000165525	NEMF	medium
ENSG00000166145	SPINT1	medium
ENSG00000166233	ARIH1	medium
ENSG00000166311	SMPD1	medium
ENSG00000166340	TPP1	medium
ENSG00000166441	RPL27A	medium
ENSG00000166595	CIAO2B	medium
ENSG00000166598	HSP90B1	medium
ENSG00000166710	B2M	medium
ENSG00000167123	CERCAM	medium
ENSG00000167193	CRK	medium
ENSG00000167526	RPL13	medium
ENSG00000168028	RPSA	medium
ENSG00000168556	ING2	medium
ENSG00000168899	VAMP5	medium
ENSG00000169429	CXCL8	medium
ENSG00000169895	SYAP1	medium
ENSG00000170315	UBB	medium
ENSG00000171311	EXOSC1	medium
ENSG00000171314	PGAM1	medium
ENSG00000171345	KRT19	medium
ENSG00000171843	MLLT3	medium
ENSG00000172175	MALT1	medium
ENSG00000172493	AFF1	medium
ENSG00000173418	NAA20	medium
ENSG00000173511	VEGFB	medium
ENSG00000173846	PLK3	medium
ENSG00000173905	GOLIM4	medium
ENSG00000173992	CCS	medium
ENSG00000174485	DENND4A	medium
ENSG00000177565	TBL1XR1	medium
ENSG00000179195	ZNF664	medium
ENSG00000179222	MAGED1	medium
ENSG00000180957	PITPNB	medium
ENSG00000181396	OGFOD3	medium
ENSG00000182149	IST1	medium
ENSG00000183011	NAA38	medium
ENSG00000183255	PTTG1IP	medium
ENSG00000184009	ACTG1	medium
ENSG00000185187	SIGIRR	medium
ENSG00000185215	TNFAIP2	medium
ENSG00000185222	TCEAL9	medium
ENSG00000185339	TCN2	medium
ENSG00000186283	TOR3A	medium
ENSG00000187257	RSBN1L	medium
ENSG00000187699	C2orf88	medium
ENSG00000188177	ZC3H6	medium
ENSG00000188529	SRSF10	medium
ENSG00000188938	FAM120AOS	medium
ENSG00000196843	ARID5A	medium
ENSG00000196914	ARHGEF12	medium
ENSG00000197536	NA	medium
ENSG00000197714	ZNF460	medium
ENSG00000197879	MYO1C	medium
ENSG00000198663	C6orf89	medium
ENSG00000198740	ZNF652	medium
ENSG00000198805	PNP	medium
ENSG00000198855	FICD	medium
ENSG00000198888	ND1	medium
ENSG00000204217	BMPR2	medium
ENSG00000204569	PPP1R10	medium
ENSG00000213064	SFT2D2	medium
ENSG00000214078	CPNE1	medium
ENSG00000214530	STARD10	medium
ENSG00000217128	FNIP1	medium
ENSG00000233559	NA	medium
ENSG00000234883	MIR155HG	medium
ENSG00000235750	KIAA0040	medium
ENSG00000251562	MALAT1	medium
ENSG00000253352	TUG1	medium
ENSG00000253738	OTUD6B-AS1	medium
ENSG00000255112	CHMP1B	medium
ENSG00000257923	CUX1	medium
