IdentityGene	GeneSymbol	Level
ENSG00000005059	MCUB	high
ENSG00000005810	MYCBP2	high
ENSG00000008952	SEC62	high
ENSG00000008988	RPS20	high
ENSG00000038219	BOD1L1	high
ENSG00000047410	TPR	high
ENSG00000054267	ARID4B	high
ENSG00000054654	SYNE2	high
ENSG00000057657	PRDM1	high
ENSG00000059804	SLC2A3	high
ENSG00000063046	EIF4B	high
ENSG00000063177	RPL18	high
ENSG00000065809	FAM107B	high
ENSG00000067066	SP100	high
ENSG00000067082	KLF6	high
ENSG00000069275	NUCKS1	high
ENSG00000070831	CDC42	high
ENSG00000071082	RPL31	high
ENSG00000074966	TXK	high
ENSG00000077549	CAPZB	high
ENSG00000081059	TCF7	high
ENSG00000081320	STK17B	high
ENSG00000082074	FYB1	high
ENSG00000083845	RPS5	high
ENSG00000085224	ATRX	high
ENSG00000086061	DNAJA1	high
ENSG00000089009	RPL6	high
ENSG00000089063	TMEM230	high
ENSG00000089157	RPLP0	high
ENSG00000089327	FXYD5	high
ENSG00000090238	YPEL3	high
ENSG00000091039	OSBPL8	high
ENSG00000095015	MAP3K1	high
ENSG00000099622	CIRBP	high
ENSG00000099624	ATP5F1D	high
ENSG00000100100	PIK3IP1	high
ENSG00000100316	RPL3	high
ENSG00000100354	TNRC6B	high
ENSG00000100380	ST13	high
ENSG00000100650	SRSF5	high
ENSG00000100664	EIF5	high
ENSG00000101347	SAMHD1	high
ENSG00000101745	ANKRD12	high
ENSG00000104408	EIF3E	high
ENSG00000104529	EEF1D	high
ENSG00000104660	LEPROTL1	high
ENSG00000104894	CD37	high
ENSG00000104964	TLE5	high
ENSG00000104979	C19orf53	high
ENSG00000105193	RPS16	high
ENSG00000105202	FBL	high
ENSG00000105373	NOP53	high
ENSG00000105640	RPL18A	high
ENSG00000106560	GIMAP2	high
ENSG00000107581	EIF3A	high
ENSG00000108107	RPL28	high
ENSG00000108298	RPL19	high
ENSG00000109475	RPL34	high
ENSG00000109787	KLF3	high
ENSG00000110321	EIF4G2	high
ENSG00000110700	RPS13	high
ENSG00000111371	SLC38A1	high
ENSG00000111716	LDHB	high
ENSG00000111796	KLRB1	high
ENSG00000111913	RIPOR2	high
ENSG00000112081	SRSF3	high
ENSG00000112306	RPS12	high
ENSG00000112514	CUTA	high
ENSG00000112576	CCND3	high
ENSG00000112695	COX7A2	high
ENSG00000113263	ITK	high
ENSG00000113558	SKP1	high
ENSG00000114209	PDCD10	high
ENSG00000114391	RPL24	high
ENSG00000114861	FOXP1	high
ENSG00000114942	EEF1B2	high
ENSG00000115091	ACTR3	high
ENSG00000115165	CYTIP	high
ENSG00000115268	RPS15	high
ENSG00000115524	SF3B1	high
ENSG00000115687	PASK	high
ENSG00000115977	AAK1	high
ENSG00000116754	SRSF11	high
ENSG00000117091	CD48	high
ENSG00000117614	SYF2	high
ENSG00000118181	RPS25	high
ENSG00000119707	RBM25	high
ENSG00000119801	YPEL5	high
ENSG00000119950	MXI1	high
ENSG00000120694	HSPH1	high
ENSG00000122026	RPL21	high
ENSG00000122406	RPL5	high
ENSG00000123349	PFDN5	high
ENSG00000124614	RPS10	high
ENSG00000124831	LRRFIP1	high
ENSG00000125656	CLPP	high
ENSG00000125691	RPL23	high
ENSG00000125740	FOSB	high
ENSG00000126353	CCR7	high
ENSG00000126756	UXT	high
ENSG00000126777	KTN1	high
ENSG00000127152	BCL11B	high
ENSG00000127184	COX7C	high
ENSG00000127483	HP1BP3	high
ENSG00000127528	KLF2	high
ENSG00000127540	UQCR11	high
ENSG00000129824	RPS4Y1	high
ENSG00000130255	RPL36	high
ENSG00000130312	MRPL34	high
ENSG00000130429	ARPC1B	high
ENSG00000130522	JUND	high
ENSG00000130755	GMFG	high
ENSG00000130811	EIF3G	high
ENSG00000131469	RPL27	high
ENSG00000131507	NDFIP1	high
ENSG00000132002	DNAJB1	high
ENSG00000132424	PNISR	high
ENSG00000133112	TPT1	high
ENSG00000133226	SRRM1	high
ENSG00000133574	GIMAP4	high
ENSG00000134186	PRPF38B	high
ENSG00000134352	IL6ST	high
ENSG00000134419	RPS15A	high
ENSG00000134954	ETS1	high
ENSG00000135486	HNRNPA1	high
ENSG00000135655	USP15	high
ENSG00000135968	GCC2	high
ENSG00000136279	DBNL	high
ENSG00000136732	GYPC	high
ENSG00000136758	YME1L1	high
ENSG00000136888	ATP6V1G1	high
ENSG00000136938	ANP32B	high
ENSG00000136942	RPL35	high
ENSG00000137154	RPS6	high
ENSG00000137193	PIM1	high
ENSG00000137642	SORL1	high
ENSG00000137818	RPLP1	high
ENSG00000138279	ANXA7	high
ENSG00000138326	RPS24	high
ENSG00000138594	TMOD3	high
ENSG00000138594	LOC112268148	high
ENSG00000138795	LEF1	high
ENSG00000139146	SINHCAF	high
ENSG00000139684	ESD	high
ENSG00000140988	RPS2	high
ENSG00000141002	TCF25	high
ENSG00000141232	TOB1	high
ENSG00000142534	RPS11	high
ENSG00000142541	RPL13A	high
ENSG00000142546	NOSIP	high
ENSG00000142676	RPL11	high
ENSG00000142864	SERBP1	high
ENSG00000142937	RPS8	high
ENSG00000143947	RPS27A	high
ENSG00000144426	NBEAL1	high
ENSG00000144674	GOLGA4	high
ENSG00000144713	RPL32	high
ENSG00000144746	ARL6IP5	high
ENSG00000145425	RPS3A	high
ENSG00000145592	RPL37	high
ENSG00000145675	PIK3R1	high
ENSG00000145779	TNFAIP8	high
ENSG00000146223	RPL7L1	high
ENSG00000147403	RPL10	high
ENSG00000147548	NSD3	high
ENSG00000147604	RPL7	high
ENSG00000147649	MTDH	high
ENSG00000147677	EIF3H	high
ENSG00000148303	RPL7A	high
ENSG00000148908	RGS10	high
ENSG00000149212	SESN3	high
ENSG00000149273	RPS3	high
ENSG00000149311	ATM	high
ENSG00000149806	FAU	high
ENSG00000150459	SAP18	high
ENSG00000152082	MZT2B	high
ENSG00000152558	TMEM123	high
ENSG00000152601	MBNL1	high
ENSG00000152795	HNRNPDL	high
ENSG00000153187	HNRNPU	high
ENSG00000156467	UQCRB	high
ENSG00000156482	RPL30	high
ENSG00000156508	EEF1A1	high
ENSG00000156976	EIF4A2	high
ENSG00000157978	LDLRAP1	high
ENSG00000160310	PRMT2	high
ENSG00000160613	PCSK7	high
ENSG00000160908	ZNF394	high
ENSG00000161016	RPL8	high
ENSG00000161970	RPL26	high
ENSG00000162191	UBXN1	high
ENSG00000162244	RPL29	high
ENSG00000163041	H3-3A	high
ENSG00000163479	SSR2	high
ENSG00000163519	TRAT1	high
ENSG00000163660	CCNL1	high
ENSG00000163682	RPL9	high
ENSG00000164346	NSA2	high
ENSG00000164587	RPS14	high
ENSG00000164691	TAGAP	high
ENSG00000164919	COX6C	high
ENSG00000165502	RPL36AL	high
ENSG00000166295	ANAPC16	high
ENSG00000166441	RPL27A	high
ENSG00000167283	ATP5MG	high
ENSG00000167468	GPX4	high
ENSG00000167522	ANKRD11	high
ENSG00000167526	RPL13	high
ENSG00000167552	TUBA1A	high
ENSG00000168028	RPSA	high
ENSG00000168066	SF1	high
ENSG00000168298	H1-4	high
ENSG00000168421	RHOH	high
ENSG00000168610	STAT3	high
ENSG00000169020	ATP5ME	high
ENSG00000169045	HNRNPH1	high
ENSG00000169508	GPR183	high
ENSG00000169567	HINT1	high
ENSG00000170345	FOS	high
ENSG00000170889	RPS9	high
ENSG00000171159	C9orf16	high
ENSG00000171223	JUNB	high
ENSG00000171522	PTGER4	high
ENSG00000171791	BCL2	high
ENSG00000171858	RPS21	high
ENSG00000171863	RPS7	high
ENSG00000172005	MAL	high
ENSG00000172809	RPL38	high
ENSG00000173660	UQCRH	high
ENSG00000173726	TOMM20	high
ENSG00000174444	RPL4	high
ENSG00000174917	MICOS13	high
ENSG00000175061	SNHG29	high
ENSG00000175390	EIF3F	high
ENSG00000175567	UCP2	high
ENSG00000176731	RBIS	high
ENSG00000177410	ZFAS1	high
ENSG00000177600	RPLP2	high
ENSG00000177606	JUN	high
ENSG00000177733	HNRNPA0	high
ENSG00000177954	RPS27	high
ENSG00000179144	GIMAP7	high
ENSG00000180370	PAK2	high
ENSG00000181163	NPM1	high
ENSG00000182568	SATB1	high
ENSG00000182774	RPS17	high
ENSG00000182866	LCK	high
ENSG00000182899	RPL35A	high
ENSG00000184557	SOCS3	high
ENSG00000185088	RPS27L	high
ENSG00000185115	NSMCE3	high
ENSG00000185262	UBALD2	high
ENSG00000185811	IKZF1	high
ENSG00000185862	EVI2B	high
ENSG00000186468	RPS23	high
ENSG00000187109	NAP1L1	high
ENSG00000188243	COMMD6	high
ENSG00000188404	SELL	high
ENSG00000188846	RPL14	high
ENSG00000188994	ZNF292	high
ENSG00000189283	FHIT	high
ENSG00000196199	MPHOSPH8	high
ENSG00000196531	NACA	high
ENSG00000196683	TOMM7	high
ENSG00000197448	GSTK1	high
ENSG00000197622	CDC42SE1	high
ENSG00000197728	RPS26	high
ENSG00000197747	S100A10	high
ENSG00000197756	RPL37A	high
ENSG00000197958	RPL12	high
ENSG00000198034	RPS4X	high
ENSG00000198242	RPL23A	high
ENSG00000198755	RPL10A	high
ENSG00000198771	RCSD1	high
ENSG00000198851	CD3E	high
ENSG00000198918	RPL39	high
ENSG00000203875	SNHG5	high
ENSG00000204388	HSPA1B	high
ENSG00000204389	HSPA1A	high
ENSG00000204628	RACK1	high
ENSG00000205581	HMGN1	high
ENSG00000211751	TRBC1	high
ENSG00000213178	NA	high
ENSG00000213626	LBH	high
ENSG00000213639	PPP1CB	high
ENSG00000213654	GPSM3	high
ENSG00000213741	RPS29	high
ENSG00000221983	UBA52	high
ENSG00000229807	XIST	high
ENSG00000230202	NA	high
ENSG00000231500	RPS18	high
ENSG00000232388	SMIM26	high
ENSG00000233927	RPS28	high
ENSG00000234741	GAS5	high
ENSG00000237550	RPL9P8	high
ENSG00000237943	PRKCQ-AS1	high
ENSG00000244754	N4BP2L2	high
ENSG00000245910	SNHG6	high
ENSG00000247774	PCED1B-AS1	high
ENSG00000255302	EID1	high
ENSG00000265241	RBM8A	high
ENSG00000265681	RPL17	high
ENSG00000265972	TXNIP	high
ENSG00000267519	NA	high
ENSG00000277734	TRAC	high
ENSG00000281649	EBLN3P	high
ENSG00000007255	TRAPPC6A	medium
ENSG00000011275	RNF216	medium
ENSG00000013374	NUB1	medium
ENSG00000013441	CLK1	medium
ENSG00000035115	SH3YL1	medium
ENSG00000048649	RSF1	medium
ENSG00000060237	WNK1	medium
ENSG00000061936	SFSWAP	medium
ENSG00000065413	ANKRD44	medium
ENSG00000069329	VPS35	medium
ENSG00000069345	DNAJA2	medium
ENSG00000074800	ENO1	medium
ENSG00000076662	ICAM3	medium
ENSG00000078177	N4BP2	medium
ENSG00000079246	XRCC5	medium
ENSG00000088205	DDX18	medium
ENSG00000089053	ANAPC5	medium
ENSG00000100129	EIF3L	medium
ENSG00000100353	EIF3D	medium
ENSG00000100461	RBM23	medium
ENSG00000102007	PLP2	medium
ENSG00000105258	POLR2I	medium
ENSG00000106355	LSM5	medium
ENSG00000106682	EIF4H	medium
ENSG00000108848	LUC7L3	medium
ENSG00000110367	DDX6	medium
ENSG00000111832	RWDD1	medium
ENSG00000112297	CRYBG1	medium
ENSG00000113732	ATP6V0E1	medium
ENSG00000113851	CRBN	medium
ENSG00000114023	FAM162A	medium
ENSG00000115561	CHMP3	medium
ENSG00000115866	DARS1	medium
ENSG00000118482	PHF3	medium
ENSG00000122034	GTF3A	medium
ENSG00000124383	MPHOSPH10	medium
ENSG00000125977	EIF2S2	medium
ENSG00000126261	UBA2	medium
ENSG00000126524	SBDS	medium
ENSG00000128534	LSM8	medium
ENSG00000130313	PGLS	medium
ENSG00000130741	EIF2S3	medium
ENSG00000130921	C12orf65	medium
ENSG00000133398	MED10	medium
ENSG00000134744	TUT4	medium
ENSG00000135624	CCT7	medium
ENSG00000136003	ISCU	medium
ENSG00000136819	C9orf78	medium
ENSG00000137876	RSL24D1	medium
ENSG00000138085	ATRAID	medium
ENSG00000138398	PPIG	medium
ENSG00000139218	SCAF11	medium
ENSG00000139746	RBM26	medium
ENSG00000140577	CRTC3	medium
ENSG00000143158	MPC2	medium
ENSG00000143198	MGST3	medium
ENSG00000143546	S100A8	medium
ENSG00000143772	ITPKB	medium
ENSG00000144161	ZC3H8	medium
ENSG00000145287	PLAC8	medium
ENSG00000147274	RBMX	medium
ENSG00000149823	VPS51	medium
ENSG00000149932	TMEM219	medium
ENSG00000150753	CCT5	medium
ENSG00000152234	ATP5F1A	medium
ENSG00000154229	PRKCA	medium
ENSG00000154582	ELOC	medium
ENSG00000155438	NIFK	medium
ENSG00000156411	ATP5MPL	medium
ENSG00000157191	NECAP2	medium
ENSG00000162852	CNST	medium
ENSG00000162894	FCMR	medium
ENSG00000163220	S100A9	medium
ENSG00000163848	ZNF148	medium
ENSG00000163938	GNL3	medium
ENSG00000163956	LRPAP1	medium
ENSG00000164091	WDR82	medium
ENSG00000164985	PSIP1	medium
ENSG00000166750	SLFN5	medium
ENSG00000167232	ZNF91	medium
ENSG00000167863	ATP5PD	medium
ENSG00000168724	DNAJC21	medium
ENSG00000169021	UQCRFS1	medium
ENSG00000169764	UGP2	medium
ENSG00000171490	RSL1D1	medium
ENSG00000173915	ATP5MD	medium
ENSG00000174720	LARP7	medium
ENSG00000174748	RPL15	medium
ENSG00000174780	SRP72	medium
ENSG00000176915	ANKLE2	medium
ENSG00000179010	MRFAP1	medium
ENSG00000179715	PCED1B	medium
ENSG00000180628	PCGF5	medium
ENSG00000182220	ATP6AP2	medium
ENSG00000182670	TTC3	medium
ENSG00000183354	KIAA2026	medium
ENSG00000184863	RBM33	medium
ENSG00000184900	SUMO3	medium
ENSG00000187764	SEMA4D	medium
ENSG00000197971	MBP	medium
ENSG00000198624	CCDC69	medium
ENSG00000198830	HMGN2	medium
ENSG00000198840	ND3	medium
ENSG00000198858	R3HDM4	medium
ENSG00000198899	ATP6	medium
ENSG00000198931	APRT	medium
ENSG00000205544	TMEM256	medium
ENSG00000205981	DNAJC19	medium
ENSG00000213203	GIMAP1	medium
ENSG00000223496	EXOSC6	medium
ENSG00000224032	NA	medium
ENSG00000233355	CHRM3-AS2	medium
ENSG00000244734	HBB	medium
ENSG00000255198	SNHG9	medium
ENSG00000268027	NA	medium
ENSG00000282826	FRG1CP	medium
