IdentityGene	GeneSymbol	Level
ENSG00000002933	TMEM176A	high
ENSG00000003989	SLC7A2	high
ENSG00000004848	ARX	high
ENSG00000007372	PAX6	high
ENSG00000009307	CSDE1	high
ENSG00000011347	SYT7	high
ENSG00000014641	MDH1	high
ENSG00000030582	GRN	high
ENSG00000054148	PHPT1	high
ENSG00000063046	EIF4B	high
ENSG00000065518	NDUFB4	high
ENSG00000069275	NUCKS1	high
ENSG00000070081	NUCB2	high
ENSG00000070087	PFN2	high
ENSG00000070961	ATP2B1	high
ENSG00000071553	ATP6AP1	high
ENSG00000072778	ACADVL	high
ENSG00000076554	TPD52	high
ENSG00000077549	CAPZB	high
ENSG00000079689	SCGN	high
ENSG00000085224	ATRX	high
ENSG00000086619	ERO1B	high
ENSG00000087460	GNAS	high
ENSG00000089199	CHGB	high
ENSG00000089248	ERP29	high
ENSG00000089327	FXYD5	high
ENSG00000090266	NDUFB2	high
ENSG00000092068	SLC7A8	high
ENSG00000095932	SMIM24	high
ENSG00000099341	PSMD8	high
ENSG00000099622	CIRBP	high
ENSG00000100316	RPL3	high
ENSG00000100387	RBX1	high
ENSG00000101160	CTSZ	high
ENSG00000101489	CELF4	high
ENSG00000101745	ANKRD12	high
ENSG00000102109	PCSK1N	high
ENSG00000102409	BEX4	high
ENSG00000103024	NME3	high
ENSG00000103769	RAB11A	high
ENSG00000104112	SCG3	high
ENSG00000104388	RAB2A	high
ENSG00000104435	STMN2	high
ENSG00000104723	TUSC3	high
ENSG00000104763	ASAH1	high
ENSG00000104765	BNIP3L	high
ENSG00000104805	NUCB1	high
ENSG00000105185	PDCD5	high
ENSG00000105223	PLD3	high
ENSG00000105355	PLIN3	high
ENSG00000105669	COPE	high
ENSG00000105701	FKBP8	high
ENSG00000105738	SIPA1L3	high
ENSG00000106261	ZKSCAN1	high
ENSG00000106565	TMEM176B	high
ENSG00000107281	NPDC1	high
ENSG00000107872	FBXL15	high
ENSG00000108679	LGALS3BP	high
ENSG00000108848	LUC7L3	high
ENSG00000108953	YWHAE	high
ENSG00000109180	OCIAD1	high
ENSG00000109390	NDUFC1	high
ENSG00000109472	CPE	high
ENSG00000109501	WFS1	high
ENSG00000110318	CEP126	high
ENSG00000110321	EIF4G2	high
ENSG00000110955	ATP5F1B	high
ENSG00000111639	MRPL51	high
ENSG00000111897	SERINC1	high
ENSG00000112379	ARFGEF3	high
ENSG00000112514	CUTA	high
ENSG00000112695	COX7A2	high
ENSG00000113732	ATP6V0E1	high
ENSG00000114353	GNAI2	high
ENSG00000115263	GCG	high
ENSG00000115419	GLS	high
ENSG00000115457	IGFBP2	high
ENSG00000115828	QPCT	high
ENSG00000115944	COX7A2L	high
ENSG00000116171	SCP2	high
ENSG00000116183	PAPPA2	high
ENSG00000116209	TMEM59	high
ENSG00000116299	ELAPOR1	high
ENSG00000116539	ASH1L	high
ENSG00000116754	SRSF11	high
ENSG00000116857	TMEM9	high
ENSG00000117152	RGS4	high
ENSG00000117335	CD46	high
ENSG00000117523	PRRC2C	high
ENSG00000117691	NENF	high
ENSG00000118271	TTR	high
ENSG00000118418	HMGN3	high
ENSG00000118816	CCNI	high
ENSG00000119335	SET	high
ENSG00000119632	IFI27L2	high
ENSG00000119655	NPC2	high
ENSG00000119888	EPCAM	high
ENSG00000120306	CYSTM1	high
ENSG00000120885	CLU	high
ENSG00000121774	KHDRBS1	high
ENSG00000122873	CISD1	high
ENSG00000123349	PFDN5	high
ENSG00000123416	TUBA1B	high
ENSG00000124172	ATP5F1E	high
ENSG00000125356	NDUFA1	high
ENSG00000125652	ALKBH7	high
ENSG00000125675	GRIA3	high
ENSG00000125820	NKX2-2	high
ENSG00000125851	PCSK2	high
ENSG00000126218	F10	high
ENSG00000127824	TUBA4A	high
ENSG00000127884	ECHS1	high
ENSG00000127914	AKAP9	high
ENSG00000127922	SEM1	high
ENSG00000128564	VGF	high
ENSG00000128739	SNRPN	high
ENSG00000129625	REEP5	high
ENSG00000130294	KIF1A	high
ENSG00000130643	CALY	high
ENSG00000131473	ACLY	high
ENSG00000131979	GCH1	high
ENSG00000132424	PNISR	high
ENSG00000133134	BEX2	high
ENSG00000133169	BEX1	high
ENSG00000134138	MEIS2	high
ENSG00000134884	ARGLU1	high
ENSG00000135916	ITM2C	high
ENSG00000136193	SCRN1	high
ENSG00000136750	GAD2	high
ENSG00000136938	ANP32B	high
ENSG00000137731	FXYD2	high
ENSG00000138078	PREPL	high
ENSG00000138085	ATRAID	high
ENSG00000138131	LOXL4	high
ENSG00000138193	PLCE1	high
ENSG00000138279	ANXA7	high
ENSG00000138495	COX17	high
ENSG00000139910	NOVA1	high
ENSG00000139970	RTN1	high
ENSG00000140391	TSPAN3	high
ENSG00000141002	TCF25	high
ENSG00000141198	TOM1L1	high
ENSG00000141552	ANAPC11	high
ENSG00000141837	CACNA1A	high
ENSG00000143158	MPC2	high
ENSG00000143198	MGST3	high
ENSG00000144224	UBXN4	high
ENSG00000144674	GOLGA4	high
ENSG00000145321	GC	high
ENSG00000145632	PLK2	high
ENSG00000145730	PAM	high
ENSG00000146223	RPL7L1	high
ENSG00000147123	NDUFB11	high
ENSG00000147571	CRH	high
ENSG00000148248	SURF4	high
ENSG00000148584	A1CF	high
ENSG00000150593	PDCD4	high
ENSG00000151353	TMEM18	high
ENSG00000151552	QDPR	high
ENSG00000156411	ATP5MPL	high
ENSG00000156976	EIF4A2	high
ENSG00000158604	TMED4	high
ENSG00000159199	ATP5MC1	high
ENSG00000159409	CELF3	high
ENSG00000160075	SSU72	high
ENSG00000160310	PRMT2	high
ENSG00000161249	DMKN	high
ENSG00000162545	CAMK2N1	high
ENSG00000162989	KCNJ3	high
ENSG00000162992	NEUROD1	high
ENSG00000163453	IGFBP7	high
ENSG00000163468	CCT3	high
ENSG00000163499	CRYBA2	high
ENSG00000165092	ALDH1A1	high
ENSG00000166136	NDUFB8	high
ENSG00000166228	PCBD1	high
ENSG00000166562	SEC11C	high
ENSG00000166681	BEX3	high
ENSG00000166710	B2M	high
ENSG00000166848	TERF2IP	high
ENSG00000166848	LOC105371348	high
ENSG00000166922	SCG5	high
ENSG00000167004	PDIA3	high
ENSG00000167283	ATP5MG	high
ENSG00000167642	SPINT2	high
ENSG00000167964	RAB26	high
ENSG00000168003	SLC3A2	high
ENSG00000169567	HINT1	high
ENSG00000169714	CNBP	high
ENSG00000169903	TM4SF4	high
ENSG00000170293	CMTM8	high
ENSG00000170561	IRX2	high
ENSG00000171159	C9orf16	high
ENSG00000171222	SCAND1	high
ENSG00000171703	TCEA2	high
ENSG00000171951	SCG2	high
ENSG00000172354	GNB2	high
ENSG00000172889	EGFL7	high
ENSG00000173418	NAA20	high
ENSG00000173542	MOB1B	high
ENSG00000174938	SEZ6L2	high
ENSG00000176171	BNIP3	high
ENSG00000176340	COX8A	high
ENSG00000176978	DPP7	high
ENSG00000177200	CHD9	high
ENSG00000177511	ST8SIA3	high
ENSG00000178057	NDUFAF3	high
ENSG00000178467	P4HTM	high
ENSG00000178662	CSRNP3	high
ENSG00000178695	KCTD12	high
ENSG00000179218	CALR	high
ENSG00000180879	SSR4	high
ENSG00000182670	TTC3	high
ENSG00000183648	NDUFB1	high
ENSG00000185129	PURA	high
ENSG00000185624	P4HB	high
ENSG00000185787	MORF4L1	high
ENSG00000186472	PCLO	high
ENSG00000187210	GCNT1	high
ENSG00000187244	BCAM	high
ENSG00000188186	LAMTOR4	high
ENSG00000196199	MPHOSPH8	high
ENSG00000196465	MYL6B	high
ENSG00000197249	SERPINA1	high
ENSG00000197982	C1orf122	high
ENSG00000198258	UBL5	high
ENSG00000198363	ASPH	high
ENSG00000198804	COX1	high
ENSG00000198886	ND4	high
ENSG00000204103	MAFB	high
ENSG00000206503	HLA-A	high
ENSG00000213465	ARL2	high
ENSG00000214530	STARD10	high
ENSG00000220205	VAMP2	high
ENSG00000224078	NA	high
ENSG00000225470	JPX	high
ENSG00000230590	FTX	high
ENSG00000230989	HSBP1	high
ENSG00000235162	C12orf75	high
ENSG00000237550	RPL9P8	high
ENSG00000241468	ATP5MF	high
ENSG00000242485	MRPL20	high
ENSG00000244754	N4BP2L2	high
ENSG00000248527	MTATP6P1	high
ENSG00000255302	EID1	high
ENSG00000257727	CNPY2	high
ENSG00000260230	FRRS1L	high
ENSG00000269893	SNHG8	high
ENSG00000276644	DACH1	high
ENSG00000007402	CACNA2D2	medium
ENSG00000009950	MLXIPL	medium
ENSG00000010244	ZNF207	medium
ENSG00000018236	CNTN1	medium
ENSG00000023516	AKAP11	medium
ENSG00000029363	BCLAF1	medium
ENSG00000054116	TRAPPC3	medium
ENSG00000054793	ATP9A	medium
ENSG00000065621	GSTO2	medium
ENSG00000067992	PDK3	medium
ENSG00000077264	PAK3	medium
ENSG00000085365	SCAMP1	medium
ENSG00000087448	KLHL42	medium
ENSG00000091844	RGS17	medium
ENSG00000092010	PSME1	medium
ENSG00000092841	MYL6	medium
ENSG00000095981	KCNK16	medium
ENSG00000100422	CERK	medium
ENSG00000101752	MIB1	medium
ENSG00000101849	TBL1X	medium
ENSG00000103254	ANTKMT	medium
ENSG00000103260	METRN	medium
ENSG00000103365	GGA2	medium
ENSG00000103460	TOX3	medium
ENSG00000103528	SYT17	medium
ENSG00000104979	C19orf53	medium
ENSG00000106299	WASL	medium
ENSG00000106723	SPIN1	medium
ENSG00000106976	DNM1	medium
ENSG00000108561	C1QBP	medium
ENSG00000111011	RSRC2	medium
ENSG00000111237	VPS29	medium
ENSG00000111640	GAPDH	medium
ENSG00000112715	VEGFA	medium
ENSG00000112773	TENT5A	medium
ENSG00000114631	PODXL2	medium
ENSG00000114784	EIF1B	medium
ENSG00000117616	RSRP1	medium
ENSG00000118495	PLAGL1	medium
ENSG00000118985	ELL2	medium
ENSG00000119705	SLIRP	medium
ENSG00000120915	EPHX2	medium
ENSG00000120948	TARDBP	medium
ENSG00000121067	SPOP	medium
ENSG00000122545	SEPTIN7	medium
ENSG00000125826	RBCK1	medium
ENSG00000126768	TIMM17B	medium
ENSG00000128524	ATP6V1F	medium
ENSG00000131469	RPL27	medium
ENSG00000131966	ACTR10	medium
ENSG00000132305	IMMT	medium
ENSG00000134308	YWHAQ	medium
ENSG00000134709	HOOK1	medium
ENSG00000135441	BLOC1S1	medium
ENSG00000135829	DHX9	medium
ENSG00000136854	STXBP1	medium
ENSG00000137726	FXYD6	medium
ENSG00000138398	PPIG	medium
ENSG00000139343	SNRPF	medium
ENSG00000139697	SBNO1	medium
ENSG00000140632	GLYR1	medium
ENSG00000143549	TPM3	medium
ENSG00000147488	ST18	medium
ENSG00000148334	PTGES2	medium
ENSG00000149273	RPS3	medium
ENSG00000150527	MIA2	medium
ENSG00000151914	DST	medium
ENSG00000152779	SLC16A12	medium
ENSG00000152932	RAB3C	medium
ENSG00000153002	CPB1	medium
ENSG00000157637	SLC38A10	medium
ENSG00000157978	LDLRAP1	medium
ENSG00000158528	PPP1R9A	medium
ENSG00000160014	CALM3	medium
ENSG00000160584	SIK3	medium
ENSG00000162244	RPL29	medium
ENSG00000162438	CTRC	medium
ENSG00000163069	SGCB	medium
ENSG00000163497	FEV	medium
ENSG00000163531	NFASC	medium
ENSG00000163618	CADPS	medium
ENSG00000165264	NDUFB6	medium
ENSG00000165507	DEPP1	medium
ENSG00000166165	CKB	medium
ENSG00000166275	BORCS7	medium
ENSG00000166432	ZMAT1	medium
ENSG00000166920	C15orf48	medium
ENSG00000167081	PBX3	medium
ENSG00000167515	TRAPPC2L	medium
ENSG00000168028	RPSA	medium
ENSG00000168280	KIF5C	medium
ENSG00000169213	RAB3B	medium
ENSG00000169347	GP2	medium
ENSG00000170889	RPS9	medium
ENSG00000170890	PLA2G1B	medium
ENSG00000172428	COPS9	medium
ENSG00000175334	BANF1	medium
ENSG00000177600	RPLP2	medium
ENSG00000177853	ZNF518A	medium
ENSG00000177954	RPS27	medium
ENSG00000180488	MIGA1	medium
ENSG00000181396	OGFOD3	medium
ENSG00000181704	YIPF6	medium
ENSG00000182004	SNRPE	medium
ENSG00000182473	EXOC7	medium
ENSG00000182636	NDN	medium
ENSG00000184905	TCEAL2	medium
ENSG00000185324	CDK10	medium
ENSG00000186318	BACE1	medium
ENSG00000187391	MAGI2	medium
ENSG00000187889	FYB2	medium
ENSG00000187954	CYHR1	medium
ENSG00000188846	RPL14	medium
ENSG00000196655	TRAPPC4	medium
ENSG00000197958	RPL12	medium
ENSG00000198763	ND2	medium
ENSG00000203879	GDI1	medium
ENSG00000204580	DDR1	medium
ENSG00000204842	ATXN2	medium
ENSG00000204852	TCTN1	medium
ENSG00000211459	NA	medium
ENSG00000213741	RPS29	medium
ENSG00000233493	TMEM238	medium
ENSG00000235194	PPP1R3E	medium
ENSG00000242265	PEG10	medium
ENSG00000243147	MRPL33	medium
ENSG00000244187	TMEM141	medium
ENSG00000246705	H2AJ	medium
ENSG00000248487	ABHD14A	medium
ENSG00000263753	LINC00667	medium
ENSG00000269293	ZSCAN16-AS1	medium
