IdentityGene	GeneSymbol	Level
ENSG00000001036	FUCA2	high
ENSG00000002549	LAP3	high
ENSG00000004534	RBM6	high
ENSG00000004779	NDUFAB1	high
ENSG00000005075	POLR2J	high
ENSG00000005700	IBTK	high
ENSG00000005810	MYCBP2	high
ENSG00000005893	LAMP2	high
ENSG00000006015	REX1BD	high
ENSG00000007168	PAFAH1B1	high
ENSG00000007312	CD79B	high
ENSG00000010244	ZNF207	high
ENSG00000010256	UQCRC1	high
ENSG00000013275	PSMC4	high
ENSG00000013306	SLC25A39	high
ENSG00000013375	PGM3	high
ENSG00000014123	UFL1	high
ENSG00000014641	MDH1	high
ENSG00000015413	DPEP1	high
ENSG00000017483	SLC38A5	high
ENSG00000019582	CD74	high
ENSG00000023318	ERP44	high
ENSG00000025796	SEC63	high
ENSG00000026297	RNASET2	high
ENSG00000027847	B4GALT7	high
ENSG00000028277	POU2F2	high
ENSG00000029363	BCLAF1	high
ENSG00000033170	FUT8	high
ENSG00000034713	GABARAPL2	high
ENSG00000035928	RFC1	high
ENSG00000038219	BOD1L1	high
ENSG00000041357	PSMA4	high
ENSG00000042753	AP2S1	high
ENSG00000047346	FAM214A	high
ENSG00000047410	TPR	high
ENSG00000048649	RSF1	high
ENSG00000048828	FAM120A	high
ENSG00000049656	CLPTM1L	high
ENSG00000049860	HEXB	high
ENSG00000050393	MCUR1	high
ENSG00000055044	NOP58	high
ENSG00000055609	KMT2C	high
ENSG00000058262	SEC61A1	high
ENSG00000060762	MPC1	high
ENSG00000061656	SPAG4	high
ENSG00000062582	MRPS24	high
ENSG00000063241	ISOC2	high
ENSG00000063245	EPN1	high
ENSG00000065308	TRAM2	high
ENSG00000065518	NDUFB4	high
ENSG00000065548	ZC3H15	high
ENSG00000065911	MTHFD2	high
ENSG00000067066	SP100	high
ENSG00000067225	PKM	high
ENSG00000068697	LAPTM4A	high
ENSG00000068912	ERLEC1	high
ENSG00000069275	NUCKS1	high
ENSG00000069849	ATP1B3	high
ENSG00000070010	UFD1	high
ENSG00000070423	RNF126	high
ENSG00000070540	WIPI1	high
ENSG00000071462	BUD23	high
ENSG00000071553	ATP6AP1	high
ENSG00000072135	PTPN18	high
ENSG00000072694	FCGR2B	high
ENSG00000072778	ACADVL	high
ENSG00000073849	ST6GAL1	high
ENSG00000074071	MRPS34	high
ENSG00000074370	ATP2A3	high
ENSG00000074696	HACD3	high
ENSG00000074800	ENO1	high
ENSG00000075420	FNDC3B	high
ENSG00000076043	REXO2	high
ENSG00000076108	BAZ2A	high
ENSG00000076662	ICAM3	high
ENSG00000077147	TM9SF3	high
ENSG00000077232	DNAJC10	high
ENSG00000077549	CAPZB	high
ENSG00000078596	ITM2A	high
ENSG00000078618	NRDC	high
ENSG00000078668	VDAC3	high
ENSG00000078808	SDF4	high
ENSG00000079246	XRCC5	high
ENSG00000079691	CARMIL1	high
ENSG00000079805	DNM2	high
ENSG00000081189	MEF2C	high
ENSG00000081307	UBA5	high
ENSG00000081870	HSPB11	high
ENSG00000082153	BZW1	high
ENSG00000082515	MRPL22	high
ENSG00000083457	ITGAE	high
ENSG00000083896	YTHDC1	high
ENSG00000084090	STARD7	high
ENSG00000084623	EIF3I	high
ENSG00000085719	CPNE3	high
ENSG00000086598	TMED2	high
ENSG00000087191	PSMC5	high
ENSG00000087302	RTRAF	high
ENSG00000087365	SF3B2	high
ENSG00000087502	ERGIC2	high
ENSG00000088205	DDX18	high
ENSG00000088832	FKBP1A	high
ENSG00000089006	SNX5	high
ENSG00000089053	ANAPC5	high
ENSG00000089063	TMEM230	high
ENSG00000089327	FXYD5	high
ENSG00000089597	GANAB	high
ENSG00000089693	MLF2	high
ENSG00000090263	MRPS33	high
ENSG00000090266	NDUFB2	high
ENSG00000090520	DNAJB11	high
ENSG00000090581	GNPTG	high
ENSG00000090615	GOLGA3	high
ENSG00000090861	AARS1	high
ENSG00000090863	GLG1	high
ENSG00000091164	TXNL1	high
ENSG00000091409	ITGA6	high
ENSG00000091490	SEL1L3	high
ENSG00000092010	PSME1	high
ENSG00000092108	SCFD1	high
ENSG00000092148	HECTD1	high
ENSG00000092199	HNRNPC	high
ENSG00000092621	PHGDH	high
ENSG00000092931	MFSD11	high
ENSG00000093000	NUP50	high
ENSG00000093072	ADA2	high
ENSG00000095585	BLNK	high
ENSG00000097033	SH3GLB1	high
ENSG00000099341	PSMD8	high
ENSG00000099795	NDUFB7	high
ENSG00000099797	TECR	high
ENSG00000099800	TIMM13	high
ENSG00000099817	POLR2E	high
ENSG00000099901	RANBP1	high
ENSG00000099956	SMARCB1	high
ENSG00000100129	EIF3L	high
ENSG00000100138	SNU13	high
ENSG00000100142	POLR2F	high
ENSG00000100216	TOMM22	high
ENSG00000100299	ARSA	high
ENSG00000100300	TSPO	high
ENSG00000100365	NCF4	high
ENSG00000100380	ST13	high
ENSG00000100412	ACO2	high
ENSG00000100528	CNIH1	high
ENSG00000100567	PSMA3	high
ENSG00000100612	DHRS7	high
ENSG00000100629	CEP128	high
ENSG00000100632	ERH	high
ENSG00000100804	PSMB5	high
ENSG00000100815	TRIP11	high
ENSG00000100836	PABPN1	high
ENSG00000100883	SRP54	high
ENSG00000100902	PSMA6	high
ENSG00000100911	PSME2	high
ENSG00000100979	PLTP	high
ENSG00000101057	MYBL2	high
ENSG00000101084	RAB5IF	high
ENSG00000101194	SLC17A9	high
ENSG00000101310	SEC23B	high
ENSG00000101361	NOP56	high
ENSG00000101421	CHMP4B	high
ENSG00000101557	USP14	high
ENSG00000101558	VAPA	high
ENSG00000101596	SMCHD1	high
ENSG00000102096	PIM2	high
ENSG00000102103	PQBP1	high
ENSG00000102119	EMD	high
ENSG00000102144	PGK1	high
ENSG00000102158	MAGT1	high
ENSG00000102401	ARMCX3	high
ENSG00000102531	FNDC3A	high
ENSG00000102580	DNAJC3	high
ENSG00000102879	CORO1A	high
ENSG00000103035	PSMD7	high
ENSG00000103254	ANTKMT	high
ENSG00000103266	STUB1	high
ENSG00000103275	UBE2I	high
ENSG00000103342	GSPT1	high
ENSG00000103490	PYCARD	high
ENSG00000104131	EIF3J	high
ENSG00000104325	DECR1	high
ENSG00000104388	RAB2A	high
ENSG00000104408	EIF3E	high
ENSG00000104774	MAN2B1	high
ENSG00000104805	NUCB1	high
ENSG00000104823	ECH1	high
ENSG00000104824	HNRNPL	high
ENSG00000104852	SNRNP70	high
ENSG00000104870	FCGRT	high
ENSG00000104960	PTOV1	high
ENSG00000104979	C19orf53	high
ENSG00000105185	PDCD5	high
ENSG00000105258	POLR2I	high
ENSG00000105281	SLC1A5	high
ENSG00000105379	ETFB	high
ENSG00000105401	CDC37	high
ENSG00000105518	TMEM205	high
ENSG00000105612	DNASE2	high
ENSG00000105677	TMEM147	high
ENSG00000105698	USF2	high
ENSG00000105701	FKBP8	high
ENSG00000105829	BET1	high
ENSG00000105968	H2AZ2	high
ENSG00000106028	SSBP1	high
ENSG00000106105	GARS1	high
ENSG00000106211	HSPB1	high
ENSG00000106244	PDAP1	high
ENSG00000106263	EIF3B	high
ENSG00000106355	LSM5	high
ENSG00000106399	RPA3	high
ENSG00000106400	ZNHIT1	high
ENSG00000106415	GLCCI1	high
ENSG00000106537	TSPAN13	high
ENSG00000106615	RHEB	high
ENSG00000106682	EIF4H	high
ENSG00000107036	RIC1	high
ENSG00000107099	DOCK8	high
ENSG00000108256	NUFIP2	high
ENSG00000108344	PSMD3	high
ENSG00000108424	KPNB1	high
ENSG00000108465	CDK5RAP3	high
ENSG00000108523	RNF167	high
ENSG00000108588	CCDC47	high
ENSG00000108622	ICAM2	high
ENSG00000108639	SYNGR2	high
ENSG00000108671	PSMD11	high
ENSG00000108784	NAGLU	high
ENSG00000108788	MLX	high
ENSG00000108826	MRPL27	high
ENSG00000108953	YWHAE	high
ENSG00000109046	WSB1	high
ENSG00000109062	SLC9A3R1	high
ENSG00000109083	IFT20	high
ENSG00000109180	OCIAD1	high
ENSG00000109332	UBE2D3	high
ENSG00000109390	NDUFC1	high
ENSG00000109458	GAB1	high
ENSG00000110011	DNAJC4	high
ENSG00000110321	EIF4G2	high
ENSG00000110696	C11orf58	high
ENSG00000110717	NDUFS8	high
ENSG00000110719	TCIRG1	high
ENSG00000110777	POU2AF1	high
ENSG00000110917	MLEC	high
ENSG00000111142	METAP2	high
ENSG00000111229	ARPC3	high
ENSG00000111237	VPS29	high
ENSG00000111276	CDKN1B	high
ENSG00000111481	COPZ1	high
ENSG00000111639	MRPL51	high
ENSG00000111678	C12orf57	high
ENSG00000111679	PTPN6	high
ENSG00000111716	LDHB	high
ENSG00000111843	TMEM14C	high
ENSG00000111859	NEDD9	high
ENSG00000111885	MAN1A1	high
ENSG00000112305	SMAP1	high
ENSG00000112308	C6orf62	high
ENSG00000112335	SNX3	high
ENSG00000112473	SLC39A7	high
ENSG00000112667	DNPH1	high
ENSG00000112679	DUSP22	high
ENSG00000112739	PRPF4B	high
ENSG00000112893	MAN2A1	high
ENSG00000112977	DAP	high
ENSG00000113141	IK	high
ENSG00000113282	CLINT1	high
ENSG00000113384	GOLPH3	high
ENSG00000113558	SKP1	high
ENSG00000113615	SEC24A	high
ENSG00000113621	TXNDC15	high
ENSG00000113719	ERGIC1	high
ENSG00000113742	CPEB4	high
ENSG00000113810	SMC4	high
ENSG00000114354	TFG	high
ENSG00000114686	MRPL3	high
ENSG00000114867	EIF4G1	high
ENSG00000115091	ACTR3	high
ENSG00000115128	SF3B6	high
ENSG00000115233	PSMD14	high
ENSG00000115234	SNX17	high
ENSG00000115241	PPM1G	high
ENSG00000115275	MOGS	high
ENSG00000115286	NDUFS7	high
ENSG00000115307	AUP1	high
ENSG00000115355	CCDC88A	high
ENSG00000115419	GLS	high
ENSG00000115484	CCT4	high
ENSG00000115685	PPP1R7	high
ENSG00000115760	BIRC6	high
ENSG00000115816	CEBPZ	high
ENSG00000115884	SDC1	high
ENSG00000115902	SLC1A4	high
ENSG00000115944	COX7A2L	high
ENSG00000116017	ARID3A	high
ENSG00000116459	ATP5PB	high
ENSG00000116521	SCAMP3	high
ENSG00000116539	ASH1L	high
ENSG00000116754	SRSF11	high
ENSG00000116898	MRPS15	high
ENSG00000117335	CD46	high
ENSG00000117448	AKR1A1	high
ENSG00000117500	TMED5	high
ENSG00000117614	SYF2	high
ENSG00000117632	STMN1	high
ENSG00000117691	NENF	high
ENSG00000117713	ARID1A	high
ENSG00000117859	OSBPL9	high
ENSG00000117899	MESD	high
ENSG00000118482	PHF3	high
ENSG00000118640	VAMP8	high
ENSG00000118689	FOXO3	high
ENSG00000118971	CCND2	high
ENSG00000119013	NDUFB3	high
ENSG00000119048	UBE2B	high
ENSG00000119318	RAD23B	high
ENSG00000119421	NDUFA8	high
ENSG00000119705	SLIRP	high
ENSG00000119707	RBM25	high
ENSG00000120265	PCMT1	high
ENSG00000120438	TCP1	high
ENSG00000120533	ENY2	high
ENSG00000120616	EPC1	high
ENSG00000120675	DNAJC15	high
ENSG00000120697	ALG5	high
ENSG00000120725	SIL1	high
ENSG00000120727	PAIP2	high
ENSG00000120802	TMPO	high
ENSG00000120899	PTK2B	high
ENSG00000120963	ZNF706	high
ENSG00000120992	LYPLA1	high
ENSG00000121073	SLC35B1	high
ENSG00000121774	KHDRBS1	high
ENSG00000121966	CXCR4	high
ENSG00000122034	GTF3A	high
ENSG00000122188	LAX1	high
ENSG00000122218	COPA	high
ENSG00000122359	ANXA11	high
ENSG00000122884	P4HA1	high
ENSG00000123104	ITPR2	high
ENSG00000123131	PRDX4	high
ENSG00000123136	DDX39A	high
ENSG00000123144	TRIR	high
ENSG00000123352	SPATS2	high
ENSG00000123353	ORMDL2	high
ENSG00000123416	TUBA1B	high
ENSG00000123562	MORF4L2	high
ENSG00000123989	CHPF	high
ENSG00000124155	PIGT	high
ENSG00000124256	ZBP1	high
ENSG00000124370	MCEE	high
ENSG00000124383	MPHOSPH10	high
ENSG00000124575	H1-3	high
ENSG00000124767	GLO1	high
ENSG00000124772	CPNE5	high
ENSG00000124783	SSR1	high
ENSG00000125304	TM9SF2	high
ENSG00000125445	MRPS7	high
ENSG00000125651	GTF2F1	high
ENSG00000125656	CLPP	high
ENSG00000125835	SNRPB	high
ENSG00000125863	MKKS	high
ENSG00000125870	SNRPB2	high
ENSG00000125912	NCLN	high
ENSG00000125944	HNRNPR	high
ENSG00000125970	RALY	high
ENSG00000125971	DYNLRB1	high
ENSG00000125995	ROMO1	high
ENSG00000126067	PSMB2	high
ENSG00000126246	IGFLR1	high
ENSG00000126247	CAPNS1	high
ENSG00000126457	PRMT1	high
ENSG00000126698	DNAJC8	high
ENSG00000126756	UXT	high
ENSG00000126777	KTN1	high
ENSG00000127022	CANX	high
ENSG00000127483	HP1BP3	high
ENSG00000127540	UQCR11	high
ENSG00000127774	EMC6	high
ENSG00000127884	ECHS1	high
ENSG00000127922	SEM1	high
ENSG00000128294	TPST2	high
ENSG00000128340	RAC2	high
ENSG00000128463	EMC4	high
ENSG00000128524	ATP6V1F	high
ENSG00000128534	LSM8	high
ENSG00000128595	CALU	high
ENSG00000128626	MRPS12	high
ENSG00000128699	ORMDL1	high
ENSG00000128739	SNRPN	high
ENSG00000128951	DUT	high
ENSG00000129071	MBD4	high
ENSG00000129235	TXNDC17	high
ENSG00000129292	PHF20L1	high
ENSG00000129351	ILF3	high
ENSG00000129534	MIS18BP1	high
ENSG00000129559	NEDD8	high
ENSG00000129657	SEC14L1	high
ENSG00000130312	MRPL34	high
ENSG00000130429	ARPC1B	high
ENSG00000130520	LSM4	high
ENSG00000130592	LSP1	high
ENSG00000130706	ADRM1	high
ENSG00000130724	CHMP2A	high
ENSG00000130725	UBE2M	high
ENSG00000130726	TRIM28	high
ENSG00000130733	YIPF2	high
ENSG00000130748	TMEM160	high
ENSG00000130985	UBA1	high
ENSG00000131002	TXLNGY	high
ENSG00000131116	ZNF428	high
ENSG00000131174	COX7B	high
ENSG00000131236	CAP1	high
ENSG00000131446	MGAT1	high
ENSG00000131495	NDUFA2	high
ENSG00000131508	UBE2D2	high
ENSG00000132341	RAN	high
ENSG00000132388	UBE2G1	high
ENSG00000132465	JCHAIN	high
ENSG00000132485	ZRANB2	high
ENSG00000132676	DAP3	high
ENSG00000132824	SERINC3	high
ENSG00000132963	POMP	high
ENSG00000133103	COG6	high
ENSG00000133226	SRRM1	high
ENSG00000133318	RTN3	high
ENSG00000133703	KRAS	high
ENSG00000133983	COX16	high
ENSG00000134046	MBD2	high
ENSG00000134056	MRPS36	high
ENSG00000134109	EDEM1	high
ENSG00000134153	EMC7	high
ENSG00000134248	LAMTOR5	high
ENSG00000134308	YWHAQ	high
ENSG00000134352	IL6ST	high
ENSG00000134375	TIMM17A	high
ENSG00000134884	ARGLU1	high
ENSG00000134910	STT3A	high
ENSG00000135069	PSAT1	high
ENSG00000135090	TAOK3	high
ENSG00000135316	SYNCRIP	high
ENSG00000135506	OS9	high
ENSG00000135624	CCT7	high
ENSG00000135679	MDM2	high
ENSG00000135837	CEP350	high
ENSG00000136026	CKAP4	high
ENSG00000136100	VPS36	high
ENSG00000136104	RNASEH2B	high
ENSG00000136238	RAC1	high
ENSG00000136527	TRA2B	high
ENSG00000136628	EPRS1	high
ENSG00000136709	WDR33	high
ENSG00000136718	IMP4	high
ENSG00000136840	ST6GALNAC4	high
ENSG00000136888	ATP6V1G1	high
ENSG00000136908	DPM2	high
ENSG00000136930	PSMB7	high
ENSG00000136938	ANP32B	high
ENSG00000136950	ARPC5L	high
ENSG00000136986	DERL1	high
ENSG00000136997	MYC	high
ENSG00000137076	TLN1	high
ENSG00000137133	HINT2	high
ENSG00000137161	CNPY3	high
ENSG00000137207	YIPF3	high
ENSG00000137288	UQCC2	high
ENSG00000137309	HMGA1	high
ENSG00000137504	CREBZF	high
ENSG00000137509	PRCP	high
ENSG00000137563	GGH	high
ENSG00000137714	FDX1	high
ENSG00000137776	SLTM	high
ENSG00000137815	RTF1	high
ENSG00000137845	ADAM10	high
ENSG00000137876	RSL24D1	high
ENSG00000138069	RAB1A	high
ENSG00000138073	PREB	high
ENSG00000138279	ANXA7	high
ENSG00000138382	METTL5	high
ENSG00000138385	SSB	high
ENSG00000138398	PPIG	high
ENSG00000138433	CIR1	high
ENSG00000138495	COX17	high
ENSG00000138668	HNRNPD	high
ENSG00000138674	SEC31A	high
ENSG00000138709	LARP1B	high
ENSG00000138760	SCARB2	high
ENSG00000138801	PAPSS1	high
ENSG00000139168	ZCRB1	high
ENSG00000139193	CD27	high
ENSG00000139218	SCAF11	high
ENSG00000139343	SNRPF	high
ENSG00000139687	RB1	high
ENSG00000139722	VPS37B	high
ENSG00000139793	MBNL2	high
ENSG00000140307	GTF2A2	high
ENSG00000140391	TSPAN3	high
ENSG00000140612	SEC11A	high
ENSG00000140990	NDUFB10	high
ENSG00000141002	TCF25	high
ENSG00000141367	CLTC	high
ENSG00000141522	ARHGDIA	high
ENSG00000141552	ANAPC11	high
ENSG00000141867	BRD4	high
ENSG00000142168	SOD1	high
ENSG00000142684	ZNF593	high
ENSG00000142765	SYTL1	high
ENSG00000143013	LMO4	high
ENSG00000143183	TMCO1	high
ENSG00000143252	SDHC	high
ENSG00000143256	PFDN2	high
ENSG00000143401	ANP32E	high
ENSG00000143420	ENSA	high
ENSG00000143549	TPM3	high
ENSG00000143641	GALNT2	high
ENSG00000143727	ACP1	high
ENSG00000143742	SRP9	high
ENSG00000143799	PARP1	high
ENSG00000143878	RHOB	high
ENSG00000143977	SNRPG	high
ENSG00000144224	UBXN4	high
ENSG00000144591	GMPPA	high
ENSG00000144747	TMF1	high
ENSG00000144815	NXPE3	high
ENSG00000144848	ATG3	high
ENSG00000144867	SRPRB	high
ENSG00000144895	EIF2A	high
ENSG00000145088	EAF2	high
ENSG00000145241	CENPC	high
ENSG00000145354	CISD2	high
ENSG00000145494	NDUFS6	high
ENSG00000145833	DDX46	high
ENSG00000145912	NHP2	high
ENSG00000146066	HIGD2A	high
ENSG00000146223	RPL7L1	high
ENSG00000146247	PHIP	high
ENSG00000146386	ABRACL	high
ENSG00000146416	AIG1	high
ENSG00000146540	C7orf50	high
ENSG00000146701	MDH2	high
ENSG00000146731	CCT6A	high
ENSG00000147140	NONO	high
ENSG00000147162	OGT	high
ENSG00000147274	RBMX	high
ENSG00000147548	NSD3	high
ENSG00000147654	EBAG9	high
ENSG00000147684	NDUFB9	high
ENSG00000147996	CBWD5	high
ENSG00000148248	SURF4	high
ENSG00000148290	SURF1	high
ENSG00000148444	COMMD3	high
ENSG00000148773	MKI67	high
ENSG00000149100	EIF3M	high
ENSG00000149428	HYOU1	high
ENSG00000149925	ALDOA	high
ENSG00000149932	TMEM219	high
ENSG00000150593	PDCD4	high
ENSG00000150779	TIMM8B	high
ENSG00000150961	SEC24D	high
ENSG00000151092	NGLY1	high
ENSG00000151131	C12orf45	high
ENSG00000151135	TMEM263	high
ENSG00000151327	FAM177A1	high
ENSG00000151327	LOC101927178	high
ENSG00000151366	NDUFC2	high
ENSG00000151729	SLC25A4	high
ENSG00000151923	TIAL1	high
ENSG00000152078	TLCD4	high
ENSG00000152256	PDK1	high
ENSG00000152291	TGOLN2	high
ENSG00000152700	SAR1B	high
ENSG00000152795	HNRNPDL	high
ENSG00000153037	SRP19	high
ENSG00000153147	SMARCA5	high
ENSG00000153208	MERTK	high
ENSG00000153789	CIBAR2	high
ENSG00000153914	SREK1	high
ENSG00000154237	LRRK1	high
ENSG00000154305	MIA3	high
ENSG00000154473	BUB3	high
ENSG00000154518	ATP5MC3	high
ENSG00000154582	ELOC	high
ENSG00000154589	LY96	high
ENSG00000154978	VOPP1	high
ENSG00000155096	AZIN1	high
ENSG00000155304	HSPA13	high
ENSG00000155465	SLC7A7	high
ENSG00000155660	PDIA4	high
ENSG00000155957	TMBIM4	high
ENSG00000156256	USP16	high
ENSG00000156261	CCT8	high
ENSG00000156976	EIF4A2	high
ENSG00000157020	SEC13	high
ENSG00000157637	SLC38A10	high
ENSG00000157916	RER1	high
ENSG00000158850	B4GALT3	high
ENSG00000158985	CDC42SE2	high
ENSG00000159069	FBXW5	high
ENSG00000159110	IFNAR2	high
ENSG00000159128	IFNGR2	high
ENSG00000159199	ATP5MC1	high
ENSG00000159346	ADIPOR1	high
ENSG00000159352	PSMD4	high
ENSG00000159377	PSMB4	high
ENSG00000159692	CTBP1	high
ENSG00000159720	ATP6V0D1	high
ENSG00000160014	CALM3	high
ENSG00000160075	SSU72	high
ENSG00000160194	NDUFV3	high
ENSG00000160209	PDXK	high
ENSG00000160209	LOC105372824	high
ENSG00000160710	ADAR	high
ENSG00000160714	UBE2Q1	high
ENSG00000160752	FDPS	high
ENSG00000160888	IER2	high
ENSG00000160948	VPS28	high
ENSG00000161981	SNRNP25	high
ENSG00000162298	SYVN1	high
ENSG00000162368	CMPK1	high
ENSG00000162511	LAPTM5	high
ENSG00000162521	RBBP4	high
ENSG00000162704	ARPC5	high
ENSG00000162909	CAPN2	high
ENSG00000162910	MRPL55	high
ENSG00000162980	ARL5A	high
ENSG00000163220	S100A9	high
ENSG00000163382	NAXE	high
ENSG00000163399	ATP1A1	high
ENSG00000163463	KRTCAP2	high
ENSG00000163468	CCT3	high
ENSG00000163527	STT3B	high
ENSG00000163644	PPM1K	high
ENSG00000163714	U2SURP	high
ENSG00000163902	RPN1	high
ENSG00000163938	GNL3	high
ENSG00000163939	PBRM1	high
ENSG00000163956	LRPAP1	high
ENSG00000164032	H2AZ1	high
ENSG00000164040	PGRMC2	high
ENSG00000164104	HMGB2	high
ENSG00000164111	ANXA5	high
ENSG00000164305	CASP3	high
ENSG00000164308	ERAP2	high
ENSG00000164346	NSA2	high
ENSG00000164548	TRA2A	high
ENSG00000164754	RAD21	high
ENSG00000164932	CTHRC1	high
ENSG00000165025	SYK	high
ENSG00000165264	NDUFB6	high
ENSG00000165272	AQP3	high
ENSG00000165280	VCP	high
ENSG00000165283	STOML2	high
ENSG00000165417	GTF2A1	high
ENSG00000165629	ATP5F1C	high
ENSG00000165637	VDAC2	high
ENSG00000165644	COMTD1	high
ENSG00000165669	FAM204A	high
ENSG00000165672	PRDX3	high
ENSG00000165678	GHITM	high
ENSG00000165732	DDX21	high
ENSG00000165775	FUNDC2	high
ENSG00000165813	CCDC186	high
ENSG00000165916	PSMC3	high
ENSG00000166012	TAF1D	high
ENSG00000166130	IKBIP	high
ENSG00000166136	NDUFB8	high
ENSG00000166164	BRD7	high
ENSG00000166197	NOLC1	high
ENSG00000166228	PCBD1	high
ENSG00000166337	TAF10	high
ENSG00000166797	CIAO2A	high
ENSG00000166848	TERF2IP	high
ENSG00000166848	LOC105371348	high
ENSG00000166902	MRPL16	high
ENSG00000166986	MARS1	high
ENSG00000167077	MEI1	high
ENSG00000167085	PHB	high
ENSG00000167088	SNRPD1	high
ENSG00000167110	GOLGA2	high
ENSG00000167113	COQ4	high
ENSG00000167461	RAB8A	high
ENSG00000167476	JSRP1	high
ENSG00000167476	LOC105372240	high
ENSG00000167615	LENG8	high
ENSG00000167642	SPINT2	high
ENSG00000167645	YIF1B	high
ENSG00000167700	MFSD3	high
ENSG00000167775	CD320	high
ENSG00000167792	NDUFV1	high
ENSG00000167797	CDK2AP2	high
ENSG00000167863	ATP5PD	high
ENSG00000167881	SRP68	high
ENSG00000167969	ECI1	high
ENSG00000167986	DDB1	high
ENSG00000168081	PNOC	high
ENSG00000168090	COPS6	high
ENSG00000168209	DDIT4	high
ENSG00000168259	DNAJC7	high
ENSG00000168264	IRF2BP2	high
ENSG00000168268	NT5DC2	high
ENSG00000168283	BMI1	high
ENSG00000168288	MMADHC	high
ENSG00000168298	H1-4	high
ENSG00000168300	PCMTD1	high
ENSG00000168385	SEPTIN2	high
ENSG00000168404	MLKL	high
ENSG00000168447	SCNN1B	high
ENSG00000168653	NDUFS5	high
ENSG00000168701	TMEM208	high
ENSG00000168894	RNF181	high
ENSG00000169021	UQCRFS1	high
ENSG00000169413	RNASE6	high
ENSG00000169504	CLIC4	high
ENSG00000169564	PCBP1	high
ENSG00000169696	ASPSCR1	high
ENSG00000169718	DUS1L	high
ENSG00000169738	DCXR	high
ENSG00000169919	GUSB	high
ENSG00000169926	KLF13	high
ENSG00000169976	SF3B5	high
ENSG00000170035	UBE2E3	high
ENSG00000170043	TRAPPC1	high
ENSG00000170296	GABARAP	high
ENSG00000170456	DENND5B	high
ENSG00000170791	CHCHD7	high
ENSG00000170860	LSM3	high
ENSG00000170906	NDUFA3	high
ENSG00000171067	C11orf24	high
ENSG00000171159	C9orf16	high
ENSG00000171222	SCAND1	high
ENSG00000171421	MRPL36	high
ENSG00000171490	RSL1D1	high
ENSG00000171530	TBCA	high
ENSG00000171604	CXXC5	high
ENSG00000171634	BPTF	high
ENSG00000172354	GNB2	high
ENSG00000172428	COPS9	high
ENSG00000172531	PPP1CA	high
ENSG00000172534	HCFC1	high
ENSG00000172578	KLHL6	high
ENSG00000172586	CHCHD1	high
ENSG00000172590	MRPL52	high
ENSG00000172725	CORO1B	high
ENSG00000172922	RNASEH2C	high
ENSG00000173113	TRMT112	high
ENSG00000173120	KDM2A	high
ENSG00000173141	MRPL57	high
ENSG00000173272	MZT2A	high
ENSG00000173334	TRIB1	high
ENSG00000173436	MICOS10	high
ENSG00000173457	PPP1R14B	high
ENSG00000173465	ZNRD2	high
ENSG00000173486	FKBP2	high
ENSG00000173540	GMPPB	high
ENSG00000173692	PSMD1	high
ENSG00000173915	ATP5MD	high
ENSG00000174021	GNG5	high
ENSG00000174231	PRPF8	high
ENSG00000174718	RESF1	high
ENSG00000174780	SRP72	high
ENSG00000174886	NDUFA11	high
ENSG00000174917	MICOS13	high
ENSG00000175203	DCTN2	high
ENSG00000175334	BANF1	high
ENSG00000175354	PTPN2	high
ENSG00000175482	POLD4	high
ENSG00000175550	DRAP1	high
ENSG00000175602	CCDC85B	high
ENSG00000175634	RPS6KB2	high
ENSG00000175756	AURKAIP1	high
ENSG00000175768	TOMM5	high
ENSG00000175826	CTDNEP1	high
ENSG00000176101	SSNA1	high
ENSG00000176142	TMEM39A	high
ENSG00000176261	ZBTB8OS	high
ENSG00000176533	GNG7	high
ENSG00000176731	RBIS	high
ENSG00000176978	DPP7	high
ENSG00000177556	ATOX1	high
ENSG00000177685	CRACR2B	high
ENSG00000177879	AP3S1	high
ENSG00000177885	GRB2	high
ENSG00000177951	BET1L	high
ENSG00000177989	ODF3B	high
ENSG00000178927	CYBC1	high
ENSG00000178980	SELENOW	high
ENSG00000179085	DPM3	high
ENSG00000179091	CYC1	high
ENSG00000179222	MAGED1	high
ENSG00000179271	GADD45GIP1	high
ENSG00000180096	SEPTIN1	high
ENSG00000180353	HCLS1	high
ENSG00000180370	PAK2	high
ENSG00000180398	MCFD2	high
ENSG00000180817	PPA1	high
ENSG00000181789	COPG1	high
ENSG00000181817	LSM10	high
ENSG00000182004	SNRPE	high
ENSG00000182022	CHST15	high
ENSG00000182054	IDH2	high
ENSG00000182087	TMEM259	high
ENSG00000182117	NOP10	high
ENSG00000182154	MRPL41	high
ENSG00000182196	ARL6IP4	high
ENSG00000182199	SHMT2	high
ENSG00000182551	ADI1	high
ENSG00000182670	TTC3	high
ENSG00000182923	CEP63	high
ENSG00000182934	SRPRA	high
ENSG00000182944	EWSR1	high
ENSG00000182985	CADM1	high
ENSG00000183011	NAA38	high
ENSG00000183087	GAS6	high
ENSG00000183283	DAZAP2	high
ENSG00000183291	SELENOF	high
ENSG00000183617	MRPL54	high
ENSG00000183648	NDUFB1	high
ENSG00000183684	ALYREF	high
ENSG00000183726	TMEM50A	high
ENSG00000183978	COA3	high
ENSG00000184007	PTP4A2	high
ENSG00000184076	UQCR10	high
ENSG00000184216	IRAK1	high
ENSG00000184432	COPB2	high
ENSG00000184752	NDUFA12	high
ENSG00000184863	RBM33	high
ENSG00000184983	NDUFA6	high
ENSG00000185475	TMEM179B	high
ENSG00000185608	MRPL40	high
ENSG00000185627	PSMD13	high
ENSG00000185651	UBE2L3	high
ENSG00000185825	BCAP31	high
ENSG00000185883	ATP6V0C	high
ENSG00000185885	IFITM1	high
ENSG00000186010	NDUFA13	high
ENSG00000186298	PPP1CC	high
ENSG00000186891	TNFRSF18	high
ENSG00000187051	RPS19BP1	high
ENSG00000187555	USP7	high
ENSG00000187735	TCEA1	high
ENSG00000187742	SECISBP2	high
ENSG00000188186	LAMTOR4	high
ENSG00000188486	H2AX	high
ENSG00000188529	SRSF10	high
ENSG00000188677	PARVB	high
ENSG00000189159	JPT1	high
ENSG00000196230	TUBB	high
ENSG00000196396	PTPN1	high
ENSG00000196419	XRCC6	high
ENSG00000196504	PRPF40A	high
ENSG00000196684	HSH2D	high
ENSG00000196781	TLE1	high
ENSG00000196787	H2AC11	high
ENSG00000196912	ANKRD36B	high
ENSG00000196998	WDR45	high
ENSG00000197006	METTL9	high
ENSG00000197043	ANXA6	high
ENSG00000197111	PCBP2	high
ENSG00000197157	SND1	high
ENSG00000197170	PSMD12	high
ENSG00000197324	LRP10	high
ENSG00000197345	MRPL21	high
ENSG00000197448	GSTK1	high
ENSG00000197451	HNRNPAB	high
ENSG00000197728	RPS26	high
ENSG00000197858	GPAA1	high
ENSG00000197903	H2BC12	high
ENSG00000197943	PLCG2	high
ENSG00000198162	MAN1A2	high
ENSG00000198171	DDRGK1	high
ENSG00000198258	UBL5	high
ENSG00000198380	GFPT1	high
ENSG00000198408	OGA	high
ENSG00000198498	TMA16	high
ENSG00000198586	TLK1	high
ENSG00000198625	MDM4	high
ENSG00000198695	ND6	high
ENSG00000198771	RCSD1	high
ENSG00000198818	SFT2D1	high
ENSG00000198830	HMGN2	high
ENSG00000198833	UBE2J1	high
ENSG00000198898	CAPZA2	high
ENSG00000198937	CCDC167	high
ENSG00000199568	RNU5A-1	high
ENSG00000203814	H2BC18	high
ENSG00000203896	LIME1	high
ENSG00000204120	GIGYF2	high
ENSG00000204228	HSD17B8	high
ENSG00000204257	HLA-DMA	high
ENSG00000204264	PSMB8	high
ENSG00000204386	NEU1	high
ENSG00000204388	HSPA1B	high
ENSG00000204389	HSPA1A	high
ENSG00000204392	LSM2	high
ENSG00000204435	CSNK2B	high
ENSG00000204574	ABCF1	high
ENSG00000205155	PSENEN	high
ENSG00000205220	PSMB10	high
ENSG00000205544	TMEM256	high
ENSG00000205937	RNPS1	high
ENSG00000211450	SELENOH	high
ENSG00000211598	IGKV4-1	high
ENSG00000211640	IGLV6-57	high
ENSG00000211673	NA	high
ENSG00000211679	IGLC3	high
ENSG00000211890	IGHA2	high
ENSG00000211892	IGHG4	high
ENSG00000211893	IGHG2	high
ENSG00000211895	IGHA1	high
ENSG00000211896	IGHG1	high
ENSG00000211897	IGHG3	high
ENSG00000211949	IGHV3-23	high
ENSG00000212907	ND4L	high
ENSG00000213015	ZNF580	high
ENSG00000213246	SUPT4H1	high
ENSG00000213402	PTPRCAP	high
ENSG00000213523	SRA1	high
ENSG00000213619	NDUFS3	high
ENSG00000213923	CSNK1E	high
ENSG00000214026	MRPL23	high
ENSG00000214026	LOC107987373	high
ENSG00000214046	SMIM7	high
ENSG00000214160	ALG3	high
ENSG00000214253	FIS1	high
ENSG00000215021	PHB2	high
ENSG00000215845	TSTD1	high
ENSG00000217555	CKLF	high
ENSG00000219200	RNASEK	high
ENSG00000220205	VAMP2	high
ENSG00000221978	CCNL2	high
ENSG00000225205	NA	high
ENSG00000225921	NOL7	high
ENSG00000226471	NA	high
ENSG00000226752	CUTALP	high
ENSG00000226950	DANCR	high
ENSG00000228253	ATP8	high
ENSG00000228300	FAM174C	high
ENSG00000229833	PET100	high
ENSG00000230202	NA	high
ENSG00000231925	TAPBP	high
ENSG00000232119	MCTS1	high
ENSG00000232388	SMIM26	high
ENSG00000239713	APOBEC3G	high
ENSG00000239855	IGKV1-6	high
ENSG00000239951	IGKV3-20	high
ENSG00000240972	MIF	high
ENSG00000241106	HLA-DOB	high
ENSG00000241343	RPL36A	high
ENSG00000241837	ATP5PO	high
ENSG00000242247	ARFGAP3	high
ENSG00000242485	MRPL20	high
ENSG00000243147	MRPL33	high
ENSG00000243449	C4orf48	high
ENSG00000243466	IGKV1-5	high
ENSG00000243678	NME2	high
ENSG00000244313	NA	high
ENSG00000244398	RPL36AP37	high
ENSG00000244509	APOBEC3C	high
ENSG00000244716	NA	high
ENSG00000244754	N4BP2L2	high
ENSG00000245910	SNHG6	high
ENSG00000246705	H2AJ	high
ENSG00000247774	PCED1B-AS1	high
ENSG00000253729	PRKDC	high
ENSG00000254772	EEF1G	high
ENSG00000255302	EID1	high
ENSG00000257727	CNPY2	high
ENSG00000258572	NA	high
ENSG00000259772	LOC283710	high
ENSG00000260032	NORAD	high
ENSG00000260916	CCPG1	high
ENSG00000261371	PECAM1	high
ENSG00000263934	NA	high
ENSG00000265241	RBM8A	high
ENSG00000265681	RPL17	high
ENSG00000265808	SEC22B	high
ENSG00000266472	MRPS21	high
ENSG00000267809	NA	high
ENSG00000268027	NA	high
ENSG00000272888	NA	high
ENSG00000273149	NA	high
ENSG00000275066	SYNRG	high
ENSG00000277224	H2BC7	high
ENSG00000277791	PSMB3	high
ENSG00000282988	NA	high
ENSG00000283041	LOC729998	high
ENSG00000004059	ARF5	medium
ENSG00000014216	CAPN1	medium
ENSG00000016864	GLT8D1	medium
ENSG00000035141	FAM136A	medium
ENSG00000037241	RPL26L1	medium
ENSG00000049449	RCN1	medium
ENSG00000050426	LETMD1	medium
ENSG00000051108	HERPUD1	medium
ENSG00000054282	SDCCAG8	medium
ENSG00000065882	TBC1D1	medium
ENSG00000066117	SMARCD1	medium
ENSG00000067704	IARS2	medium
ENSG00000071082	RPL31	medium
ENSG00000072756	TRNT1	medium
ENSG00000078177	N4BP2	medium
ENSG00000084207	GSTP1	medium
ENSG00000085063	CD59	medium
ENSG00000089009	RPL6	medium
ENSG00000089157	RPLP0	medium
ENSG00000089351	GRAMD1A	medium
ENSG00000092841	MYL6	medium
ENSG00000095139	ARCN1	medium
ENSG00000099246	RAB18	medium
ENSG00000099958	DERL3	medium
ENSG00000099995	SF3A1	medium
ENSG00000100364	KIAA0930	medium
ENSG00000100422	CERK	medium
ENSG00000100865	CINP	medium
ENSG00000100941	PNN	medium
ENSG00000102181	CD99L2	medium
ENSG00000102317	RBM3	medium
ENSG00000102871	TRADD	medium
ENSG00000102898	NUTF2	medium
ENSG00000102978	POLR2C	medium
ENSG00000103194	USP10	medium
ENSG00000103202	NME4	medium
ENSG00000103769	RAB11A	medium
ENSG00000104549	SQLE	medium
ENSG00000104980	TIMM44	medium
ENSG00000105364	MRPL4	medium
ENSG00000105699	LSR	medium
ENSG00000105700	KXD1	medium
ENSG00000107438	PDLIM1	medium
ENSG00000109475	RPL34	medium
ENSG00000110344	UBE4A	medium
ENSG00000111203	ITFG2	medium
ENSG00000112200	ZNF451	medium
ENSG00000112237	CCNC	medium
ENSG00000112651	MRPL2	medium
ENSG00000114395	CYB561D2	medium
ENSG00000115446	UNC50	medium
ENSG00000116001	TIA1	medium
ENSG00000116157	GPX7	medium
ENSG00000116161	CACYBP	medium
ENSG00000116191	RALGPS2	medium
ENSG00000116209	TMEM59	medium
ENSG00000116857	TMEM9	medium
ENSG00000118363	SPCS2	medium
ENSG00000118855	MFSD1	medium
ENSG00000121807	CCR2	medium
ENSG00000122026	RPL21	medium
ENSG00000122565	CBX3	medium
ENSG00000123064	DDX54	medium
ENSG00000123395	ATG101	medium
ENSG00000123636	BAZ2B	medium
ENSG00000124209	RAB22A	medium
ENSG00000124357	NAGK	medium
ENSG00000124635	H2BC11	medium
ENSG00000125352	RNF113A	medium
ENSG00000125611	CHCHD5	medium
ENSG00000128228	SDF2L1	medium
ENSG00000129084	PSMA1	medium
ENSG00000130921	C12orf65	medium
ENSG00000131148	EMC8	medium
ENSG00000131375	CAPN7	medium
ENSG00000131558	EXOC4	medium
ENSG00000131584	ACAP3	medium
ENSG00000132463	GRSF1	medium
ENSG00000132661	NXT1	medium
ENSG00000132704	FCRL2	medium
ENSG00000132716	DCAF8	medium
ENSG00000132780	NASP	medium
ENSG00000133935	ERG28	medium
ENSG00000134285	FKBP11	medium
ENSG00000134748	PRPF38A	medium
ENSG00000134996	OSTF1	medium
ENSG00000135185	TMEM243	medium
ENSG00000135829	DHX9	medium
ENSG00000135930	EIF4E2	medium
ENSG00000136758	YME1L1	medium
ENSG00000136874	STX17	medium
ENSG00000137106	GRHPR	medium
ENSG00000138600	SPPL2A	medium
ENSG00000138621	PPCDC	medium
ENSG00000139192	TAPBPL	medium
ENSG00000139697	SBNO1	medium
ENSG00000141295	SCRN2	medium
ENSG00000142867	BCL10	medium
ENSG00000143106	PSMA5	medium
ENSG00000143870	PDIA6	medium
ENSG00000144567	RETREG2	medium
ENSG00000146729	NIPSNAP2	medium
ENSG00000147905	ZCCHC7	medium
ENSG00000148154	UGCG	medium
ENSG00000148303	RPL7A	medium
ENSG00000156171	DRAM2	medium
ENSG00000159228	CBR1	medium
ENSG00000159388	BTG2	medium
ENSG00000160058	BSDC1	medium
ENSG00000160932	LY6E	medium
ENSG00000161091	MFSD12	medium
ENSG00000161677	JOSD2	medium
ENSG00000161970	RPL26	medium
ENSG00000162613	FUBP1	medium
ENSG00000162642	C1orf52	medium
ENSG00000163479	SSR2	medium
ENSG00000163597	SNHG16	medium
ENSG00000164244	PRRC1	medium
ENSG00000164587	RPS14	medium
ENSG00000164897	TMUB1	medium
ENSG00000165512	ZNF22	medium
ENSG00000166441	RPL27A	medium
ENSG00000166471	TMEM41B	medium
ENSG00000166595	CIAO2B	medium
ENSG00000166598	HSP90B1	medium
ENSG00000166669	ATF7IP2	medium
ENSG00000166710	B2M	medium
ENSG00000167526	RPL13	medium
ENSG00000168028	RPSA	medium
ENSG00000169228	RAB24	medium
ENSG00000169627	BOLA2	medium
ENSG00000169627	BOLA2B	medium
ENSG00000170315	UBB	medium
ENSG00000170634	ACYP2	medium
ENSG00000171311	EXOSC1	medium
ENSG00000171314	PGAM1	medium
ENSG00000171988	JMJD1C	medium
ENSG00000172493	AFF1	medium
ENSG00000172613	RAD9A	medium
ENSG00000172663	TMEM134	medium
ENSG00000173418	NAA20	medium
ENSG00000173715	C11orf80	medium
ENSG00000173905	GOLIM4	medium
ENSG00000173933	RBM4	medium
ENSG00000173992	CCS	medium
ENSG00000174173	TRMT10C	medium
ENSG00000176454	LPCAT4	medium
ENSG00000177383	MAGEF1	medium
ENSG00000177683	THAP5	medium
ENSG00000178057	NDUFAF3	medium
ENSG00000178719	GRINA	medium
ENSG00000180957	PITPNB	medium
ENSG00000181396	OGFOD3	medium
ENSG00000182149	IST1	medium
ENSG00000183255	PTTG1IP	medium
ENSG00000183605	SFXN4	medium
ENSG00000184009	ACTG1	medium
ENSG00000185122	HSF1	medium
ENSG00000185187	SIGIRR	medium
ENSG00000185946	RNPC3	medium
ENSG00000187257	RSBN1L	medium
ENSG00000188938	FAM120AOS	medium
ENSG00000188976	NOC2L	medium
ENSG00000189180	ZNF33A	medium
ENSG00000196636	SDHAF3	medium
ENSG00000196704	AMZ2	medium
ENSG00000197498	RPF2	medium
ENSG00000197536	NA	medium
ENSG00000198663	C6orf89	medium
ENSG00000198721	ECI2	medium
ENSG00000198740	ZNF652	medium
ENSG00000198855	FICD	medium
ENSG00000198888	ND1	medium
ENSG00000204261	PSMB8-AS1	medium
ENSG00000204308	RNF5	medium
ENSG00000204569	PPP1R10	medium
ENSG00000204922	UQCC3	medium
ENSG00000205593	DENND6B	medium
ENSG00000213339	QTRT1	medium
ENSG00000213366	GSTM2	medium
ENSG00000213593	TMX2	medium
ENSG00000223705	NSUN5P1	medium
ENSG00000223745	NA	medium
ENSG00000224220	NA	medium
ENSG00000225470	JPX	medium
ENSG00000229807	XIST	medium
ENSG00000235750	KIAA0040	medium
ENSG00000239779	WBP1	medium
ENSG00000241370	RPP21	medium
ENSG00000241370	TRIM39-RPP21	medium
ENSG00000251562	MALAT1	medium
ENSG00000253352	TUG1	medium
ENSG00000253738	OTUD6B-AS1	medium
ENSG00000282458	WASH5P	medium
