IdentityGene	GeneSymbol	Level
ENSG00000000971	CFH	high
ENSG00000002933	TMEM176A	high
ENSG00000003989	SLC7A2	high
ENSG00000004779	NDUFAB1	high
ENSG00000005022	SLC25A5	high
ENSG00000006042	TMEM98	high
ENSG00000008018	PSMB1	high
ENSG00000008282	SYPL1	high
ENSG00000008394	MGST1	high
ENSG00000008952	SEC62	high
ENSG00000008988	RPS20	high
ENSG00000009307	CSDE1	high
ENSG00000010278	CD9	high
ENSG00000011422	PLAUR	high
ENSG00000012171	SEMA3B	high
ENSG00000013583	HEBP1	high
ENSG00000014641	MDH1	high
ENSG00000017797	RALBP1	high
ENSG00000022267	FHL1	high
ENSG00000023191	RNH1	high
ENSG00000026025	VIM	high
ENSG00000029363	BCLAF1	high
ENSG00000030582	GRN	high
ENSG00000031698	SARS1	high
ENSG00000034510	TMSB10	high
ENSG00000035862	TIMP2	high
ENSG00000041357	PSMA4	high
ENSG00000047410	TPR	high
ENSG00000047849	MAP4	high
ENSG00000048649	RSF1	high
ENSG00000048740	CELF2	high
ENSG00000049239	H6PD	high
ENSG00000050405	LIMA1	high
ENSG00000051108	HERPUD1	high
ENSG00000051523	CYBA	high
ENSG00000054148	PHPT1	high
ENSG00000054267	ARID4B	high
ENSG00000054654	SYNE2	high
ENSG00000057608	GDI2	high
ENSG00000058668	ATP2B4	high
ENSG00000060138	YBX3	high
ENSG00000063046	EIF4B	high
ENSG00000063177	RPL18	high
ENSG00000064115	TM7SF3	high
ENSG00000065154	OAT	high
ENSG00000065518	NDUFB4	high
ENSG00000065548	ZC3H15	high
ENSG00000065809	FAM107B	high
ENSG00000065978	YBX1	high
ENSG00000067082	KLF6	high
ENSG00000067167	TRAM1	high
ENSG00000067182	TNFRSF1A	high
ENSG00000067208	EVI5	high
ENSG00000067225	PKM	high
ENSG00000067560	RHOA	high
ENSG00000068697	LAPTM4A	high
ENSG00000069275	NUCKS1	high
ENSG00000070081	NUCB2	high
ENSG00000070756	PABPC1	high
ENSG00000070831	CDC42	high
ENSG00000070961	ATP2B1	high
ENSG00000071082	RPL31	high
ENSG00000071967	CYBRD1	high
ENSG00000072274	TFRC	high
ENSG00000072778	ACADVL	high
ENSG00000074071	MRPS34	high
ENSG00000074695	LMAN1	high
ENSG00000075142	SRI	high
ENSG00000075223	SEMA3C	high
ENSG00000075415	SLC25A3	high
ENSG00000075426	FOSL2	high
ENSG00000076043	REXO2	high
ENSG00000077147	TM9SF3	high
ENSG00000078369	GNB1	high
ENSG00000079246	XRCC5	high
ENSG00000079257	LXN	high
ENSG00000082153	BZW1	high
ENSG00000082438	COBLL1	high
ENSG00000082641	NFE2L1	high
ENSG00000083845	RPS5	high
ENSG00000084207	GSTP1	high
ENSG00000084234	APLP2	high
ENSG00000084623	EIF3I	high
ENSG00000085063	CD59	high
ENSG00000085224	ATRX	high
ENSG00000085719	CPNE3	high
ENSG00000085733	CTTN	high
ENSG00000086061	DNAJA1	high
ENSG00000086062	B4GALT1	high
ENSG00000086065	CHMP5	high
ENSG00000087365	SF3B2	high
ENSG00000087884	AAMDC	high
ENSG00000088832	FKBP1A	high
ENSG00000088930	XRN2	high
ENSG00000088986	DYNLL1	high
ENSG00000089009	RPL6	high
ENSG00000089157	RPLP0	high
ENSG00000089248	ERP29	high
ENSG00000089289	IGBP1	high
ENSG00000089327	FXYD5	high
ENSG00000090013	BLVRB	high
ENSG00000090266	NDUFB2	high
ENSG00000091136	LAMB1	high
ENSG00000091527	CDV3	high
ENSG00000091986	CCDC80	high
ENSG00000092295	TGM1	high
ENSG00000092621	PHGDH	high
ENSG00000092820	EZR	high
ENSG00000092841	MYL6	high
ENSG00000092964	DPYSL2	high
ENSG00000093010	COMT	high
ENSG00000096060	FKBP5	high
ENSG00000099341	PSMD8	high
ENSG00000099622	CIRBP	high
ENSG00000099783	HNRNPM	high
ENSG00000099800	TIMM13	high
ENSG00000099860	GADD45B	high
ENSG00000100097	LGALS1	high
ENSG00000100129	EIF3L	high
ENSG00000100138	SNU13	high
ENSG00000100201	DDX17	high
ENSG00000100219	XBP1	high
ENSG00000100234	TIMP3	high
ENSG00000100300	TSPO	high
ENSG00000100316	RPL3	high
ENSG00000100342	APOL1	high
ENSG00000100353	EIF3D	high
ENSG00000100380	ST13	high
ENSG00000100387	RBX1	high
ENSG00000100567	PSMA3	high
ENSG00000100592	DAAM1	high
ENSG00000100632	ERH	high
ENSG00000100644	HIF1A	high
ENSG00000100650	SRSF5	high
ENSG00000100664	EIF5	high
ENSG00000100804	PSMB5	high
ENSG00000100811	YY1	high
ENSG00000100906	NFKBIA	high
ENSG00000100941	PNN	high
ENSG00000101000	PROCR	high
ENSG00000101182	PSMA7	high
ENSG00000101439	CST3	high
ENSG00000101443	WFDC2	high
ENSG00000101558	VAPA	high
ENSG00000101654	RNMT	high
ENSG00000101745	ANKRD12	high
ENSG00000102007	PLP2	high
ENSG00000102144	PGK1	high
ENSG00000102265	TIMP1	high
ENSG00000102317	RBM3	high
ENSG00000102580	DNAJC3	high
ENSG00000102802	MEDAG	high
ENSG00000102854	MSLN	high
ENSG00000103035	PSMD7	high
ENSG00000103145	HCFC1R1	high
ENSG00000103266	STUB1	high
ENSG00000103275	UBE2I	high
ENSG00000103363	ELOB	high
ENSG00000103569	AQP9	high
ENSG00000103994	ZNF106	high
ENSG00000104067	TJP1	high
ENSG00000104388	RAB2A	high
ENSG00000104408	EIF3E	high
ENSG00000104529	EEF1D	high
ENSG00000104763	ASAH1	high
ENSG00000104765	BNIP3L	high
ENSG00000104823	ECH1	high
ENSG00000104870	FCGRT	high
ENSG00000104979	C19orf53	high
ENSG00000105185	PDCD5	high
ENSG00000105193	RPS16	high
ENSG00000105372	RPS19	high
ENSG00000105373	NOP53	high
ENSG00000105404	RABAC1	high
ENSG00000105438	KDELR1	high
ENSG00000105509	HAS1	high
ENSG00000105518	TMEM205	high
ENSG00000105568	PPP2R1A	high
ENSG00000105640	RPL18A	high
ENSG00000105669	COPE	high
ENSG00000105825	TFPI2	high
ENSG00000105835	NAMPT	high
ENSG00000105855	ITGB8	high
ENSG00000105971	CAV2	high
ENSG00000105974	CAV1	high
ENSG00000105976	MET	high
ENSG00000106028	SSBP1	high
ENSG00000106123	EPHB6	high
ENSG00000106153	CHCHD2	high
ENSG00000106245	BUD31	high
ENSG00000106333	PCOLCE	high
ENSG00000106355	LSM5	high
ENSG00000106400	ZNHIT1	high
ENSG00000106404	CLDN15	high
ENSG00000106538	RARRES2	high
ENSG00000106565	TMEM176B	high
ENSG00000106615	RHEB	high
ENSG00000106682	EIF4H	high
ENSG00000106803	SEC61B	high
ENSG00000106809	OGN	high
ENSG00000107159	CA9	high
ENSG00000107223	EDF1	high
ENSG00000107262	BAG1	high
ENSG00000107372	ZFAND5	high
ENSG00000107581	EIF3A	high
ENSG00000107874	CUEDC2	high
ENSG00000108107	RPL28	high
ENSG00000108298	RPL19	high
ENSG00000108679	LGALS3BP	high
ENSG00000108691	CCL2	high
ENSG00000108821	COL1A1	high
ENSG00000108848	LUC7L3	high
ENSG00000108953	YWHAE	high
ENSG00000109046	WSB1	high
ENSG00000109062	SLC9A3R1	high
ENSG00000109099	PMP22	high
ENSG00000109180	OCIAD1	high
ENSG00000109321	AREG	high
ENSG00000109390	NDUFC1	high
ENSG00000109472	CPE	high
ENSG00000109475	RPL34	high
ENSG00000109787	KLF3	high
ENSG00000109971	HSPA8	high
ENSG00000110321	EIF4G2	high
ENSG00000110651	CD81	high
ENSG00000110696	C11orf58	high
ENSG00000110700	RPS13	high
ENSG00000110717	NDUFS8	high
ENSG00000110917	MLEC	high
ENSG00000110955	ATP5F1B	high
ENSG00000111011	RSRC2	high
ENSG00000111057	KRT18	high
ENSG00000111142	METAP2	high
ENSG00000111144	LTA4H	high
ENSG00000111229	ARPC3	high
ENSG00000111237	VPS29	high
ENSG00000111275	ALDH2	high
ENSG00000111341	MGP	high
ENSG00000111452	ADGRD1	high
ENSG00000111639	MRPL51	high
ENSG00000111678	C12orf57	high
ENSG00000111716	LDHB	high
ENSG00000111775	COX6A1	high
ENSG00000111786	SRSF9	high
ENSG00000111817	DSE	high
ENSG00000111832	RWDD1	high
ENSG00000111843	TMEM14C	high
ENSG00000111859	NEDD9	high
ENSG00000111897	SERINC1	high
ENSG00000112096	SOD2	high
ENSG00000112306	RPS12	high
ENSG00000112335	SNX3	high
ENSG00000112343	TRIM38	high
ENSG00000112514	CUTA	high
ENSG00000112531	QKI	high
ENSG00000112695	COX7A2	high
ENSG00000112715	VEGFA	high
ENSG00000113013	HSPA9	high
ENSG00000113140	SPARC	high
ENSG00000113387	SUB1	high
ENSG00000113558	SKP1	high
ENSG00000113732	ATP6V0E1	high
ENSG00000113742	CPEB4	high
ENSG00000114023	FAM162A	high
ENSG00000114125	RNF7	high
ENSG00000114200	BCHE	high
ENSG00000114353	GNAI2	high
ENSG00000114354	TFG	high
ENSG00000114391	RPL24	high
ENSG00000114416	FXR1	high
ENSG00000114439	BBX	high
ENSG00000114541	FRMD4B	high
ENSG00000114638	UPK1B	high
ENSG00000114850	SSR3	high
ENSG00000114861	FOXP1	high
ENSG00000114902	SPCS1	high
ENSG00000114942	EEF1B2	high
ENSG00000115053	NCL	high
ENSG00000115091	ACTR3	high
ENSG00000115128	SF3B6	high
ENSG00000115268	RPS15	high
ENSG00000115306	SPTBN1	high
ENSG00000115310	RTN4	high
ENSG00000115380	EFEMP1	high
ENSG00000115484	CCT4	high
ENSG00000115524	SF3B1	high
ENSG00000115525	ST3GAL5	high
ENSG00000115594	IL1R1	high
ENSG00000115738	ID2	high
ENSG00000115758	ODC1	high
ENSG00000115944	COX7A2L	high
ENSG00000116030	SUMO1	high
ENSG00000116044	NFE2L2	high
ENSG00000116171	SCP2	high
ENSG00000116209	TMEM59	high
ENSG00000116251	RPL22	high
ENSG00000116285	ERRFI1	high
ENSG00000116288	PARK7	high
ENSG00000116350	SRSF4	high
ENSG00000116459	ATP5PB	high
ENSG00000116539	ASH1L	high
ENSG00000116560	SFPQ	high
ENSG00000116574	RHOU	high
ENSG00000116661	FBXO2	high
ENSG00000116690	PRG4	high
ENSG00000116754	SRSF11	high
ENSG00000116977	LGALS8	high
ENSG00000117318	ID3	high
ENSG00000117335	CD46	high
ENSG00000117410	ATP6V0B	high
ENSG00000117500	TMED5	high
ENSG00000117523	PRRC2C	high
ENSG00000117592	PRDX6	high
ENSG00000117614	SYF2	high
ENSG00000117616	RSRP1	high
ENSG00000117691	NENF	high
ENSG00000118181	RPS25	high
ENSG00000118363	SPCS2	high
ENSG00000118418	HMGN3	high
ENSG00000118482	PHF3	high
ENSG00000118515	SGK1	high
ENSG00000118523	CCN2	high
ENSG00000118640	VAMP8	high
ENSG00000118680	MYL12B	high
ENSG00000118689	FOXO3	high
ENSG00000118705	RPN2	high
ENSG00000118816	CCNI	high
ENSG00000118849	RARRES1	high
ENSG00000119048	UBE2B	high
ENSG00000119138	KLF9	high
ENSG00000119335	SET	high
ENSG00000119396	RAB14	high
ENSG00000119632	IFI27L2	high
ENSG00000119655	NPC2	high
ENSG00000119900	OGFRL1	high
ENSG00000120129	DUSP1	high
ENSG00000120306	CYSTM1	high
ENSG00000120438	TCP1	high
ENSG00000120533	ENY2	high
ENSG00000120686	UFM1	high
ENSG00000120738	EGR1	high
ENSG00000120742	SERP1	high
ENSG00000121774	KHDRBS1	high
ENSG00000122026	RPL21	high
ENSG00000122359	ANXA11	high
ENSG00000122406	RPL5	high
ENSG00000122545	SEPTIN7	high
ENSG00000122705	CLTA	high
ENSG00000122786	CALD1	high
ENSG00000122870	BICC1	high
ENSG00000122873	CISD1	high
ENSG00000123144	TRIR	high
ENSG00000123179	EBPL	high
ENSG00000123349	PFDN5	high
ENSG00000123358	NR4A1	high
ENSG00000123416	TUBA1B	high
ENSG00000123505	AMD1	high
ENSG00000123562	MORF4L2	high
ENSG00000124107	SLPI	high
ENSG00000124172	ATP5F1E	high
ENSG00000124193	SRSF6	high
ENSG00000124212	PTGIS	high
ENSG00000124614	RPS10	high
ENSG00000124783	SSR1	high
ENSG00000124795	DEK	high
ENSG00000124942	AHNAK	high
ENSG00000125148	MT2A	high
ENSG00000125356	NDUFA1	high
ENSG00000125458	NT5C	high
ENSG00000125534	PPDPF	high
ENSG00000125652	ALKBH7	high
ENSG00000125691	RPL23	high
ENSG00000125730	C3	high
ENSG00000125743	SNRPD2	high
ENSG00000125848	FLRT3	high
ENSG00000125868	DSTN	high
ENSG00000125944	HNRNPR	high
ENSG00000125968	ID1	high
ENSG00000125977	EIF2S2	high
ENSG00000125991	ERGIC3	high
ENSG00000125995	ROMO1	high
ENSG00000126005	MMP24OS	high
ENSG00000126067	PSMB2	high
ENSG00000126247	CAPNS1	high
ENSG00000126267	COX6B1	high
ENSG00000126432	PRDX5	high
ENSG00000126756	UXT	high
ENSG00000126777	KTN1	high
ENSG00000126934	MAP2K2	high
ENSG00000127022	CANX	high
ENSG00000127184	COX7C	high
ENSG00000127314	RAP1B	high
ENSG00000127528	KLF2	high
ENSG00000127540	UQCR11	high
ENSG00000127884	ECHS1	high
ENSG00000127914	AKAP9	high
ENSG00000127920	GNG11	high
ENSG00000127922	SEM1	high
ENSG00000128016	ZFP36	high
ENSG00000128052	KDR	high
ENSG00000128245	YWHAH	high
ENSG00000128272	ATF4	high
ENSG00000128283	CDC42EP1	high
ENSG00000128309	MPST	high
ENSG00000128567	PODXL	high
ENSG00000128595	CALU	high
ENSG00000128609	NDUFA5	high
ENSG00000128626	MRPS12	high
ENSG00000128923	MINDY2	high
ENSG00000128951	DUT	high
ENSG00000129084	PSMA1	high
ENSG00000129518	EAPP	high
ENSG00000129559	NEDD8	high
ENSG00000129562	DAD1	high
ENSG00000129625	REEP5	high
ENSG00000129824	RPS4Y1	high
ENSG00000130066	SAT1	high
ENSG00000130255	RPL36	high
ENSG00000130313	PGLS	high
ENSG00000130396	AFDN	high
ENSG00000130522	JUND	high
ENSG00000130724	CHMP2A	high
ENSG00000130741	EIF2S3	high
ENSG00000130811	EIF3G	high
ENSG00000130844	ZNF331	high
ENSG00000131051	RBM39	high
ENSG00000131143	COX4I1	high
ENSG00000131171	SH3BGRL	high
ENSG00000131469	RPL27	high
ENSG00000131495	NDUFA2	high
ENSG00000131711	MAP1B	high
ENSG00000131981	LGALS3	high
ENSG00000132002	DNAJB1	high
ENSG00000132341	RAN	high
ENSG00000132424	PNISR	high
ENSG00000132432	SEC61G	high
ENSG00000132507	EIF5A	high
ENSG00000132510	KDM6B	high
ENSG00000132824	SERINC3	high
ENSG00000132872	SYT4	high
ENSG00000132963	POMP	high
ENSG00000133048	CHI3L1	high
ENSG00000133112	TPT1	high
ENSG00000133142	TCEAL4	high
ENSG00000133318	RTN3	high
ENSG00000133321	PLAAT4	high
ENSG00000133872	SARAF	high
ENSG00000134056	MRPS36	high
ENSG00000134107	BHLHE40	high
ENSG00000134138	MEIS2	high
ENSG00000134202	GSTM3	high
ENSG00000134294	SLC38A2	high
ENSG00000134352	IL6ST	high
ENSG00000134419	RPS15A	high
ENSG00000134762	DSC3	high
ENSG00000134825	TMEM258	high
ENSG00000134884	ARGLU1	high
ENSG00000135046	ANXA1	high
ENSG00000135316	SYNCRIP	high
ENSG00000135390	ATP5MC2	high
ENSG00000135404	CD63	high
ENSG00000135441	BLOC1S1	high
ENSG00000135480	KRT7	high
ENSG00000135486	HNRNPA1	high
ENSG00000135624	CCT7	high
ENSG00000135940	COX5B	high
ENSG00000136003	ISCU	high
ENSG00000136156	ITM2B	high
ENSG00000136238	RAC1	high
ENSG00000136240	KDELR2	high
ENSG00000136521	NDUFB5	high
ENSG00000136732	GYPC	high
ENSG00000136826	KLF4	high
ENSG00000136930	PSMB7	high
ENSG00000136938	ANP32B	high
ENSG00000136942	RPL35	high
ENSG00000136997	MYC	high
ENSG00000137154	RPS6	high
ENSG00000137193	PIM1	high
ENSG00000137210	TMEM14B	high
ENSG00000137331	IER3	high
ENSG00000137409	MTCH1	high
ENSG00000137573	SULF1	high
ENSG00000137575	SDCBP	high
ENSG00000137815	RTF1	high
ENSG00000137818	RPLP1	high
ENSG00000137876	RSL24D1	high
ENSG00000138071	ACTR2	high
ENSG00000138085	ATRAID	high
ENSG00000138207	RBP4	high
ENSG00000138279	ANXA7	high
ENSG00000138326	RPS24	high
ENSG00000138385	SSB	high
ENSG00000138449	SLC40A1	high
ENSG00000138594	TMOD3	high
ENSG00000138594	LOC112268148	high
ENSG00000138668	HNRNPD	high
ENSG00000138674	SEC31A	high
ENSG00000138772	ANXA3	high
ENSG00000138821	SLC39A8	high
ENSG00000139218	SCAF11	high
ENSG00000139343	SNRPF	high
ENSG00000139644	TMBIM6	high
ENSG00000139684	ESD	high
ENSG00000139921	TMX1	high
ENSG00000140307	GTF2A2	high
ENSG00000140391	TSPAN3	high
ENSG00000140416	TPM1	high
ENSG00000140575	IQGAP1	high
ENSG00000140612	SEC11A	high
ENSG00000140740	UQCRC2	high
ENSG00000140941	MAP1LC3B	high
ENSG00000140988	RPS2	high
ENSG00000141002	TCF25	high
ENSG00000141232	TOB1	high
ENSG00000141429	GALNT1	high
ENSG00000141522	ARHGDIA	high
ENSG00000141552	ANAPC11	high
ENSG00000141753	IGFBP4	high
ENSG00000141905	NFIC	high
ENSG00000142089	IFITM3	high
ENSG00000142156	COL6A1	high
ENSG00000142168	SOD1	high
ENSG00000142173	COL6A2	high
ENSG00000142192	APP	high
ENSG00000142227	EMP3	high
ENSG00000142534	RPS11	high
ENSG00000142541	RPL13A	high
ENSG00000142676	RPL11	high
ENSG00000142864	SERBP1	high
ENSG00000142871	CCN1	high
ENSG00000142937	RPS8	high
ENSG00000142949	PTPRF	high
ENSG00000143183	TMCO1	high
ENSG00000143198	MGST3	high
ENSG00000143222	UFC1	high
ENSG00000143321	HDGF	high
ENSG00000143375	CGN	high
ENSG00000143384	MCL1	high
ENSG00000143416	SELENBP1	high
ENSG00000143420	ENSA	high
ENSG00000143543	JTB	high
ENSG00000143545	RAB13	high
ENSG00000143612	C1orf43	high
ENSG00000143742	SRP9	high
ENSG00000143761	ARF1	high
ENSG00000143870	PDIA6	high
ENSG00000143878	RHOB	high
ENSG00000143933	CALM2	high
ENSG00000143947	RPS27A	high
ENSG00000143977	SNRPG	high
ENSG00000144224	UBXN4	high
ENSG00000144674	GOLGA4	high
ENSG00000144713	RPL32	high
ENSG00000144746	ARL6IP5	high
ENSG00000144802	NFKBIZ	high
ENSG00000144810	COL8A1	high
ENSG00000145425	RPS3A	high
ENSG00000145494	NDUFS6	high
ENSG00000145592	RPL37	high
ENSG00000145675	PIK3R1	high
ENSG00000145741	BTF3	high
ENSG00000145833	DDX46	high
ENSG00000145907	G3BP1	high
ENSG00000145912	NHP2	high
ENSG00000146066	HIGD2A	high
ENSG00000146278	PNRC1	high
ENSG00000146376	ARHGAP18	high
ENSG00000146731	CCT6A	high
ENSG00000147140	NONO	high
ENSG00000147274	RBMX	high
ENSG00000147403	RPL10	high
ENSG00000147475	ERLIN2	high
ENSG00000147526	TACC1	high
ENSG00000147604	RPL7	high
ENSG00000147649	MTDH	high
ENSG00000147677	EIF3H	high
ENSG00000147862	NFIB	high
ENSG00000147872	PLIN2	high
ENSG00000148175	STOM	high
ENSG00000148303	RPL7A	high
ENSG00000148671	ADIRF	high
ENSG00000148700	ADD3	high
ENSG00000148834	GSTO1	high
ENSG00000149100	EIF3M	high
ENSG00000149131	SERPING1	high
ENSG00000149196	HIKESHI	high
ENSG00000149273	RPS3	high
ENSG00000149357	LAMTOR1	high
ENSG00000149806	FAU	high
ENSG00000149932	TMEM219	high
ENSG00000150347	ARID5B	high
ENSG00000150459	SAP18	high
ENSG00000150687	PRSS23	high
ENSG00000150753	CCT5	high
ENSG00000150782	IL18	high
ENSG00000150938	CRIM1	high
ENSG00000150991	UBC	high
ENSG00000151353	TMEM18	high
ENSG00000151366	NDUFC2	high
ENSG00000152082	MZT2B	high
ENSG00000152234	ATP5F1A	high
ENSG00000152518	ZFP36L2	high
ENSG00000152661	GJA1	high
ENSG00000152795	HNRNPDL	high
ENSG00000153048	CARHSP1	high
ENSG00000153071	DAB2	high
ENSG00000153071	LOC112267931	high
ENSG00000153113	CAST	high
ENSG00000153250	RBMS1	high
ENSG00000153774	CFDP1	high
ENSG00000154518	ATP5MC3	high
ENSG00000154556	SORBS2	high
ENSG00000154639	CXADR	high
ENSG00000154723	ATP5PF	high
ENSG00000155090	KLF10	high
ENSG00000155366	RHOC	high
ENSG00000155957	TMBIM4	high
ENSG00000156261	CCT8	high
ENSG00000156411	ATP5MPL	high
ENSG00000156467	UQCRB	high
ENSG00000156482	RPL30	high
ENSG00000156508	EEF1A1	high
ENSG00000156976	EIF4A2	high
ENSG00000157916	RER1	high
ENSG00000158195	WASF2	high
ENSG00000158417	EIF5B	high
ENSG00000158716	DUSP23	high
ENSG00000158864	NDUFS2	high
ENSG00000159199	ATP5MC1	high
ENSG00000159377	PSMB4	high
ENSG00000159388	BTG2	high
ENSG00000159403	C1R	high
ENSG00000160075	SSU72	high
ENSG00000160888	IER2	high
ENSG00000160932	LY6E	high
ENSG00000160948	VPS28	high
ENSG00000161011	SQSTM1	high
ENSG00000161016	RPL8	high
ENSG00000161203	AP2M1	high
ENSG00000161249	DMKN	high
ENSG00000161905	ALOX15	high
ENSG00000161970	RPL26	high
ENSG00000162191	UBXN1	high
ENSG00000162244	RPL29	high
ENSG00000162493	PDPN	high
ENSG00000162599	NFIA	high
ENSG00000162604	TM2D1	high
ENSG00000162704	ARPC5	high
ENSG00000162772	ATF3	high
ENSG00000162909	CAPN2	high
ENSG00000163110	PDLIM5	high
ENSG00000163191	S100A11	high
ENSG00000163347	CLDN1	high
ENSG00000163430	FSTL1	high
ENSG00000163466	ARPC2	high
ENSG00000163468	CCT3	high
ENSG00000163479	SSR2	high
ENSG00000163513	TGFBR2	high
ENSG00000163565	IFI16	high
ENSG00000163584	RPL22L1	high
ENSG00000163597	SNHG16	high
ENSG00000163659	TIPARP	high
ENSG00000163682	RPL9	high
ENSG00000163710	PCOLCE2	high
ENSG00000163714	U2SURP	high
ENSG00000163739	CXCL1	high
ENSG00000164056	SPRY1	high
ENSG00000164096	C4orf3	high
ENSG00000164111	ANXA5	high
ENSG00000164258	NDUFS4	high
ENSG00000164323	CFAP97	high
ENSG00000164346	NSA2	high
ENSG00000164405	UQCRQ	high
ENSG00000164442	CITED2	high
ENSG00000164587	RPS14	high
ENSG00000164615	CAMLG	high
ENSG00000164647	STEAP1	high
ENSG00000165030	NFIL3	high
ENSG00000165119	HNRNPK	high
ENSG00000165280	VCP	high
ENSG00000165502	RPL36AL	high
ENSG00000165637	VDAC2	high
ENSG00000165672	PRDX3	high
ENSG00000165678	GHITM	high
ENSG00000165732	DDX21	high
ENSG00000165775	FUNDC2	high
ENSG00000165949	IFI27	high
ENSG00000166012	TAF1D	high
ENSG00000166033	HTRA1	high
ENSG00000166136	NDUFB8	high
ENSG00000166226	CCT2	high
ENSG00000166295	ANAPC16	high
ENSG00000166347	CYB5A	high
ENSG00000166441	RPL27A	high
ENSG00000166595	CIAO2B	high
ENSG00000166681	BEX3	high
ENSG00000166710	B2M	high
ENSG00000166734	GOLM2	high
ENSG00000166741	NNMT	high
ENSG00000166750	SLFN5	high
ENSG00000166794	PPIB	high
ENSG00000166848	TERF2IP	high
ENSG00000166848	LOC105371348	high
ENSG00000166913	YWHAB	high
ENSG00000167004	PDIA3	high
ENSG00000167088	SNRPD1	high
ENSG00000167283	ATP5MG	high
ENSG00000167468	GPX4	high
ENSG00000167470	MIDN	high
ENSG00000167522	ANKRD11	high
ENSG00000167526	RPL13	high
ENSG00000167552	TUBA1A	high
ENSG00000167553	TUBA1C	high
ENSG00000167644	C19orf33	high
ENSG00000167658	EEF2	high
ENSG00000167757	KLK11	high
ENSG00000167779	IGFBP6	high
ENSG00000167863	ATP5PD	high
ENSG00000167978	SRRM2	high
ENSG00000168003	SLC3A2	high
ENSG00000168028	RPSA	high
ENSG00000168036	CTNNB1	high
ENSG00000168066	SF1	high
ENSG00000168490	PHYHIP	high
ENSG00000168542	COL3A1	high
ENSG00000168610	STAT3	high
ENSG00000168653	NDUFS5	high
ENSG00000169218	RSPO1	high
ENSG00000169223	LMAN2	high
ENSG00000169564	PCBP1	high
ENSG00000169567	HINT1	high
ENSG00000169583	CLIC3	high
ENSG00000169714	CNBP	high
ENSG00000169715	MT1E	high
ENSG00000169764	UGP2	high
ENSG00000169813	HNRNPF	high
ENSG00000169905	TOR1AIP2	high
ENSG00000169908	TM4SF1	high
ENSG00000169976	SF3B5	high
ENSG00000170043	TRAPPC1	high
ENSG00000170144	HNRNPA3	high
ENSG00000170315	UBB	high
ENSG00000170345	FOS	high
ENSG00000170348	TMED10	high
ENSG00000170421	KRT8	high
ENSG00000170571	EMB	high
ENSG00000170759	KIF5B	high
ENSG00000170776	AKAP13	high
ENSG00000170860	LSM3	high
ENSG00000170889	RPS9	high
ENSG00000171222	SCAND1	high
ENSG00000171223	JUNB	high
ENSG00000171314	PGAM1	high
ENSG00000171345	KRT19	high
ENSG00000171490	RSL1D1	high
ENSG00000171530	TBCA	high
ENSG00000171634	BPTF	high
ENSG00000171858	RPS21	high
ENSG00000171863	RPS7	high
ENSG00000172137	CALB2	high
ENSG00000172201	ID4	high
ENSG00000172216	CEBPB	high
ENSG00000172270	BSG	high
ENSG00000172428	COPS9	high
ENSG00000172465	TCEAL1	high
ENSG00000172531	PPP1CA	high
ENSG00000172809	RPL38	high
ENSG00000172986	GXYLT2	high
ENSG00000173068	BNC2	high
ENSG00000173113	TRMT112	high
ENSG00000173141	MRPL57	high
ENSG00000173230	GOLGB1	high
ENSG00000173272	MZT2A	high
ENSG00000173334	TRIB1	high
ENSG00000173457	PPP1R14B	high
ENSG00000173531	MST1	high
ENSG00000173660	UQCRH	high
ENSG00000173674	EIF1AX	high
ENSG00000173726	TOMM20	high
ENSG00000173812	EIF1	high
ENSG00000173821	RNF213	high
ENSG00000173915	ATP5MD	high
ENSG00000174059	CD34	high
ENSG00000174080	CTSF	high
ENSG00000174444	RPL4	high
ENSG00000174748	RPL15	high
ENSG00000174886	NDUFA11	high
ENSG00000174917	MICOS13	high
ENSG00000174953	DHX36	high
ENSG00000175061	SNHG29	high
ENSG00000175066	GK5	high
ENSG00000175203	DCTN2	high
ENSG00000175315	CST6	high
ENSG00000175390	EIF3F	high
ENSG00000175416	CLTB	high
ENSG00000175745	NR2F1	high
ENSG00000175756	AURKAIP1	high
ENSG00000175906	ARL4D	high
ENSG00000176340	COX8A	high
ENSG00000176485	PLAAT3	high
ENSG00000176731	RBIS	high
ENSG00000177156	TALDO1	high
ENSG00000177410	ZFAS1	high
ENSG00000177469	CAVIN1	high
ENSG00000177600	RPLP2	high
ENSG00000177606	JUN	high
ENSG00000177697	CD151	high
ENSG00000177700	POLR2L	high
ENSG00000177954	RPS27	high
ENSG00000178035	IMPDH2	high
ENSG00000178573	MAF	high
ENSG00000178741	COX5A	high
ENSG00000178951	ZBTB7A	high
ENSG00000178952	TUFM	high
ENSG00000178982	EIF3K	high
ENSG00000179010	MRFAP1	high
ENSG00000179218	CALR	high
ENSG00000179262	RAD23A	high
ENSG00000179271	GADD45GIP1	high
ENSG00000179820	MYADM	high
ENSG00000179914	ITLN1	high
ENSG00000180398	MCFD2	high
ENSG00000180447	GAS1	high
ENSG00000180817	PPA1	high
ENSG00000180879	SSR4	high
ENSG00000181143	MUC16	high
ENSG00000181163	NPM1	high
ENSG00000181350	LRRC75A	high
ENSG00000181924	COA4	high
ENSG00000182004	SNRPE	high
ENSG00000182196	ARL6IP4	high
ENSG00000182326	C1S	high
ENSG00000182551	ADI1	high
ENSG00000182670	TTC3	high
ENSG00000182718	ANXA2	high
ENSG00000182774	RPS17	high
ENSG00000182899	RPL35A	high
ENSG00000183011	NAA38	high
ENSG00000183255	PTTG1IP	high
ENSG00000183291	SELENOF	high
ENSG00000183648	NDUFB1	high
ENSG00000183726	TMEM50A	high
ENSG00000184007	PTP4A2	high
ENSG00000184009	ACTG1	high
ENSG00000184076	UQCR10	high
ENSG00000184254	ALDH1A3	high
ENSG00000184557	SOCS3	high
ENSG00000184743	ATL3	high
ENSG00000184840	TMED9	high
ENSG00000184905	TCEAL2	high
ENSG00000184983	NDUFA6	high
ENSG00000184990	SIVA1	high
ENSG00000185022	MAFF	high
ENSG00000185043	CIB1	high
ENSG00000185088	RPS27L	high
ENSG00000185201	IFITM2	high
ENSG00000185222	TCEAL9	high
ENSG00000185432	METTL7A	high
ENSG00000185624	P4HB	high
ENSG00000185630	PBX1	high
ENSG00000185650	ZFP36L1	high
ENSG00000185651	UBE2L3	high
ENSG00000185787	MORF4L1	high
ENSG00000185825	BCAP31	high
ENSG00000186184	POLR1D	high
ENSG00000186395	KRT10	high
ENSG00000186468	RPS23	high
ENSG00000186591	UBE2H	high
ENSG00000187079	TEAD1	high
ENSG00000187193	MT1X	high
ENSG00000187210	GCNT1	high
ENSG00000187244	BCAM	high
ENSG00000187446	CHP1	high
ENSG00000187514	PTMA	high
ENSG00000188186	LAMTOR4	high
ENSG00000188243	COMMD6	high
ENSG00000188257	PLA2G2A	high
ENSG00000188612	SUMO2	high
ENSG00000188846	RPL14	high
ENSG00000189043	NDUFA4	high
ENSG00000189171	S100A13	high
ENSG00000189221	MAOA	high
ENSG00000189266	PNRC2	high
ENSG00000196199	MPHOSPH8	high
ENSG00000196230	TUBB	high
ENSG00000196262	PPIA	high
ENSG00000196352	CD55	high
ENSG00000196419	XRCC6	high
ENSG00000196504	PRPF40A	high
ENSG00000196507	TCEAL3	high
ENSG00000196531	NACA	high
ENSG00000196616	ADH1B	high
ENSG00000196683	TOMM7	high
ENSG00000196937	FAM3C	high
ENSG00000196975	ANXA4	high
ENSG00000197111	PCBP2	high
ENSG00000197448	GSTK1	high
ENSG00000197635	DPP4	high
ENSG00000197694	SPTAN1	high
ENSG00000197728	RPS26	high
ENSG00000197746	PSAP	high
ENSG00000197747	S100A10	high
ENSG00000197756	RPL37A	high
ENSG00000197894	ADH5	high
ENSG00000197956	S100A6	high
ENSG00000197958	RPL12	high
ENSG00000197971	MBP	high
ENSG00000197982	C1orf122	high
ENSG00000198034	RPS4X	high
ENSG00000198189	HSD17B11	high
ENSG00000198242	RPL23A	high
ENSG00000198258	UBL5	high
ENSG00000198363	ASPH	high
ENSG00000198431	TXNRD1	high
ENSG00000198492	YTHDF2	high
ENSG00000198712	COX2	high
ENSG00000198727	CYTB	high
ENSG00000198755	RPL10A	high
ENSG00000198786	ND5	high
ENSG00000198804	COX1	high
ENSG00000198830	HMGN2	high
ENSG00000198856	OSTC	high
ENSG00000198886	ND4	high
ENSG00000198899	ATP6	high
ENSG00000198900	TOP1	high
ENSG00000198918	RPL39	high
ENSG00000198931	APRT	high
ENSG00000198938	COX3	high
ENSG00000198961	PJA2	high
ENSG00000203875	SNHG5	high
ENSG00000204256	BRD2	high
ENSG00000204388	HSPA1B	high
ENSG00000204389	HSPA1A	high
ENSG00000204525	HLA-C	high
ENSG00000204628	RACK1	high
ENSG00000205038	PKHD1L1	high
ENSG00000205364	MT1M	high
ENSG00000205403	CFI	high
ENSG00000205542	TMSB4X	high
ENSG00000205544	TMEM256	high
ENSG00000205981	DNAJC19	high
ENSG00000206503	HLA-A	high
ENSG00000206538	VGLL3	high
ENSG00000210082	NA	high
ENSG00000211450	SELENOH	high
ENSG00000211459	NA	high
ENSG00000213145	CRIP1	high
ENSG00000213625	LEPROT	high
ENSG00000213639	PPP1CB	high
ENSG00000213719	CLIC1	high
ENSG00000213722	DDAH2	high
ENSG00000213741	RPS29	high
ENSG00000214026	MRPL23	high
ENSG00000214026	LOC107987373	high
ENSG00000214063	TSPAN4	high
ENSG00000214253	FIS1	high
ENSG00000215021	PHB2	high
ENSG00000221869	CEBPD	high
ENSG00000221983	UBA52	high
ENSG00000224032	NA	high
ENSG00000224259	LINC01133	high
ENSG00000225921	NOL7	high
ENSG00000225972	MTND1P23	high
ENSG00000228474	OST4	high
ENSG00000229117	RPL41	high
ENSG00000230202	NA	high
ENSG00000230989	HSBP1	high
ENSG00000231500	RPS18	high
ENSG00000232112	TMA7	high
ENSG00000232388	SMIM26	high
ENSG00000233016	SNHG7	high
ENSG00000233276	GPX1	high
ENSG00000233913	RPL10P9	high
ENSG00000233927	RPS28	high
ENSG00000234741	GAS5	high
ENSG00000234745	HLA-B	high
ENSG00000237550	RPL9P8	high
ENSG00000237765	FAM200B	high
ENSG00000240583	AQP1	high
ENSG00000240972	MIF	high
ENSG00000241343	RPL36A	high
ENSG00000241468	ATP5MF	high
ENSG00000241644	INMT	high
ENSG00000241837	ATP5PO	high
ENSG00000242485	MRPL20	high
ENSG00000243147	MRPL33	high
ENSG00000243317	STMP1	high
ENSG00000243566	UPK3B	high
ENSG00000244754	N4BP2L2	high
ENSG00000244879	NA	high
ENSG00000245532	NEAT1	high
ENSG00000245910	SNHG6	high
ENSG00000248527	MTATP6P1	high
ENSG00000250722	SELENOP	high
ENSG00000251562	MALAT1	high
ENSG00000254999	BRK1	high
ENSG00000255302	EID1	high
ENSG00000257017	HP	high
ENSG00000257727	CNPY2	high
ENSG00000257923	CUX1	high
ENSG00000260032	NORAD	high
ENSG00000265681	RPL17	high
ENSG00000265972	TXNIP	high
ENSG00000266472	MRPS21	high
ENSG00000269893	SNHG8	high
ENSG00000272047	GTF2H5	high
ENSG00000276850	NA	high
ENSG00000277791	PSMB3	high
ENSG00000278311	GGNBP2	high
ENSG00000010244	ZNF207	medium
ENSG00000011304	PTBP1	medium
ENSG00000013441	CLK1	medium
ENSG00000023287	RB1CC1	medium
ENSG00000026103	FAS	medium
ENSG00000042753	AP2S1	medium
ENSG00000050426	LETMD1	medium
ENSG00000050628	PTGER3	medium
ENSG00000062194	GPBP1	medium
ENSG00000063245	EPN1	medium
ENSG00000064309	CDON	medium
ENSG00000065613	SLK	medium
ENSG00000068650	ATP11A	medium
ENSG00000070770	CSNK2A2	medium
ENSG00000075785	RAB7A	medium
ENSG00000080802	CNOT4	medium
ENSG00000090989	EXOC1	medium
ENSG00000092010	PSME1	medium
ENSG00000092068	SLC7A8	medium
ENSG00000101040	ZMYND8	medium
ENSG00000101856	PGRMC1	medium
ENSG00000101938	CHRDL1	medium
ENSG00000102882	MAPK3	medium
ENSG00000103429	BFAR	medium
ENSG00000103485	QPRT	medium
ENSG00000103502	CDIPT	medium
ENSG00000104047	DTWD1	medium
ENSG00000104231	ZFAND1	medium
ENSG00000104419	NDRG1	medium
ENSG00000105364	MRPL4	medium
ENSG00000105612	DNASE2	medium
ENSG00000105887	MTPN	medium
ENSG00000105887	LUZP6	medium
ENSG00000106049	HIBADH	medium
ENSG00000106052	TAX1BP1	medium
ENSG00000106299	WASL	medium
ENSG00000108561	C1QBP	medium
ENSG00000109072	VTN	medium
ENSG00000109846	CRYAB	medium
ENSG00000110011	DNAJC4	medium
ENSG00000111640	GAPDH	medium
ENSG00000112378	PERP	medium
ENSG00000113194	FAF2	medium
ENSG00000115204	MPV17	medium
ENSG00000115677	HDLBP	medium
ENSG00000116717	GADD45A	medium
ENSG00000117362	APH1A	medium
ENSG00000118200	CAMSAP2	medium
ENSG00000119013	NDUFB3	medium
ENSG00000119705	SLIRP	medium
ENSG00000120008	WDR11	medium
ENSG00000120837	NFYB	medium
ENSG00000120860	WASHC3	medium
ENSG00000121067	SPOP	medium
ENSG00000121644	DESI2	medium
ENSG00000122729	ACO1	medium
ENSG00000122958	VPS26A	medium
ENSG00000123609	NMI	medium
ENSG00000123989	CHPF	medium
ENSG00000124762	CDKN1A	medium
ENSG00000124920	MYRF	medium
ENSG00000125826	RBCK1	medium
ENSG00000125877	ITPA	medium
ENSG00000127054	INTS11	medium
ENSG00000128463	EMC4	medium
ENSG00000128524	ATP6V1F	medium
ENSG00000128581	IFT22	medium
ENSG00000129534	MIS18BP1	medium
ENSG00000130202	NECTIN2	medium
ENSG00000130429	ARPC1B	medium
ENSG00000130731	METTL26	medium
ENSG00000131013	PPIL4	medium
ENSG00000131626	PPFIA1	medium
ENSG00000131966	ACTR10	medium
ENSG00000132205	EMILIN2	medium
ENSG00000133818	RRAS2	medium
ENSG00000134283	PPHLN1	medium
ENSG00000134330	IAH1	medium
ENSG00000135047	CTSL	medium
ENSG00000135968	GCC2	medium
ENSG00000137076	TLN1	medium
ENSG00000137500	CCDC90B	medium
ENSG00000137767	SQOR	medium
ENSG00000138398	PPIG	medium
ENSG00000139233	LLPH	medium
ENSG00000140497	SCAMP2	medium
ENSG00000141447	OSBPL1A	medium
ENSG00000141971	MVB12A	medium
ENSG00000143013	LMO4	medium
ENSG00000143256	PFDN2	medium
ENSG00000143549	TPM3	medium
ENSG00000144642	RBMS3	medium
ENSG00000148180	GSN	medium
ENSG00000149823	VPS51	medium
ENSG00000150527	MIA2	medium
ENSG00000151292	CSNK1G3	medium
ENSG00000151500	THYN1	medium
ENSG00000153002	CPB1	medium
ENSG00000153037	SRP19	medium
ENSG00000153179	RASSF3	medium
ENSG00000154144	TBRG1	medium
ENSG00000158092	NCK1	medium
ENSG00000158710	TAGLN2	medium
ENSG00000160714	UBE2Q1	medium
ENSG00000160783	PMF1	medium
ENSG00000161547	SRSF2	medium
ENSG00000162032	SPSB3	medium
ENSG00000162631	NTNG1	medium
ENSG00000163382	NAXE	medium
ENSG00000164022	AIMP1	medium
ENSG00000164172	MOCS2	medium
ENSG00000164182	NDUFAF2	medium
ENSG00000164733	CTSB	medium
ENSG00000165264	NDUFB6	medium
ENSG00000166200	COPS2	medium
ENSG00000167202	TBC1D2B	medium
ENSG00000167515	TRAPPC2L	medium
ENSG00000167565	SERTAD3	medium
ENSG00000168002	POLR2G	medium
ENSG00000168710	AHCYL1	medium
ENSG00000169019	COMMD8	medium
ENSG00000169594	BNC1	medium
ENSG00000170310	STX8	medium
ENSG00000170584	NUDCD2	medium
ENSG00000171135	JAGN1	medium
ENSG00000171150	SOCS5	medium
ENSG00000171202	TMEM126A	medium
ENSG00000171943	SRGAP2C	medium
ENSG00000172239	PAIP1	medium
ENSG00000172500	FIBP	medium
ENSG00000172508	CARNS1	medium
ENSG00000173163	COMMD1	medium
ENSG00000173960	UBXN2A	medium
ENSG00000174938	SEZ6L2	medium
ENSG00000175215	CTDSP2	medium
ENSG00000175334	BANF1	medium
ENSG00000176978	DPP7	medium
ENSG00000181555	SETD2	medium
ENSG00000181610	MRPS23	medium
ENSG00000182165	NA	medium
ENSG00000182247	UBE2E2	medium
ENSG00000182636	NDN	medium
ENSG00000183617	MRPL54	medium
ENSG00000185070	FLRT2	medium
ENSG00000188554	NBR1	medium
ENSG00000196072	BLOC1S2	medium
ENSG00000196712	NF1	medium
ENSG00000196730	DAPK1	medium
ENSG00000196924	FLNA	medium
ENSG00000196998	WDR45	medium
ENSG00000197579	TOPORS	medium
ENSG00000197580	BCO2	medium
ENSG00000197712	FAM114A1	medium
ENSG00000198355	PIM3	medium
ENSG00000198356	GET3	medium
ENSG00000198467	TPM2	medium
ENSG00000198561	CTNND1	medium
ENSG00000198763	ND2	medium
ENSG00000204842	ATXN2	medium
ENSG00000214194	SMIM30	medium
ENSG00000225663	MCRIP1	medium
ENSG00000226742	HSBP1L1	medium
ENSG00000234545	FAM133B	medium
ENSG00000240857	RDH14	medium
ENSG00000244313	NA	medium
ENSG00000246705	H2AJ	medium
ENSG00000255248	MIR100HG	medium
ENSG00000258289	CHURC1	medium
ENSG00000263001	GTF2I	medium
