IdentityGene	GeneSymbol	Level
ENSG00000003402	CFLAR	high
ENSG00000005022	SLC25A5	high
ENSG00000005483	KMT2E	high
ENSG00000006125	AP2B1	high
ENSG00000006712	PAF1	high
ENSG00000007168	PAFAH1B1	high
ENSG00000008952	SEC62	high
ENSG00000008988	RPS20	high
ENSG00000010810	FYN	high
ENSG00000023287	RB1CC1	high
ENSG00000025293	PHF20	high
ENSG00000026025	VIM	high
ENSG00000026508	CD44	high
ENSG00000027869	SH2D2A	high
ENSG00000028137	TNFRSF1B	high
ENSG00000034677	RNF19A	high
ENSG00000038219	BOD1L1	high
ENSG00000044574	HSPA5	high
ENSG00000049249	TNFRSF9	high
ENSG00000051108	HERPUD1	high
ENSG00000051620	HEBP2	high
ENSG00000054118	THRAP3	high
ENSG00000054267	ARID4B	high
ENSG00000060138	YBX3	high
ENSG00000060237	WNK1	high
ENSG00000065809	FAM107B	high
ENSG00000065978	YBX1	high
ENSG00000067048	DDX3Y	high
ENSG00000067560	RHOA	high
ENSG00000069493	CLEC2D	high
ENSG00000069667	RORA	high
ENSG00000069849	ATP1B3	high
ENSG00000075415	SLC25A3	high
ENSG00000077147	TM9SF3	high
ENSG00000077150	NFKB2	high
ENSG00000077984	CST7	high
ENSG00000078304	PPP2R5C	high
ENSG00000078596	ITM2A	high
ENSG00000080371	RAB21	high
ENSG00000081237	PTPRC	high
ENSG00000084070	SMAP2	high
ENSG00000084207	GSTP1	high
ENSG00000087302	RTRAF	high
ENSG00000087460	GNAS	high
ENSG00000088205	DDX18	high
ENSG00000088986	DYNLL1	high
ENSG00000089280	FUS	high
ENSG00000089737	DDX24	high
ENSG00000091527	CDV3	high
ENSG00000092199	HNRNPC	high
ENSG00000092820	EZR	high
ENSG00000092841	MYL6	high
ENSG00000095794	CREM	high
ENSG00000096060	FKBP5	high
ENSG00000096384	HSP90AB1	high
ENSG00000099204	ABLIM1	high
ENSG00000100138	SNU13	high
ENSG00000100650	SRSF5	high
ENSG00000100664	EIF5	high
ENSG00000100811	YY1	high
ENSG00000100941	PNN	high
ENSG00000101182	PSMA7	high
ENSG00000101596	SMCHD1	high
ENSG00000102144	PGK1	high
ENSG00000102317	RBM3	high
ENSG00000102760	RGCC	high
ENSG00000103257	SLC7A5	high
ENSG00000103275	UBE2I	high
ENSG00000103342	GSPT1	high
ENSG00000104660	LEPROTL1	high
ENSG00000104856	RELB	high
ENSG00000105323	HNRNPUL1	high
ENSG00000105329	TGFB1	high
ENSG00000105404	RABAC1	high
ENSG00000106052	TAX1BP1	high
ENSG00000106245	BUD31	high
ENSG00000106682	EIF4H	high
ENSG00000106803	SEC61B	high
ENSG00000106948	AKNA	high
ENSG00000107223	EDF1	high
ENSG00000107581	EIF3A	high
ENSG00000108055	SMC3	high
ENSG00000108106	UBE2S	high
ENSG00000108510	MED13	high
ENSG00000109320	NFKB1	high
ENSG00000109321	AREG	high
ENSG00000109332	UBE2D3	high
ENSG00000109943	CRTAM	high
ENSG00000110047	EHD1	high
ENSG00000110651	CD81	high
ENSG00000111348	ARHGDIB	high
ENSG00000111371	SLC38A1	high
ENSG00000111596	CNOT2	high
ENSG00000111640	GAPDH	high
ENSG00000112297	CRYBG1	high
ENSG00000112695	COX7A2	high
ENSG00000112739	PRPF4B	high
ENSG00000113387	SUB1	high
ENSG00000113448	PDE4D	high
ENSG00000113558	SKP1	high
ENSG00000113712	CSNK1A1	high
ENSG00000113811	SELENOK	high
ENSG00000115053	NCL	high
ENSG00000115524	SF3B1	high
ENSG00000115541	HSPE1	high
ENSG00000115935	WIPF1	high
ENSG00000116288	PARK7	high
ENSG00000116560	SFPQ	high
ENSG00000116679	IVNS1ABP	high
ENSG00000116741	RGS2	high
ENSG00000116754	SRSF11	high
ENSG00000119707	RBM25	high
ENSG00000119801	YPEL5	high
ENSG00000120690	ELF1	high
ENSG00000120875	DUSP4	high
ENSG00000122218	COPA	high
ENSG00000122545	SEPTIN7	high
ENSG00000122566	HNRNPA2B1	high
ENSG00000122862	SRGN	high
ENSG00000123144	TRIR	high
ENSG00000123146	ADGRE5	high
ENSG00000123505	AMD1	high
ENSG00000123562	MORF4L2	high
ENSG00000124383	MPHOSPH10	high
ENSG00000124795	DEK	high
ENSG00000124831	LRRFIP1	high
ENSG00000125651	GTF2F1	high
ENSG00000125743	SNRPD2	high
ENSG00000126267	COX6B1	high
ENSG00000126777	KTN1	high
ENSG00000126860	EVI2A	high
ENSG00000127824	TUBA4A	high
ENSG00000127914	AKAP9	high
ENSG00000129083	COPB1	high
ENSG00000130254	SAFB2	high
ENSG00000130522	JUND	high
ENSG00000130725	UBE2M	high
ENSG00000130770	ATP5IF1	high
ENSG00000130844	ZNF331	high
ENSG00000131013	PPIL4	high
ENSG00000131051	RBM39	high
ENSG00000131174	COX7B	high
ENSG00000131508	UBE2D2	high
ENSG00000132965	ALOX5AP	high
ENSG00000133226	SRRM1	high
ENSG00000133872	SARAF	high
ENSG00000134186	PRPF38B	high
ENSG00000134242	PTPN22	high
ENSG00000134884	ARGLU1	high
ENSG00000134954	ETS1	high
ENSG00000135046	ANXA1	high
ENSG00000135048	CEMIP2	high
ENSG00000135127	BICDL1	high
ENSG00000135842	NIBAN1	high
ENSG00000135968	GCC2	high
ENSG00000136146	MED4	high
ENSG00000138185	ENTPD1	high
ENSG00000138668	HNRNPD	high
ENSG00000138757	G3BP2	high
ENSG00000138767	CNOT6L	high
ENSG00000139112	GABARAPL1	high
ENSG00000139278	GLIPR1	high
ENSG00000139644	TMBIM6	high
ENSG00000140575	IQGAP1	high
ENSG00000142168	SOD1	high
ENSG00000142227	EMP3	high
ENSG00000142507	PSMB6	high
ENSG00000142541	RPL13A	high
ENSG00000142864	SERBP1	high
ENSG00000143184	XCL1	high
ENSG00000143185	XCL2	high
ENSG00000143384	MCL1	high
ENSG00000143549	TPM3	high
ENSG00000143774	GUK1	high
ENSG00000143924	EML4	high
ENSG00000143933	CALM2	high
ENSG00000144381	HSPD1	high
ENSG00000145675	PIK3R1	high
ENSG00000145703	IQGAP2	high
ENSG00000146278	PNRC1	high
ENSG00000147065	MSN	high
ENSG00000147548	NSD3	high
ENSG00000147649	MTDH	high
ENSG00000148229	POLE3	high
ENSG00000150991	UBC	high
ENSG00000151327	FAM177A1	high
ENSG00000151327	LOC101927178	high
ENSG00000152409	JMY	high
ENSG00000152601	MBNL1	high
ENSG00000152795	HNRNPDL	high
ENSG00000153113	CAST	high
ENSG00000153187	HNRNPU	high
ENSG00000153201	RANBP2	high
ENSG00000153283	CD96	high
ENSG00000153563	CD8A	high
ENSG00000153922	CHD1	high
ENSG00000154217	PITPNC1	high
ENSG00000158122	PRXL2C	high
ENSG00000158417	EIF5B	high
ENSG00000158710	TAGLN2	high
ENSG00000158985	CDC42SE2	high
ENSG00000160654	CD3G	high
ENSG00000160789	LMNA	high
ENSG00000161011	SQSTM1	high
ENSG00000161547	SRSF2	high
ENSG00000162924	REL	high
ENSG00000163479	SSR2	high
ENSG00000163660	CCNL1	high
ENSG00000163875	MEAF6	high
ENSG00000163950	SLBP	high
ENSG00000164105	SAP30	high
ENSG00000164120	HPGD	high
ENSG00000164190	NIPBL	high
ENSG00000164346	NSA2	high
ENSG00000164674	SYTL3	high
ENSG00000164919	COX6C	high
ENSG00000164924	YWHAZ	high
ENSG00000165119	HNRNPK	high
ENSG00000165678	GHITM	high
ENSG00000165732	DDX21	high
ENSG00000166012	TAF1D	high
ENSG00000166233	ARIH1	high
ENSG00000166598	HSP90B1	high
ENSG00000166794	PPIB	high
ENSG00000167522	ANKRD11	high
ENSG00000167978	SRRM2	high
ENSG00000167996	FTH1	high
ENSG00000168066	SF1	high
ENSG00000168421	RHOH	high
ENSG00000168653	NDUFS5	high
ENSG00000168675	LDLRAD4	high
ENSG00000170144	HNRNPA3	high
ENSG00000170242	USP47	high
ENSG00000170315	UBB	high
ENSG00000170776	AKAP13	high
ENSG00000171222	SCAND1	high
ENSG00000171634	BPTF	high
ENSG00000171988	JMJD1C	high
ENSG00000172115	CYCS	high
ENSG00000172216	CEBPB	high
ENSG00000172809	RPL38	high
ENSG00000173230	GOLGB1	high
ENSG00000173660	UQCRH	high
ENSG00000173674	EIF1AX	high
ENSG00000173726	TOMM20	high
ENSG00000173762	CD7	high
ENSG00000174718	RESF1	high
ENSG00000174946	GPR171	high
ENSG00000174953	DHX36	high
ENSG00000175061	SNHG29	high
ENSG00000175390	EIF3F	high
ENSG00000175756	AURKAIP1	high
ENSG00000176845	METRNL	high
ENSG00000177410	ZFAS1	high
ENSG00000177600	RPLP2	high
ENSG00000177700	POLR2L	high
ENSG00000179010	MRFAP1	high
ENSG00000179218	CALR	high
ENSG00000179820	MYADM	high
ENSG00000180879	SSR4	high
ENSG00000181163	NPM1	high
ENSG00000182154	MRPL41	high
ENSG00000182934	SRPRA	high
ENSG00000184205	TSPYL2	high
ENSG00000184588	PDE4B	high
ENSG00000184897	H1-10	high
ENSG00000185787	MORF4L1	high
ENSG00000185862	EVI2B	high
ENSG00000186469	GNG2	high
ENSG00000187109	NAP1L1	high
ENSG00000187239	FNBP1	high
ENSG00000187514	PTMA	high
ENSG00000188042	ARL4C	high
ENSG00000188229	TUBB4B	high
ENSG00000189067	LITAF	high
ENSG00000196352	CD55	high
ENSG00000197747	S100A10	high
ENSG00000198258	UBL5	high
ENSG00000198805	PNP	high
ENSG00000198851	CD3E	high
ENSG00000198900	TOP1	high
ENSG00000204386	NEU1	high
ENSG00000205581	HMGN1	high
ENSG00000205937	RNPS1	high
ENSG00000206560	ANKRD28	high
ENSG00000213145	CRIP1	high
ENSG00000213639	PPP1CB	high
ENSG00000221869	CEBPD	high
ENSG00000225921	NOL7	high
ENSG00000228474	OST4	high
ENSG00000234741	GAS5	high
ENSG00000235576	NA	high
ENSG00000250479	CHCHD10	high
ENSG00000255302	EID1	high
ENSG00000265241	RBM8A	high
ENSG00000267519	NA	high
ENSG00000269893	SNHG8	high
ENSG00000272256	NA	high
ENSG00000275302	CCL4	high
ENSG00000276045	ORAI1	high
ENSG00000010404	IDS	medium
ENSG00000013441	CLK1	medium
ENSG00000032219	ARID4A	medium
ENSG00000046651	OFD1	medium
ENSG00000047849	MAP4	medium
ENSG00000058272	PPP1R12A	medium
ENSG00000059804	SLC2A3	medium
ENSG00000062194	GPBP1	medium
ENSG00000064012	CASP8	medium
ENSG00000065989	PDE4A	medium
ENSG00000067900	ROCK1	medium
ENSG00000069345	DNAJA2	medium
ENSG00000075142	SRI	medium
ENSG00000078140	UBE2K	medium
ENSG00000078589	P2RY10	medium
ENSG00000082153	BZW1	medium
ENSG00000084463	WBP11	medium
ENSG00000089248	ERP29	medium
ENSG00000090621	PABPC4	medium
ENSG00000099783	HNRNPM	medium
ENSG00000100316	RPL3	medium
ENSG00000100380	ST13	medium
ENSG00000101361	NOP56	medium
ENSG00000101367	MAPRE1	medium
ENSG00000104131	EIF3J	medium
ENSG00000105372	RPS19	medium
ENSG00000105717	PBX4	medium
ENSG00000107742	SPOCK2	medium
ENSG00000108256	NUFIP2	medium
ENSG00000108582	CPD	medium
ENSG00000108946	PRKAR1A	medium
ENSG00000109475	RPL34	medium
ENSG00000111642	CHD4	medium
ENSG00000111669	TPI1	medium
ENSG00000111670	GNPTAB	medium
ENSG00000111832	RWDD1	medium
ENSG00000111897	SERINC1	medium
ENSG00000114850	SSR3	medium
ENSG00000115128	SF3B6	medium
ENSG00000115419	GLS	medium
ENSG00000115539	PDCL3	medium
ENSG00000117281	CD160	medium
ENSG00000117602	RCAN3	medium
ENSG00000118308	IRAG2	medium
ENSG00000118985	ELL2	medium
ENSG00000119541	VPS4B	medium
ENSG00000120705	ETF1	medium
ENSG00000121579	NAA50	medium
ENSG00000121966	CXCR4	medium
ENSG00000123416	TUBA1B	medium
ENSG00000123908	AGO2	medium
ENSG00000124214	STAU1	medium
ENSG00000124225	PMEPA1	medium
ENSG00000125835	SNRPB	medium
ENSG00000126698	DNAJC8	medium
ENSG00000128989	ARPP19	medium
ENSG00000129351	ILF3	medium
ENSG00000133639	BTG1	medium
ENSG00000134324	LPIN1	medium
ENSG00000134996	OSTF1	medium
ENSG00000136603	SKIL	medium
ENSG00000136819	C9orf78	medium
ENSG00000136938	ANP32B	medium
ENSG00000137501	SYTL2	medium
ENSG00000137815	RTF1	medium
ENSG00000138385	SSB	medium
ENSG00000138398	PPIG	medium
ENSG00000139343	SNRPF	medium
ENSG00000139722	VPS37B	medium
ENSG00000140988	RPS2	medium
ENSG00000141551	CSNK1D	medium
ENSG00000143158	MPC2	medium
ENSG00000145592	RPL37	medium
ENSG00000145782	ATG12	medium
ENSG00000145907	G3BP1	medium
ENSG00000147274	RBMX	medium
ENSG00000147403	RPL10	medium
ENSG00000147677	EIF3H	medium
ENSG00000149273	RPS3	medium
ENSG00000155307	SAMSN1	medium
ENSG00000155307	LOC388813	medium
ENSG00000156675	RAB11FIP1	medium
ENSG00000160584	SIK3	medium
ENSG00000162607	USP1	medium
ENSG00000163346	PBXIP1	medium
ENSG00000163349	HIPK1	medium
ENSG00000163682	RPL9	medium
ENSG00000163714	U2SURP	medium
ENSG00000165775	FUNDC2	medium
ENSG00000167526	RPL13	medium
ENSG00000168264	IRF2BP2	medium
ENSG00000168374	ARF4	medium
ENSG00000169926	KLF13	medium
ENSG00000170889	RPS9	medium
ENSG00000171490	RSL1D1	medium
ENSG00000171867	PRNP	medium
ENSG00000172270	BSG	medium
ENSG00000174373	RALGAPA1	medium
ENSG00000175130	MARCKSL1	medium
ENSG00000178184	PARD6G	medium
ENSG00000180817	PPA1	medium
ENSG00000182670	TTC3	medium
ENSG00000182718	ANXA2	medium
ENSG00000182899	RPL35A	medium
ENSG00000184203	PPP1R2	medium
ENSG00000187608	ISG15	medium
ENSG00000188994	ZNF292	medium
ENSG00000197892	KIF13B	medium
ENSG00000198168	SVIP	medium
ENSG00000204256	BRD2	medium
ENSG00000206503	HLA-A	medium
ENSG00000213551	DNAJC9	medium
ENSG00000222041	CYTOR	medium
ENSG00000229117	RPL41	medium
ENSG00000231074	HCG18	medium
ENSG00000243927	MRPS6	medium
ENSG00000256235	SMIM3	medium
ENSG00000265972	TXNIP	medium
ENSG00000271503	CCL5	medium
ENSG00000272009	NA	medium
