IdentityGene	GeneSymbol	Level
ENSG00000000971	CFH	high
ENSG00000004799	PDK4	high
ENSG00000005810	MYCBP2	high
ENSG00000006210	CX3CL1	high
ENSG00000006831	ADIPOR2	high
ENSG00000008018	PSMB1	high
ENSG00000008282	SYPL1	high
ENSG00000009954	BAZ1B	high
ENSG00000010319	SEMA3G	high
ENSG00000018408	WWTR1	high
ENSG00000019582	CD74	high
ENSG00000024422	EHD2	high
ENSG00000027697	IFNGR1	high
ENSG00000034713	GABARAPL2	high
ENSG00000038219	BOD1L1	high
ENSG00000038274	MAT2B	high
ENSG00000044115	CTNNA1	high
ENSG00000047849	MAP4	high
ENSG00000048649	RSF1	high
ENSG00000049540	ELN	high
ENSG00000061676	NCKAP1	high
ENSG00000064042	LIMCH1	high
ENSG00000066056	TIE1	high
ENSG00000067113	PLPP1	high
ENSG00000067225	PKM	high
ENSG00000067560	RHOA	high
ENSG00000067900	ROCK1	high
ENSG00000068912	ERLEC1	high
ENSG00000069122	ADGRF5	high
ENSG00000069399	BCL3	high
ENSG00000070831	CDC42	high
ENSG00000072163	LIMS2	high
ENSG00000073712	FERMT2	high
ENSG00000074416	MGLL	high
ENSG00000075785	RAB7A	high
ENSG00000077232	DNAJC10	high
ENSG00000078369	GNB1	high
ENSG00000078596	ITM2A	high
ENSG00000080200	CRYBG3	high
ENSG00000081041	CXCL2	high
ENSG00000084207	GSTP1	high
ENSG00000085276	MECOM	high
ENSG00000086666	ZFAND6	high
ENSG00000086758	HUWE1	high
ENSG00000087074	PPP1R15A	high
ENSG00000087253	LPCAT2	high
ENSG00000087274	ADD1	high
ENSG00000087365	SF3B2	high
ENSG00000089053	ANAPC5	high
ENSG00000089280	FUS	high
ENSG00000089327	FXYD5	high
ENSG00000090060	PAPOLA	high
ENSG00000090238	YPEL3	high
ENSG00000090266	NDUFB2	high
ENSG00000090339	ICAM1	high
ENSG00000090989	EXOC1	high
ENSG00000091527	CDV3	high
ENSG00000092964	DPYSL2	high
ENSG00000097033	SH3GLB1	high
ENSG00000099139	PCSK5	high
ENSG00000099204	ABLIM1	high
ENSG00000099260	PALMD	high
ENSG00000099817	POLR2E	high
ENSG00000099860	GADD45B	high
ENSG00000100225	FBXO7	high
ENSG00000100300	TSPO	high
ENSG00000100345	MYH9	high
ENSG00000100348	TXN2	high
ENSG00000100354	TNRC6B	high
ENSG00000100711	ZFYVE21	high
ENSG00000100811	YY1	high
ENSG00000100813	ACIN1	high
ENSG00000101161	PRPF6	high
ENSG00000101187	SLCO4A1	high
ENSG00000101955	SRPX	high
ENSG00000102024	PLS3	high
ENSG00000102144	PGK1	high
ENSG00000102317	RBM3	high
ENSG00000102786	INTS6	high
ENSG00000103769	RAB11A	high
ENSG00000104067	TJP1	high
ENSG00000104368	PLAT	high
ENSG00000104805	NUCB1	high
ENSG00000104964	TLE5	high
ENSG00000105058	FAM32A	high
ENSG00000105438	KDELR1	high
ENSG00000105568	PPP2R1A	high
ENSG00000105835	NAMPT	high
ENSG00000105887	MTPN	high
ENSG00000105887	LUZP6	high
ENSG00000106400	ZNHIT1	high
ENSG00000106991	ENG	high
ENSG00000107372	ZFAND5	high
ENSG00000107562	CXCL12	high
ENSG00000107968	MAP3K8	high
ENSG00000108219	TSPAN14	high
ENSG00000108518	PFN1	high
ENSG00000108622	ICAM2	high
ENSG00000108691	CCL2	high
ENSG00000109390	NDUFC1	high
ENSG00000109971	HSPA8	high
ENSG00000110108	TMEM109	high
ENSG00000110321	EIF4G2	high
ENSG00000110446	SLC15A3	high
ENSG00000110799	VWF	high
ENSG00000110955	ATP5F1B	high
ENSG00000111077	TNS2	high
ENSG00000111261	MANSC1	high
ENSG00000111341	MGP	high
ENSG00000111678	C12orf57	high
ENSG00000111897	SERINC1	high
ENSG00000112031	MTRF1L	high
ENSG00000112081	SRSF3	high
ENSG00000112531	QKI	high
ENSG00000112697	TMEM30A	high
ENSG00000113269	RNF130	high
ENSG00000113319	RASGRF2	high
ENSG00000113387	SUB1	high
ENSG00000113558	SKP1	high
ENSG00000113594	LIFR	high
ENSG00000113732	ATP6V0E1	high
ENSG00000115053	NCL	high
ENSG00000115286	NDUFS7	high
ENSG00000115306	SPTBN1	high
ENSG00000115414	FN1	high
ENSG00000115738	ID2	high
ENSG00000115756	HPCAL1	high
ENSG00000115977	AAK1	high
ENSG00000116815	CD58	high
ENSG00000116871	MAP7D1	high
ENSG00000117318	ID3	high
ENSG00000117450	PRDX1	high
ENSG00000117461	PIK3R3	high
ENSG00000117632	STMN1	high
ENSG00000118363	SPCS2	high
ENSG00000118515	SGK1	high
ENSG00000119138	KLF9	high
ENSG00000120594	PLXDC2	high
ENSG00000120690	ELF1	high
ENSG00000120738	EGR1	high
ENSG00000120885	CLU	high
ENSG00000121851	POLR3GL	high
ENSG00000122545	SEPTIN7	high
ENSG00000122705	CLTA	high
ENSG00000123104	ITPR2	high
ENSG00000123358	NR4A1	high
ENSG00000123933	MXD4	high
ENSG00000124193	SRSF6	high
ENSG00000124212	PTGIS	high
ENSG00000124762	CDKN1A	high
ENSG00000124785	NRN1	high
ENSG00000124795	DEK	high
ENSG00000124831	LRRFIP1	high
ENSG00000124942	AHNAK	high
ENSG00000125148	MT2A	high
ENSG00000125266	EFNB2	high
ENSG00000125347	IRF1	high
ENSG00000125534	PPDPF	high
ENSG00000125740	FOSB	high
ENSG00000125944	HNRNPR	high
ENSG00000125968	ID1	high
ENSG00000125971	DYNLRB1	high
ENSG00000125991	ERGIC3	high
ENSG00000125995	ROMO1	high
ENSG00000126247	CAPNS1	high
ENSG00000126267	COX6B1	high
ENSG00000126709	IFI6	high
ENSG00000126878	AIF1L	high
ENSG00000127603	MACF1	high
ENSG00000128016	ZFP36	high
ENSG00000128245	YWHAH	high
ENSG00000128284	APOL3	high
ENSG00000128463	EMC4	high
ENSG00000128595	CALU	high
ENSG00000129128	SPCS3	high
ENSG00000129422	MTUS1	high
ENSG00000129515	SNX6	high
ENSG00000129562	DAD1	high
ENSG00000129757	CDKN1C	high
ENSG00000129824	RPS4Y1	high
ENSG00000130307	USHBP1	high
ENSG00000130396	AFDN	high
ENSG00000130402	ACTN4	high
ENSG00000130702	LAMA5	high
ENSG00000130707	ASS1	high
ENSG00000130724	CHMP2A	high
ENSG00000130725	UBE2M	high
ENSG00000130731	METTL26	high
ENSG00000130787	HIP1R	high
ENSG00000131143	COX4I1	high
ENSG00000131174	COX7B	high
ENSG00000131236	CAP1	high
ENSG00000131446	MGAT1	high
ENSG00000131477	RAMP2	high
ENSG00000131981	LGALS3	high
ENSG00000132470	ITGB4	high
ENSG00000132589	FLOT2	high
ENSG00000133226	SRRM1	high
ENSG00000133318	RTN3	high
ENSG00000133398	MED10	high
ENSG00000133574	GIMAP4	high
ENSG00000134107	BHLHE40	high
ENSG00000134153	EMC7	high
ENSG00000134198	TSPAN2	high
ENSG00000134371	CDC73	high
ENSG00000134825	TMEM258	high
ENSG00000134954	ETS1	high
ENSG00000135218	CD36	high
ENSG00000135363	LMO2	high
ENSG00000135387	CAPRIN1	high
ENSG00000135390	ATP5MC2	high
ENSG00000135486	HNRNPA1	high
ENSG00000135919	SERPINE2	high
ENSG00000135940	COX5B	high
ENSG00000136404	TM6SF1	high
ENSG00000136603	SKIL	high
ENSG00000136810	TXN	high
ENSG00000136819	C9orf78	high
ENSG00000137076	TLN1	high
ENSG00000137312	FLOT1	high
ENSG00000137409	MTCH1	high
ENSG00000137497	NUMA1	high
ENSG00000137573	SULF1	high
ENSG00000137831	UACA	high
ENSG00000137962	ARHGAP29	high
ENSG00000138166	DUSP5	high
ENSG00000138185	ENTPD1	high
ENSG00000138398	PPIG	high
ENSG00000138434	ITPRID2	high
ENSG00000138495	COX17	high
ENSG00000138593	SECISBP2L	high
ENSG00000138594	TMOD3	high
ENSG00000138594	LOC112268148	high
ENSG00000138685	FGF2	high
ENSG00000140105	WARS1	high
ENSG00000140299	BNIP2	high
ENSG00000140391	TSPAN3	high
ENSG00000140564	FURIN	high
ENSG00000140943	MBTPS1	high
ENSG00000140945	CDH13	high
ENSG00000141002	TCF25	high
ENSG00000141753	IGFBP4	high
ENSG00000142546	NOSIP	high
ENSG00000142910	TINAGL1	high
ENSG00000143079	CTTNBP2NL	high
ENSG00000143198	MGST3	high
ENSG00000143384	MCL1	high
ENSG00000143537	ADAM15	high
ENSG00000143669	LYST	high
ENSG00000143761	ARF1	high
ENSG00000143776	CDC42BPA	high
ENSG00000143933	CALM2	high
ENSG00000144224	UBXN4	high
ENSG00000144579	CTDSP1	high
ENSG00000144635	DYNC1LI1	high
ENSG00000144655	CSRNP1	high
ENSG00000144724	PTPRG	high
ENSG00000144746	ARL6IP5	high
ENSG00000144802	NFKBIZ	high
ENSG00000145012	LPP	high
ENSG00000145337	PYURF	high
ENSG00000145990	GFOD1	high
ENSG00000146674	IGFBP3	high
ENSG00000146701	MDH2	high
ENSG00000146963	LUC7L2	high
ENSG00000147526	TACC1	high
ENSG00000148671	ADIRF	high
ENSG00000149115	TNKS1BP1	high
ENSG00000149591	TAGLN	high
ENSG00000150593	PDCD4	high
ENSG00000150630	VEGFC	high
ENSG00000150938	CRIM1	high
ENSG00000151366	NDUFC2	high
ENSG00000151929	BAG3	high
ENSG00000152082	MZT2B	high
ENSG00000152377	SPOCK1	high
ENSG00000152492	CCDC50	high
ENSG00000152818	UTRN	high
ENSG00000153234	NR4A2	high
ENSG00000154175	ABI3BP	high
ENSG00000154518	ATP5MC3	high
ENSG00000154723	ATP5PF	high
ENSG00000154734	ADAMTS1	high
ENSG00000155115	GTF3C6	high
ENSG00000155366	RHOC	high
ENSG00000155368	DBI	high
ENSG00000156052	GNAQ	high
ENSG00000156642	NPTN	high
ENSG00000156976	EIF4A2	high
ENSG00000157150	TIMP4	high
ENSG00000157259	GATAD1	high
ENSG00000157554	ERG	high
ENSG00000157557	ETS2	high
ENSG00000157601	MX1	high
ENSG00000158195	WASF2	high
ENSG00000158710	TAGLN2	high
ENSG00000159069	FBXW5	high
ENSG00000159176	CSRP1	high
ENSG00000159210	SNF8	high
ENSG00000159335	PTMS	high
ENSG00000159388	BTG2	high
ENSG00000160111	CPAMD8	high
ENSG00000160752	FDPS	high
ENSG00000160888	IER2	high
ENSG00000161011	SQSTM1	high
ENSG00000161526	SAP30BP	high
ENSG00000161638	ITGA5	high
ENSG00000162174	ASRGL1	high
ENSG00000162772	ATF3	high
ENSG00000163001	CFAP36	high
ENSG00000163110	PDLIM5	high
ENSG00000163171	CDC42EP3	high
ENSG00000163320	CGGBP1	high
ENSG00000163399	ATP1A1	high
ENSG00000163513	TGFBR2	high
ENSG00000163520	FBLN2	high
ENSG00000163565	IFI16	high
ENSG00000163660	CCNL1	high
ENSG00000163815	CLEC3B	high
ENSG00000164032	H2AZ1	high
ENSG00000164040	PGRMC2	high
ENSG00000164056	SPRY1	high
ENSG00000164111	ANXA5	high
ENSG00000164683	HEY1	high
ENSG00000164687	FABP5	high
ENSG00000164754	RAD21	high
ENSG00000164985	PSIP1	high
ENSG00000165280	VCP	high
ENSG00000165507	DEPP1	high
ENSG00000165669	FAM204A	high
ENSG00000165672	PRDX3	high
ENSG00000165716	DIPK1B	high
ENSG00000165732	DDX21	high
ENSG00000165757	JCAD	high
ENSG00000166164	BRD7	high
ENSG00000166265	CYYR1	high
ENSG00000166503	HDGFL3	high
ENSG00000166750	SLFN5	high
ENSG00000166979	EVA1C	high
ENSG00000167004	PDIA3	high
ENSG00000167244	IGF2	high
ENSG00000167283	ATP5MG	high
ENSG00000167470	MIDN	high
ENSG00000167641	PPP1R14A	high
ENSG00000167644	C19orf33	high
ENSG00000167775	CD320	high
ENSG00000167815	PRDX2	high
ENSG00000167874	TMEM88	high
ENSG00000168066	SF1	high
ENSG00000168175	MAPK1IP1L	high
ENSG00000168209	DDIT4	high
ENSG00000168300	PCMTD1	high
ENSG00000168309	FAM107A	high
ENSG00000168497	CAVIN2	high
ENSG00000168899	VAMP5	high
ENSG00000168994	PXDC1	high
ENSG00000169129	AFAP1L2	high
ENSG00000169564	PCBP1	high
ENSG00000169714	CNBP	high
ENSG00000169744	LDB2	high
ENSG00000169926	KLF13	high
ENSG00000170323	FABP4	high
ENSG00000170345	FOS	high
ENSG00000170989	S1PR1	high
ENSG00000171223	JUNB	high
ENSG00000171634	BPTF	high
ENSG00000172216	CEBPB	high
ENSG00000172354	GNB2	high
ENSG00000172725	CORO1B	high
ENSG00000172889	EGFL7	high
ENSG00000173113	TRMT112	high
ENSG00000173210	ABLIM3	high
ENSG00000173269	MMRN2	high
ENSG00000173482	PTPRM	high
ENSG00000173706	HEG1	high
ENSG00000173821	RNF213	high
ENSG00000174059	CD34	high
ENSG00000174231	PRPF8	high
ENSG00000176340	COX8A	high
ENSG00000176435	CLEC14A	high
ENSG00000177311	ZBTB38	high
ENSG00000177469	CAVIN1	high
ENSG00000177606	JUN	high
ENSG00000177700	POLR2L	high
ENSG00000177733	HNRNPA0	high
ENSG00000177889	UBE2N	high
ENSG00000178726	THBD	high
ENSG00000178878	APOLD1	high
ENSG00000179144	GIMAP7	high
ENSG00000179348	GATA2	high
ENSG00000179776	CDH5	high
ENSG00000181019	NQO1	high
ENSG00000182240	BACE2	high
ENSG00000182492	BGN	high
ENSG00000182511	FES	high
ENSG00000182534	MXRA7	high
ENSG00000182774	RPS17	high
ENSG00000182809	CRIP2	high
ENSG00000182934	SRPRA	high
ENSG00000183283	DAZAP2	high
ENSG00000184897	H1-10	high
ENSG00000185010	F8	high
ENSG00000185022	MAFF	high
ENSG00000185627	PSMD13	high
ENSG00000185787	MORF4L1	high
ENSG00000185825	BCAP31	high
ENSG00000185885	IFITM1	high
ENSG00000186395	KRT10	high
ENSG00000187193	MT1X	high
ENSG00000187244	BCAM	high
ENSG00000187513	GJA4	high
ENSG00000187742	SECISBP2	high
ENSG00000188243	COMMD6	high
ENSG00000188313	PLSCR1	high
ENSG00000188529	SRSF10	high
ENSG00000188559	RALGAPA2	high
ENSG00000189129	PLAC9	high
ENSG00000196141	SPATS2L	high
ENSG00000196199	MPHOSPH8	high
ENSG00000196562	SULF2	high
ENSG00000196924	FLNA	high
ENSG00000196954	CASP4	high
ENSG00000197102	DYNC1H1	high
ENSG00000197448	GSTK1	high
ENSG00000197622	CDC42SE1	high
ENSG00000197694	SPTAN1	high
ENSG00000198399	ITSN2	high
ENSG00000198695	ND6	high
ENSG00000198792	TMEM184B	high
ENSG00000198805	PNP	high
ENSG00000198832	SELENOM	high
ENSG00000198898	CAPZA2	high
ENSG00000198959	TGM2	high
ENSG00000203879	GDI1	high
ENSG00000204301	NOTCH4	high
ENSG00000204388	HSPA1B	high
ENSG00000204392	LSM2	high
ENSG00000205364	MT1M	high
ENSG00000205502	C2CD4B	high
ENSG00000205581	HMGN1	high
ENSG00000211584	SLC48A1	high
ENSG00000211592	IGKC	high
ENSG00000211677	IGLC2	high
ENSG00000212907	ND4L	high
ENSG00000213203	GIMAP1	high
ENSG00000213316	LTC4S	high
ENSG00000213465	ARL2	high
ENSG00000213625	LEPROT	high
ENSG00000215021	PHB2	high
ENSG00000228253	ATP8	high
ENSG00000228474	OST4	high
ENSG00000229807	XIST	high
ENSG00000233016	SNHG7	high
ENSG00000240972	MIF	high
ENSG00000243147	MRPL33	high
ENSG00000245910	SNHG6	high
ENSG00000251322	SHANK3	high
ENSG00000265107	GJA5	high
ENSG00000267107	PCAT19	high
ENSG00000267206	LCN6	high
ENSG00000273149	NA	high
ENSG00000275023	MLLT6	high
ENSG00000275052	PPP4R3B	high
ENSG00000275832	ARHGAP23	high
ENSG00000277791	PSMB3	high
ENSG00000004399	PLXND1	medium
ENSG00000005893	LAMP2	medium
ENSG00000008988	RPS20	medium
ENSG00000011523	CEP68	medium
ENSG00000026025	VIM	medium
ENSG00000042753	AP2S1	medium
ENSG00000065135	GNAI3	medium
ENSG00000082438	COBLL1	medium
ENSG00000087086	FTL	medium
ENSG00000088205	DDX18	medium
ENSG00000092841	MYL6	medium
ENSG00000100697	DICER1	medium
ENSG00000101333	PLCB4	medium
ENSG00000102572	STK24	medium
ENSG00000102908	NFAT5	medium
ENSG00000103275	UBE2I	medium
ENSG00000103942	HOMER2	medium
ENSG00000104763	ASAH1	medium
ENSG00000104852	SNRNP70	medium
ENSG00000105372	RPS19	medium
ENSG00000107290	SETX	medium
ENSG00000107738	VSIR	medium
ENSG00000108312	UBTF	medium
ENSG00000108588	CCDC47	medium
ENSG00000108639	SYNGR2	medium
ENSG00000108654	DDX5	medium
ENSG00000108828	VAT1	medium
ENSG00000109180	OCIAD1	medium
ENSG00000110700	RPS13	medium
ENSG00000112306	RPS12	medium
ENSG00000112378	PERP	medium
ENSG00000112576	CCND3	medium
ENSG00000112699	GMDS	medium
ENSG00000113282	CLINT1	medium
ENSG00000114978	MOB1A	medium
ENSG00000115355	CCDC88A	medium
ENSG00000115419	GLS	medium
ENSG00000117758	STX12	medium
ENSG00000119314	PTBP3	medium
ENSG00000119318	RAD23B	medium
ENSG00000119655	NPC2	medium
ENSG00000120616	EPC1	medium
ENSG00000122862	SRGN	medium
ENSG00000123636	BAZ2B	medium
ENSG00000123684	LPGAT1	medium
ENSG00000125870	SNRPB2	medium
ENSG00000126067	PSMB2	medium
ENSG00000128917	DLL4	medium
ENSG00000129235	TXNDC17	medium
ENSG00000129353	SLC44A2	medium
ENSG00000129538	RNASE1	medium
ENSG00000129968	ABHD17A	medium
ENSG00000130158	DOCK6	medium
ENSG00000131495	NDUFA2	medium
ENSG00000131748	STARD3	medium
ENSG00000132669	RIN2	medium
ENSG00000133703	KRAS	medium
ENSG00000134056	MRPS36	medium
ENSG00000134419	RPS15A	medium
ENSG00000135269	TES	medium
ENSG00000136802	LRRC8A	medium
ENSG00000136942	RPL35	medium
ENSG00000137207	YIPF3	medium
ENSG00000137210	TMEM14B	medium
ENSG00000137818	RPLP1	medium
ENSG00000138326	RPS24	medium
ENSG00000139613	SMARCC2	medium
ENSG00000140545	MFGE8	medium
ENSG00000140988	RPS2	medium
ENSG00000141867	BRD4	medium
ENSG00000142089	IFITM3	medium
ENSG00000143158	MPC2	medium
ENSG00000143799	PARP1	medium
ENSG00000144668	ITGA9	medium
ENSG00000144810	COL8A1	medium
ENSG00000146223	RPL7L1	medium
ENSG00000147454	SLC25A37	medium
ENSG00000147684	NDUFB9	medium
ENSG00000148120	AOPEP	medium
ENSG00000148339	SLC25A25	medium
ENSG00000149806	FAU	medium
ENSG00000149932	TMEM219	medium
ENSG00000151694	ADAM17	medium
ENSG00000152583	SPARCL1	medium
ENSG00000154380	ENAH	medium
ENSG00000156453	PCDH1	medium
ENSG00000158122	PRXL2C	medium
ENSG00000160075	SSU72	medium
ENSG00000163605	PPP4R2	medium
ENSG00000163682	RPL9	medium
ENSG00000163939	PBRM1	medium
ENSG00000165949	IFI27	medium
ENSG00000166033	HTRA1	medium
ENSG00000166226	CCT2	medium
ENSG00000166333	ILK	medium
ENSG00000168394	TAP1	medium
ENSG00000168405	CMAHP	medium
ENSG00000170296	GABARAP	medium
ENSG00000171055	FEZ2	medium
ENSG00000171862	PTEN	medium
ENSG00000171863	RPS7	medium
ENSG00000172493	AFF1	medium
ENSG00000173267	SNCG	medium
ENSG00000173436	MICOS10	medium
ENSG00000174720	LARP7	medium
ENSG00000174749	FAM241A	medium
ENSG00000174886	NDUFA11	medium
ENSG00000176845	METRNL	medium
ENSG00000178691	SUZ12	medium
ENSG00000182118	FAM89A	medium
ENSG00000182307	C8orf33	medium
ENSG00000182899	RPL35A	medium
ENSG00000184113	CLDN5	medium
ENSG00000185883	ATP6V0C	medium
ENSG00000198034	RPS4X	medium
ENSG00000198668	CALM1	medium
ENSG00000198752	CDC42BPB	medium
ENSG00000198804	COX1	medium
ENSG00000204131	NHSL2	medium
ENSG00000204131	FLJ44635	medium
ENSG00000204592	HLA-E	medium
ENSG00000213145	CRIP1	medium
ENSG00000229117	RPL41	medium
ENSG00000234745	HLA-B	medium
ENSG00000265491	RNF115	medium
ENSG00000273749	CYFIP1	medium
