IdentityGene	GeneSymbol	Level
ENSG00000000971	CFH	high
ENSG00000002933	TMEM176A	high
ENSG00000003402	CFLAR	high
ENSG00000004478	FKBP4	high
ENSG00000004779	NDUFAB1	high
ENSG00000004799	PDK4	high
ENSG00000005022	SLC25A5	high
ENSG00000005075	POLR2J	high
ENSG00000005893	LAMP2	high
ENSG00000006327	TNFRSF12A	high
ENSG00000007372	PAX6	high
ENSG00000008018	PSMB1	high
ENSG00000008282	SYPL1	high
ENSG00000008294	SPAG9	high
ENSG00000008394	MGST1	high
ENSG00000008517	IL32	high
ENSG00000008988	RPS20	high
ENSG00000009307	CSDE1	high
ENSG00000010256	UQCRC1	high
ENSG00000010278	CD9	high
ENSG00000010932	FMO1	high
ENSG00000011422	PLAUR	high
ENSG00000012171	SEMA3B	high
ENSG00000013588	GPRC5A	high
ENSG00000014641	MDH1	high
ENSG00000017797	RALBP1	high
ENSG00000021355	SERPINB1	high
ENSG00000023191	RNH1	high
ENSG00000023445	BIRC3	high
ENSG00000026025	VIM	high
ENSG00000026297	RNASET2	high
ENSG00000030582	GRN	high
ENSG00000034510	TMSB10	high
ENSG00000035115	SH3YL1	high
ENSG00000039068	CDH1	high
ENSG00000041357	PSMA4	high
ENSG00000042753	AP2S1	high
ENSG00000044115	CTNNA1	high
ENSG00000047849	MAP4	high
ENSG00000048828	FAM120A	high
ENSG00000049759	NEDD4L	high
ENSG00000050405	LIMA1	high
ENSG00000051108	HERPUD1	high
ENSG00000051523	CYBA	high
ENSG00000051620	HEBP2	high
ENSG00000053371	AKR7A2	high
ENSG00000054148	PHPT1	high
ENSG00000054267	ARID4B	high
ENSG00000054654	SYNE2	high
ENSG00000057608	GDI2	high
ENSG00000060237	WNK1	high
ENSG00000060762	MPC1	high
ENSG00000061676	NCKAP1	high
ENSG00000062716	VMP1	high
ENSG00000063046	EIF4B	high
ENSG00000063177	RPL18	high
ENSG00000064115	TM7SF3	high
ENSG00000064651	SLC12A2	high
ENSG00000065518	NDUFB4	high
ENSG00000065548	ZC3H15	high
ENSG00000065618	COL17A1	high
ENSG00000065809	FAM107B	high
ENSG00000067082	KLF6	high
ENSG00000067225	PKM	high
ENSG00000069011	PITX1	high
ENSG00000069275	NUCKS1	high
ENSG00000069667	RORA	high
ENSG00000069849	ATP1B3	high
ENSG00000070081	NUCB2	high
ENSG00000070831	CDC42	high
ENSG00000071082	RPL31	high
ENSG00000071127	WDR1	high
ENSG00000072364	AFF4	high
ENSG00000072415	MPP5	high
ENSG00000072778	ACADVL	high
ENSG00000073756	PTGS2	high
ENSG00000073803	MAP3K13	high
ENSG00000074071	MRPS34	high
ENSG00000074695	LMAN1	high
ENSG00000074800	ENO1	high
ENSG00000075142	SRI	high
ENSG00000075415	SLC25A3	high
ENSG00000075426	FOSL2	high
ENSG00000076554	TPD52	high
ENSG00000077147	TM9SF3	high
ENSG00000077380	DYNC1I2	high
ENSG00000077549	CAPZB	high
ENSG00000078369	GNB1	high
ENSG00000079246	XRCC5	high
ENSG00000081041	CXCL2	high
ENSG00000081277	PKP1	high
ENSG00000082153	BZW1	high
ENSG00000083845	RPS5	high
ENSG00000083937	CHMP2B	high
ENSG00000084207	GSTP1	high
ENSG00000084623	EIF3I	high
ENSG00000084733	RAB10	high
ENSG00000085063	CD59	high
ENSG00000085117	CD82	high
ENSG00000085224	ATRX	high
ENSG00000085662	AKR1B1	high
ENSG00000085719	CPNE3	high
ENSG00000086062	B4GALT1	high
ENSG00000086065	CHMP5	high
ENSG00000086544	ITPKC	high
ENSG00000086598	TMED2	high
ENSG00000086666	ZFAND6	high
ENSG00000087074	PPP1R15A	high
ENSG00000087191	PSMC5	high
ENSG00000087302	RTRAF	high
ENSG00000087365	SF3B2	high
ENSG00000088832	FKBP1A	high
ENSG00000088986	DYNLL1	high
ENSG00000089009	RPL6	high
ENSG00000089063	TMEM230	high
ENSG00000089157	RPLP0	high
ENSG00000089220	PEBP1	high
ENSG00000089356	FXYD3	high
ENSG00000089693	MLF2	high
ENSG00000089902	RCOR1	high
ENSG00000090013	BLVRB	high
ENSG00000090060	PAPOLA	high
ENSG00000090266	NDUFB2	high
ENSG00000091164	TXNL1	high
ENSG00000091409	ITGA6	high
ENSG00000091986	CCDC80	high
ENSG00000092295	TGM1	high
ENSG00000092621	PHGDH	high
ENSG00000092820	EZR	high
ENSG00000092841	MYL6	high
ENSG00000093010	COMT	high
ENSG00000094975	SUCO	high
ENSG00000096696	DSP	high
ENSG00000096746	HNRNPH3	high
ENSG00000099204	ABLIM1	high
ENSG00000099341	PSMD8	high
ENSG00000099622	CIRBP	high
ENSG00000099783	HNRNPM	high
ENSG00000099797	TECR	high
ENSG00000099800	TIMM13	high
ENSG00000099817	POLR2E	high
ENSG00000099860	GADD45B	high
ENSG00000099968	BCL2L13	high
ENSG00000100097	LGALS1	high
ENSG00000100129	EIF3L	high
ENSG00000100138	SNU13	high
ENSG00000100219	XBP1	high
ENSG00000100300	TSPO	high
ENSG00000100316	RPL3	high
ENSG00000100345	MYH9	high
ENSG00000100387	RBX1	high
ENSG00000100567	PSMA3	high
ENSG00000100568	VTI1B	high
ENSG00000100612	DHRS7	high
ENSG00000100632	ERH	high
ENSG00000100644	HIF1A	high
ENSG00000100650	SRSF5	high
ENSG00000100804	PSMB5	high
ENSG00000100811	YY1	high
ENSG00000100852	ARHGAP5	high
ENSG00000100941	PNN	high
ENSG00000101182	PSMA7	high
ENSG00000101421	CHMP4B	high
ENSG00000101439	CST3	high
ENSG00000101443	WFDC2	high
ENSG00000101558	VAPA	high
ENSG00000101745	ANKRD12	high
ENSG00000101782	RIOK3	high
ENSG00000101911	PRPS2	high
ENSG00000102007	PLP2	high
ENSG00000102144	PGK1	high
ENSG00000102317	RBM3	high
ENSG00000102554	KLF5	high
ENSG00000102786	INTS6	high
ENSG00000102854	MSLN	high
ENSG00000103035	PSMD7	high
ENSG00000103266	STUB1	high
ENSG00000103275	UBE2I	high
ENSG00000103363	ELOB	high
ENSG00000103769	RAB11A	high
ENSG00000104067	TJP1	high
ENSG00000104131	EIF3J	high
ENSG00000104267	CA2	high
ENSG00000104388	RAB2A	high
ENSG00000104408	EIF3E	high
ENSG00000104529	EEF1D	high
ENSG00000104763	ASAH1	high
ENSG00000104765	BNIP3L	high
ENSG00000104823	ECH1	high
ENSG00000104979	C19orf53	high
ENSG00000105185	PDCD5	high
ENSG00000105202	FBL	high
ENSG00000105220	GPI	high
ENSG00000105355	PLIN3	high
ENSG00000105379	ETFB	high
ENSG00000105438	KDELR1	high
ENSG00000105518	TMEM205	high
ENSG00000105568	PPP2R1A	high
ENSG00000105640	RPL18A	high
ENSG00000105669	COPE	high
ENSG00000105701	FKBP8	high
ENSG00000105825	TFPI2	high
ENSG00000105835	NAMPT	high
ENSG00000105855	ITGB8	high
ENSG00000105887	MTPN	high
ENSG00000105887	LUZP6	high
ENSG00000105993	DNAJB6	high
ENSG00000106028	SSBP1	high
ENSG00000106153	CHCHD2	high
ENSG00000106211	HSPB1	high
ENSG00000106244	PDAP1	high
ENSG00000106245	BUD31	high
ENSG00000106299	WASL	high
ENSG00000106355	LSM5	high
ENSG00000106400	ZNHIT1	high
ENSG00000106538	RARRES2	high
ENSG00000106541	AGR2	high
ENSG00000106615	RHEB	high
ENSG00000106682	EIF4H	high
ENSG00000106803	SEC61B	high
ENSG00000106853	PTGR1	high
ENSG00000107223	EDF1	high
ENSG00000107262	BAG1	high
ENSG00000107372	ZFAND5	high
ENSG00000107581	EIF3A	high
ENSG00000107874	CUEDC2	high
ENSG00000108106	UBE2S	high
ENSG00000108107	RPL28	high
ENSG00000108298	RPL19	high
ENSG00000108561	C1QBP	high
ENSG00000108602	ALDH3A1	high
ENSG00000108679	LGALS3BP	high
ENSG00000108953	YWHAE	high
ENSG00000109062	SLC9A3R1	high
ENSG00000109180	OCIAD1	high
ENSG00000109270	LAMTOR3	high
ENSG00000109321	AREG	high
ENSG00000109390	NDUFC1	high
ENSG00000109472	CPE	high
ENSG00000109475	RPL34	high
ENSG00000109787	KLF3	high
ENSG00000109846	CRYAB	high
ENSG00000110092	CCND1	high
ENSG00000110321	EIF4G2	high
ENSG00000110492	MDK	high
ENSG00000110651	CD81	high
ENSG00000110696	C11orf58	high
ENSG00000110700	RPS13	high
ENSG00000110717	NDUFS8	high
ENSG00000110955	ATP5F1B	high
ENSG00000111011	RSRC2	high
ENSG00000111057	KRT18	high
ENSG00000111142	METAP2	high
ENSG00000111229	ARPC3	high
ENSG00000111237	VPS29	high
ENSG00000111275	ALDH2	high
ENSG00000111639	MRPL51	high
ENSG00000111640	GAPDH	high
ENSG00000111669	TPI1	high
ENSG00000111678	C12orf57	high
ENSG00000111716	LDHB	high
ENSG00000111775	COX6A1	high
ENSG00000111786	SRSF9	high
ENSG00000111832	RWDD1	high
ENSG00000111843	TMEM14C	high
ENSG00000111859	NEDD9	high
ENSG00000111897	SERINC1	high
ENSG00000111912	NCOA7	high
ENSG00000112096	SOD2	high
ENSG00000112297	CRYBG1	high
ENSG00000112306	RPS12	high
ENSG00000112335	SNX3	high
ENSG00000112378	PERP	high
ENSG00000112514	CUTA	high
ENSG00000112667	DNPH1	high
ENSG00000112695	COX7A2	high
ENSG00000112715	VEGFA	high
ENSG00000112773	TENT5A	high
ENSG00000112972	HMGCS1	high
ENSG00000113013	HSPA9	high
ENSG00000113070	HBEGF	high
ENSG00000113141	IK	high
ENSG00000113282	CLINT1	high
ENSG00000113558	SKP1	high
ENSG00000113648	MACROH2A1	high
ENSG00000113732	ATP6V0E1	high
ENSG00000113811	SELENOK	high
ENSG00000114125	RNF7	high
ENSG00000114315	HES1	high
ENSG00000114353	GNAI2	high
ENSG00000114354	TFG	high
ENSG00000114391	RPL24	high
ENSG00000114439	BBX	high
ENSG00000114541	FRMD4B	high
ENSG00000114638	UPK1B	high
ENSG00000114784	EIF1B	high
ENSG00000114850	SSR3	high
ENSG00000114861	FOXP1	high
ENSG00000114867	EIF4G1	high
ENSG00000114902	SPCS1	high
ENSG00000114942	EEF1B2	high
ENSG00000114978	MOB1A	high
ENSG00000115053	NCL	high
ENSG00000115091	ACTR3	high
ENSG00000115128	SF3B6	high
ENSG00000115241	PPM1G	high
ENSG00000115268	RPS15	high
ENSG00000115306	SPTBN1	high
ENSG00000115310	RTN4	high
ENSG00000115457	IGFBP2	high
ENSG00000115484	CCT4	high
ENSG00000115524	SF3B1	high
ENSG00000115738	ID2	high
ENSG00000115884	SDC1	high
ENSG00000115944	COX7A2L	high
ENSG00000115963	RND3	high
ENSG00000116030	SUMO1	high
ENSG00000116044	NFE2L2	high
ENSG00000116171	SCP2	high
ENSG00000116209	TMEM59	high
ENSG00000116285	ERRFI1	high
ENSG00000116288	PARK7	high
ENSG00000116459	ATP5PB	high
ENSG00000116539	ASH1L	high
ENSG00000116560	SFPQ	high
ENSG00000116679	IVNS1ABP	high
ENSG00000116717	GADD45A	high
ENSG00000116729	WLS	high
ENSG00000116754	SRSF11	high
ENSG00000116898	MRPS15	high
ENSG00000117139	KDM5B	high
ENSG00000117335	CD46	high
ENSG00000117394	SLC2A1	high
ENSG00000117448	AKR1A1	high
ENSG00000117450	PRDX1	high
ENSG00000117472	TSPAN1	high
ENSG00000117519	CNN3	high
ENSG00000117523	PRRC2C	high
ENSG00000117525	F3	high
ENSG00000117592	PRDX6	high
ENSG00000117595	IRF6	high
ENSG00000117614	SYF2	high
ENSG00000117616	RSRP1	high
ENSG00000117632	STMN1	high
ENSG00000117691	NENF	high
ENSG00000118181	RPS25	high
ENSG00000118363	SPCS2	high
ENSG00000118418	HMGN3	high
ENSG00000118503	TNFAIP3	high
ENSG00000118515	SGK1	high
ENSG00000118640	VAMP8	high
ENSG00000118680	MYL12B	high
ENSG00000118816	CCNI	high
ENSG00000118849	RARRES1	high
ENSG00000118898	PPL	high
ENSG00000118985	ELL2	high
ENSG00000119013	NDUFB3	high
ENSG00000119048	UBE2B	high
ENSG00000119335	SET	high
ENSG00000119396	RAB14	high
ENSG00000119537	KDSR	high
ENSG00000119655	NPC2	high
ENSG00000119705	SLIRP	high
ENSG00000119711	ALDH6A1	high
ENSG00000119801	YPEL5	high
ENSG00000119862	LGALSL	high
ENSG00000119888	EPCAM	high
ENSG00000120306	CYSTM1	high
ENSG00000120438	TCP1	high
ENSG00000120533	ENY2	high
ENSG00000120549	KIAA1217	high
ENSG00000120675	DNAJC15	high
ENSG00000120694	HSPH1	high
ENSG00000120708	TGFBI	high
ENSG00000120742	SERP1	high
ENSG00000120875	DUSP4	high
ENSG00000120885	CLU	high
ENSG00000121552	CSTA	high
ENSG00000121742	GJB6	high
ENSG00000121774	KHDRBS1	high
ENSG00000122026	RPL21	high
ENSG00000122359	ANXA11	high
ENSG00000122786	CALD1	high
ENSG00000122861	PLAU	high
ENSG00000122873	CISD1	high
ENSG00000123144	TRIR	high
ENSG00000123179	EBPL	high
ENSG00000123349	PFDN5	high
ENSG00000123562	MORF4L2	high
ENSG00000124107	SLPI	high
ENSG00000124145	SDC4	high
ENSG00000124171	PARD6B	high
ENSG00000124172	ATP5F1E	high
ENSG00000124466	LYPD3	high
ENSG00000124614	RPS10	high
ENSG00000124762	CDKN1A	high
ENSG00000124766	SOX4	high
ENSG00000124795	DEK	high
ENSG00000125144	MT1G	high
ENSG00000125148	MT2A	high
ENSG00000125356	NDUFA1	high
ENSG00000125398	SOX9	high
ENSG00000125534	PPDPF	high
ENSG00000125652	ALKBH7	high
ENSG00000125691	RPL23	high
ENSG00000125730	C3	high
ENSG00000125743	SNRPD2	high
ENSG00000125835	SNRPB	high
ENSG00000125844	RRBP1	high
ENSG00000125944	HNRNPR	high
ENSG00000125968	ID1	high
ENSG00000125971	DYNLRB1	high
ENSG00000125991	ERGIC3	high
ENSG00000125995	ROMO1	high
ENSG00000126005	MMP24OS	high
ENSG00000126067	PSMB2	high
ENSG00000126247	CAPNS1	high
ENSG00000126267	COX6B1	high
ENSG00000126432	PRDX5	high
ENSG00000126698	DNAJC8	high
ENSG00000126777	KTN1	high
ENSG00000126934	MAP2K2	high
ENSG00000127184	COX7C	high
ENSG00000127314	RAP1B	high
ENSG00000127540	UQCR11	high
ENSG00000127603	MACF1	high
ENSG00000127824	TUBA4A	high
ENSG00000127838	PNKD	high
ENSG00000127884	ECHS1	high
ENSG00000127914	AKAP9	high
ENSG00000127920	GNG11	high
ENSG00000127922	SEM1	high
ENSG00000128245	YWHAH	high
ENSG00000128272	ATF4	high
ENSG00000128309	MPST	high
ENSG00000128311	TST	high
ENSG00000128383	APOBEC3A	high
ENSG00000128383	APOBEC3A_B	high
ENSG00000128422	KRT17	high
ENSG00000128609	NDUFA5	high
ENSG00000129084	PSMA1	high
ENSG00000129194	SOX15	high
ENSG00000129235	TXNDC17	high
ENSG00000129538	RNASE1	high
ENSG00000129559	NEDD8	high
ENSG00000129562	DAD1	high
ENSG00000129625	REEP5	high
ENSG00000129824	RPS4Y1	high
ENSG00000130066	SAT1	high
ENSG00000130164	LDLR	high
ENSG00000130255	RPL36	high
ENSG00000130312	MRPL34	high
ENSG00000130313	PGLS	high
ENSG00000130332	LSM7	high
ENSG00000130396	AFDN	high
ENSG00000130402	ACTN4	high
ENSG00000130520	LSM4	high
ENSG00000130707	ASS1	high
ENSG00000130724	CHMP2A	high
ENSG00000130725	UBE2M	high
ENSG00000130741	EIF2S3	high
ENSG00000130779	CLIP1	high
ENSG00000130811	EIF3G	high
ENSG00000131051	RBM39	high
ENSG00000131100	ATP6V1E1	high
ENSG00000131143	COX4I1	high
ENSG00000131171	SH3BGRL	high
ENSG00000131174	COX7B	high
ENSG00000131236	CAP1	high
ENSG00000131469	RPL27	high
ENSG00000131495	NDUFA2	high
ENSG00000131981	LGALS3	high
ENSG00000132002	DNAJB1	high
ENSG00000132341	RAN	high
ENSG00000132424	PNISR	high
ENSG00000132432	SEC61G	high
ENSG00000132507	EIF5A	high
ENSG00000132510	KDM6B	high
ENSG00000132698	RAB25	high
ENSG00000132963	POMP	high
ENSG00000133112	TPT1	high
ENSG00000133142	TCEAL4	high
ENSG00000133321	PLAAT4	high
ENSG00000133639	BTG1	high
ENSG00000133872	SARAF	high
ENSG00000134056	MRPS36	high
ENSG00000134107	BHLHE40	high
ENSG00000134202	GSTM3	high
ENSG00000134419	RPS15A	high
ENSG00000134440	NARS1	high
ENSG00000134531	EMP1	high
ENSG00000134644	PUM1	high
ENSG00000134755	DSC2	high
ENSG00000134757	DSG3	high
ENSG00000134760	DSG1	high
ENSG00000134762	DSC3	high
ENSG00000135046	ANXA1	high
ENSG00000135069	PSAT1	high
ENSG00000135316	SYNCRIP	high
ENSG00000135373	EHF	high
ENSG00000135378	PRRG4	high
ENSG00000135390	ATP5MC2	high
ENSG00000135480	KRT7	high
ENSG00000135486	HNRNPA1	high
ENSG00000135624	CCT7	high
ENSG00000135821	GLUL	high
ENSG00000135940	COX5B	high
ENSG00000136003	ISCU	high
ENSG00000136153	LMO7	high
ENSG00000136156	ITM2B	high
ENSG00000136238	RAC1	high
ENSG00000136240	KDELR2	high
ENSG00000136521	NDUFB5	high
ENSG00000136689	IL1RN	high
ENSG00000136810	TXN	high
ENSG00000136826	KLF4	high
ENSG00000136888	ATP6V1G1	high
ENSG00000136930	PSMB7	high
ENSG00000136938	ANP32B	high
ENSG00000136942	RPL35	high
ENSG00000136943	CTSV	high
ENSG00000136997	MYC	high
ENSG00000137154	RPS6	high
ENSG00000137210	TMEM14B	high
ENSG00000137288	UQCC2	high
ENSG00000137309	HMGA1	high
ENSG00000137331	IER3	high
ENSG00000137364	TPMT	high
ENSG00000137409	MTCH1	high
ENSG00000137440	FGFBP1	high
ENSG00000137463	MGARP	high
ENSG00000137575	SDCBP	high
ENSG00000137673	MMP7	high
ENSG00000137693	YAP1	high
ENSG00000137699	TRIM29	high
ENSG00000137714	FDX1	high
ENSG00000137815	RTF1	high
ENSG00000137818	RPLP1	high
ENSG00000137876	RSL24D1	high
ENSG00000137975	CLCA2	high
ENSG00000138069	RAB1A	high
ENSG00000138071	ACTR2	high
ENSG00000138085	ATRAID	high
ENSG00000138166	DUSP5	high
ENSG00000138279	ANXA7	high
ENSG00000138326	RPS24	high
ENSG00000138385	SSB	high
ENSG00000138495	COX17	high
ENSG00000138594	TMOD3	high
ENSG00000138594	LOC112268148	high
ENSG00000138668	HNRNPD	high
ENSG00000138674	SEC31A	high
ENSG00000139112	GABARAPL1	high
ENSG00000139116	KIF21A	high
ENSG00000139168	ZCRB1	high
ENSG00000139218	SCAF11	high
ENSG00000139343	SNRPF	high
ENSG00000139684	ESD	high
ENSG00000139687	RB1	high
ENSG00000140264	SERF2	high
ENSG00000140307	GTF2A2	high
ENSG00000140365	COMMD4	high
ENSG00000140391	TSPAN3	high
ENSG00000140416	TPM1	high
ENSG00000140575	IQGAP1	high
ENSG00000140612	SEC11A	high
ENSG00000140740	UQCRC2	high
ENSG00000140988	RPS2	high
ENSG00000141002	TCF25	high
ENSG00000141232	TOB1	high
ENSG00000141401	IMPA2	high
ENSG00000141447	OSBPL1A	high
ENSG00000141522	ARHGDIA	high
ENSG00000141552	ANAPC11	high
ENSG00000141579	ZNF750	high
ENSG00000141682	PMAIP1	high
ENSG00000141753	IGFBP4	high
ENSG00000141867	BRD4	high
ENSG00000141905	NFIC	high
ENSG00000141934	PLPP2	high
ENSG00000142089	IFITM3	high
ENSG00000142168	SOD1	high
ENSG00000142192	APP	high
ENSG00000142507	PSMB6	high
ENSG00000142541	RPL13A	high
ENSG00000142627	EPHA2	high
ENSG00000142676	RPL11	high
ENSG00000142864	SERBP1	high
ENSG00000142871	CCN1	high
ENSG00000142937	RPS8	high
ENSG00000142949	PTPRF	high
ENSG00000143153	ATP1B1	high
ENSG00000143158	MPC2	high
ENSG00000143183	TMCO1	high
ENSG00000143198	MGST3	high
ENSG00000143217	NECTIN4	high
ENSG00000143222	UFC1	high
ENSG00000143252	SDHC	high
ENSG00000143256	PFDN2	high
ENSG00000143321	HDGF	high
ENSG00000143384	MCL1	high
ENSG00000143420	ENSA	high
ENSG00000143543	JTB	high
ENSG00000143546	S100A8	high
ENSG00000143612	C1orf43	high
ENSG00000143621	ILF2	high
ENSG00000143727	ACP1	high
ENSG00000143742	SRP9	high
ENSG00000143761	ARF1	high
ENSG00000143947	RPS27A	high
ENSG00000143977	SNRPG	high
ENSG00000144136	SLC20A1	high
ENSG00000144224	UBXN4	high
ENSG00000144560	VGLL4	high
ENSG00000144674	GOLGA4	high
ENSG00000144713	RPL32	high
ENSG00000144746	ARL6IP5	high
ENSG00000144802	NFKBIZ	high
ENSG00000145247	OCIAD2	high
ENSG00000145390	USP53	high
ENSG00000145425	RPS3A	high
ENSG00000145494	NDUFS6	high
ENSG00000145592	RPL37	high
ENSG00000145741	BTF3	high
ENSG00000145824	CXCL14	high
ENSG00000145860	RNF145	high
ENSG00000145907	G3BP1	high
ENSG00000145912	NHP2	high
ENSG00000146066	HIGD2A	high
ENSG00000146386	ABRACL	high
ENSG00000146425	DYNLT1	high
ENSG00000146457	WTAP	high
ENSG00000146701	MDH2	high
ENSG00000146729	NIPSNAP2	high
ENSG00000146731	CCT6A	high
ENSG00000147123	NDUFB11	high
ENSG00000147140	NONO	high
ENSG00000147155	EBP	high
ENSG00000147403	RPL10	high
ENSG00000147604	RPL7	high
ENSG00000147669	POLR2K	high
ENSG00000147676	MAL2	high
ENSG00000147677	EIF3H	high
ENSG00000147684	NDUFB9	high
ENSG00000147689	FAM83A	high
ENSG00000147862	NFIB	high
ENSG00000147883	CDKN2B	high
ENSG00000148180	GSN	high
ENSG00000148303	RPL7A	high
ENSG00000148346	LCN2	high
ENSG00000148671	ADIRF	high
ENSG00000148834	GSTO1	high
ENSG00000149043	SYT8	high
ENSG00000149100	EIF3M	high
ENSG00000149273	RPS3	high
ENSG00000149418	ST14	high
ENSG00000149573	MPZL2	high
ENSG00000149932	TMEM219	high
ENSG00000150347	ARID5B	high
ENSG00000150459	SAP18	high
ENSG00000150593	PDCD4	high
ENSG00000150753	CCT5	high
ENSG00000150779	TIMM8B	high
ENSG00000150782	IL18	high
ENSG00000150991	UBC	high
ENSG00000151353	TMEM18	high
ENSG00000151366	NDUFC2	high
ENSG00000151632	AKR1C2	high
ENSG00000151729	SLC25A4	high
ENSG00000151914	DST	high
ENSG00000152082	MZT2B	high
ENSG00000152234	ATP5F1A	high
ENSG00000152558	TMEM123	high
ENSG00000152661	GJA1	high
ENSG00000153048	CARHSP1	high
ENSG00000153071	DAB2	high
ENSG00000153071	LOC112267931	high
ENSG00000153113	CAST	high
ENSG00000153774	CFDP1	high
ENSG00000154447	SH3RF1	high
ENSG00000154518	ATP5MC3	high
ENSG00000154639	CXADR	high
ENSG00000154723	ATP5PF	high
ENSG00000155366	RHOC	high
ENSG00000155368	DBI	high
ENSG00000155850	SLC26A2	high
ENSG00000155957	TMBIM4	high
ENSG00000156261	CCT8	high
ENSG00000156411	ATP5MPL	high
ENSG00000156482	RPL30	high
ENSG00000156508	EEF1A1	high
ENSG00000156675	RAB11FIP1	high
ENSG00000156976	EIF4A2	high
ENSG00000157557	ETS2	high
ENSG00000157916	RER1	high
ENSG00000158195	WASF2	high
ENSG00000158417	EIF5B	high
ENSG00000158716	DUSP23	high
ENSG00000158769	F11R	high
ENSG00000158864	NDUFS2	high
ENSG00000159166	LAD1	high
ENSG00000159199	ATP5MC1	high
ENSG00000159228	CBR1	high
ENSG00000159377	PSMB4	high
ENSG00000159388	BTG2	high
ENSG00000159763	PIP	high
ENSG00000160014	CALM3	high
ENSG00000160075	SSU72	high
ENSG00000160194	NDUFV3	high
ENSG00000160678	S100A1	high
ENSG00000160752	FDPS	high
ENSG00000160799	CCDC12	high
ENSG00000160862	AZGP1	high
ENSG00000160888	IER2	high
ENSG00000160932	LY6E	high
ENSG00000161011	SQSTM1	high
ENSG00000161016	RPL8	high
ENSG00000161203	AP2M1	high
ENSG00000161249	DMKN	high
ENSG00000161798	AQP5	high
ENSG00000161970	RPL26	high
ENSG00000162191	UBXN1	high
ENSG00000162244	RPL29	high
ENSG00000162366	PDZK1IP1	high
ENSG00000162434	JAK1	high
ENSG00000162545	CAMK2N1	high
ENSG00000162599	NFIA	high
ENSG00000162772	ATF3	high
ENSG00000162896	PIGR	high
ENSG00000162909	CAPN2	high
ENSG00000163110	PDLIM5	high
ENSG00000163191	S100A11	high
ENSG00000163216	SPRR2D	high
ENSG00000163220	S100A9	high
ENSG00000163331	DAPL1	high
ENSG00000163347	CLDN1	high
ENSG00000163399	ATP1A1	high
ENSG00000163435	ELF3	high
ENSG00000163466	ARPC2	high
ENSG00000163468	CCT3	high
ENSG00000163541	SUCLG1	high
ENSG00000163565	IFI16	high
ENSG00000163584	RPL22L1	high
ENSG00000163597	SNHG16	high
ENSG00000163629	PTPN13	high
ENSG00000163634	THOC7	high
ENSG00000163659	TIPARP	high
ENSG00000163682	RPL9	high
ENSG00000163694	RBM47	high
ENSG00000163931	TKT	high
ENSG00000164039	BDH2	high
ENSG00000164056	SPRY1	high
ENSG00000164096	C4orf3	high
ENSG00000164346	NSA2	high
ENSG00000164405	UQCRQ	high
ENSG00000164587	RPS14	high
ENSG00000164687	FABP5	high
ENSG00000164825	DEFB1	high
ENSG00000164924	YWHAZ	high
ENSG00000165092	ALDH1A1	high
ENSG00000165119	HNRNPK	high
ENSG00000165215	CLDN3	high
ENSG00000165264	NDUFB6	high
ENSG00000165272	AQP3	high
ENSG00000165280	VCP	high
ENSG00000165474	GJB2	high
ENSG00000165475	CRYL1	high
ENSG00000165502	RPL36AL	high
ENSG00000165527	ARF6	high
ENSG00000165637	VDAC2	high
ENSG00000165672	PRDX3	high
ENSG00000165678	GHITM	high
ENSG00000165732	DDX21	high
ENSG00000165795	NDRG2	high
ENSG00000165916	PSMC3	high
ENSG00000165949	IFI27	high
ENSG00000166012	TAF1D	high
ENSG00000166136	NDUFB8	high
ENSG00000166145	SPINT1	high
ENSG00000166226	CCT2	high
ENSG00000166228	PCBD1	high
ENSG00000166295	ANAPC16	high
ENSG00000166347	CYB5A	high
ENSG00000166483	WEE1	high
ENSG00000166562	SEC11C	high
ENSG00000166681	BEX3	high
ENSG00000166794	PPIB	high
ENSG00000166848	TERF2IP	high
ENSG00000166848	LOC105371348	high
ENSG00000166913	YWHAB	high
ENSG00000167004	PDIA3	high
ENSG00000167085	PHB	high
ENSG00000167088	SNRPD1	high
ENSG00000167283	ATP5MG	high
ENSG00000167460	TPM4	high
ENSG00000167468	GPX4	high
ENSG00000167470	MIDN	high
ENSG00000167526	RPL13	high
ENSG00000167552	TUBA1A	high
ENSG00000167553	TUBA1C	high
ENSG00000167642	SPINT2	high
ENSG00000167644	C19orf33	high
ENSG00000167656	LY6D	high
ENSG00000167658	EEF2	high
ENSG00000167757	KLK11	high
ENSG00000167797	CDK2AP2	high
ENSG00000167863	ATP5PD	high
ENSG00000167969	ECI1	high
ENSG00000168003	SLC3A2	high
ENSG00000168028	RPSA	high
ENSG00000168036	CTNNB1	high
ENSG00000168118	RAB4A	high
ENSG00000168209	DDIT4	high
ENSG00000168374	ARF4	high
ENSG00000168528	SERINC2	high
ENSG00000168653	NDUFS5	high
ENSG00000168710	AHCYL1	high
ENSG00000168894	RNF181	high
ENSG00000169020	ATP5ME	high
ENSG00000169021	UQCRFS1	high
ENSG00000169045	HNRNPH1	high
ENSG00000169223	LMAN2	high
ENSG00000169230	PRELID1	high
ENSG00000169429	CXCL8	high
ENSG00000169469	SPRR1B	high
ENSG00000169564	PCBP1	high
ENSG00000169567	HINT1	high
ENSG00000169714	CNBP	high
ENSG00000169715	MT1E	high
ENSG00000169738	DCXR	high
ENSG00000169756	LIMS1	high
ENSG00000169764	UGP2	high
ENSG00000169905	TOR1AIP2	high
ENSG00000169908	TM4SF1	high
ENSG00000169976	SF3B5	high
ENSG00000170027	YWHAG	high
ENSG00000170144	HNRNPA3	high
ENSG00000170345	FOS	high
ENSG00000170348	TMED10	high
ENSG00000170421	KRT8	high
ENSG00000170540	ARL6IP1	high
ENSG00000170759	KIF5B	high
ENSG00000170860	LSM3	high
ENSG00000170889	RPS9	high
ENSG00000170906	NDUFA3	high
ENSG00000171159	C9orf16	high
ENSG00000171222	SCAND1	high
ENSG00000171223	JUNB	high
ENSG00000171234	UGT2B7	high
ENSG00000171314	PGAM1	high
ENSG00000171345	KRT19	high
ENSG00000171346	KRT15	high
ENSG00000171401	KRT13	high
ENSG00000171476	HOPX	high
ENSG00000171490	RSL1D1	high
ENSG00000171530	TBCA	high
ENSG00000171735	CAMTA1	high
ENSG00000171858	RPS21	high
ENSG00000171863	RPS7	high
ENSG00000171867	PRNP	high
ENSG00000172005	MAL	high
ENSG00000172201	ID4	high
ENSG00000172216	CEBPB	high
ENSG00000172270	BSG	high
ENSG00000172354	GNB2	high
ENSG00000172428	COPS9	high
ENSG00000172531	PPP1CA	high
ENSG00000172590	MRPL52	high
ENSG00000172757	CFL1	high
ENSG00000173113	TRMT112	high
ENSG00000173141	MRPL57	high
ENSG00000173230	GOLGB1	high
ENSG00000173272	MZT2A	high
ENSG00000173334	TRIB1	high
ENSG00000173436	MICOS10	high
ENSG00000173457	PPP1R14B	high
ENSG00000173660	UQCRH	high
ENSG00000173674	EIF1AX	high
ENSG00000173801	JUP	high
ENSG00000173812	EIF1	high
ENSG00000173848	NET1	high
ENSG00000173915	ATP5MD	high
ENSG00000174021	GNG5	high
ENSG00000174444	RPL4	high
ENSG00000174718	RESF1	high
ENSG00000174748	RPL15	high
ENSG00000174886	NDUFA11	high
ENSG00000174917	MICOS13	high
ENSG00000175029	CTBP2	high
ENSG00000175061	SNHG29	high
ENSG00000175130	MARCKSL1	high
ENSG00000175166	PSMD2	high
ENSG00000175183	CSRP2	high
ENSG00000175334	BANF1	high
ENSG00000175390	EIF3F	high
ENSG00000175416	CLTB	high
ENSG00000175592	FOSL1	high
ENSG00000175756	AURKAIP1	high
ENSG00000175793	SFN	high
ENSG00000175906	ARL4D	high
ENSG00000175984	DENND2C	high
ENSG00000176046	NUPR1	high
ENSG00000176153	GPX2	high
ENSG00000176171	BNIP3	high
ENSG00000176340	COX8A	high
ENSG00000176597	B3GNT5	high
ENSG00000176731	RBIS	high
ENSG00000176845	METRNL	high
ENSG00000176915	ANKLE2	high
ENSG00000177156	TALDO1	high
ENSG00000177410	ZFAS1	high
ENSG00000177426	TGIF1	high
ENSG00000177459	ERICH5	high
ENSG00000177556	ATOX1	high
ENSG00000177600	RPLP2	high
ENSG00000177606	JUN	high
ENSG00000177697	CD151	high
ENSG00000177700	POLR2L	high
ENSG00000177879	AP3S1	high
ENSG00000178035	IMPDH2	high
ENSG00000178057	NDUFAF3	high
ENSG00000178363	CALML3	high
ENSG00000178573	MAF	high
ENSG00000178741	COX5A	high
ENSG00000178934	LGALS7	high
ENSG00000178934	LGALS7B	high
ENSG00000178951	ZBTB7A	high
ENSG00000178952	TUFM	high
ENSG00000178982	EIF3K	high
ENSG00000179010	MRFAP1	high
ENSG00000179091	CYC1	high
ENSG00000179218	CALR	high
ENSG00000179262	RAD23A	high
ENSG00000179271	GADD45GIP1	high
ENSG00000179820	MYADM	high
ENSG00000179862	CITED4	high
ENSG00000180398	MCFD2	high
ENSG00000180530	NRIP1	high
ENSG00000180817	PPA1	high
ENSG00000181019	NQO1	high
ENSG00000181061	HIGD1A	high
ENSG00000181143	MUC16	high
ENSG00000181163	NPM1	high
ENSG00000181350	LRRC75A	high
ENSG00000181467	RAP2B	high
ENSG00000181649	PHLDA2	high
ENSG00000181885	CLDN7	high
ENSG00000181924	COA4	high
ENSG00000182004	SNRPE	high
ENSG00000182054	IDH2	high
ENSG00000182117	NOP10	high
ENSG00000182196	ARL6IP4	high
ENSG00000182551	ADI1	high
ENSG00000182670	TTC3	high
ENSG00000182718	ANXA2	high
ENSG00000182774	RPS17	high
ENSG00000182795	C1orf116	high
ENSG00000182899	RPL35A	high
ENSG00000183011	NAA38	high
ENSG00000183255	PTTG1IP	high
ENSG00000183291	SELENOF	high
ENSG00000183648	NDUFB1	high
ENSG00000183696	UPP1	high
ENSG00000183978	COA3	high
ENSG00000184007	PTP4A2	high
ENSG00000184009	ACTG1	high
ENSG00000184076	UQCR10	high
ENSG00000184254	ALDH1A3	high
ENSG00000184292	TACSTD2	high
ENSG00000184557	SOCS3	high
ENSG00000184840	TMED9	high
ENSG00000184983	NDUFA6	high
ENSG00000184990	SIVA1	high
ENSG00000185022	MAFF	high
ENSG00000185043	CIB1	high
ENSG00000185088	RPS27L	high
ENSG00000185201	IFITM2	high
ENSG00000185222	TCEAL9	high
ENSG00000185432	METTL7A	high
ENSG00000185479	KRT6B	high
ENSG00000185499	MUC1	high
ENSG00000185608	MRPL40	high
ENSG00000185624	P4HB	high
ENSG00000185650	ZFP36L1	high
ENSG00000185651	UBE2L3	high
ENSG00000185787	MORF4L1	high
ENSG00000185825	BCAP31	high
ENSG00000186010	NDUFA13	high
ENSG00000186081	KRT5	high
ENSG00000186184	POLR1D	high
ENSG00000186395	KRT10	high
ENSG00000186442	KRT3	high
ENSG00000186468	RPS23	high
ENSG00000186591	UBE2H	high
ENSG00000186832	KRT16	high
ENSG00000186847	KRT14	high
ENSG00000187134	AKR1C1	high
ENSG00000187193	MT1X	high
ENSG00000187242	KRT12	high
ENSG00000187479	C11orf96	high
ENSG00000188243	COMMD6	high
ENSG00000188483	IER5L	high
ENSG00000188612	SUMO2	high
ENSG00000188643	S100A16	high
ENSG00000188846	RPL14	high
ENSG00000189043	NDUFA4	high
ENSG00000189143	CLDN4	high
ENSG00000189171	S100A13	high
ENSG00000189221	MAOA	high
ENSG00000189266	PNRC2	high
ENSG00000189334	S100A14	high
ENSG00000189377	CXCL17	high
ENSG00000196154	S100A4	high
ENSG00000196230	TUBB	high
ENSG00000196262	PPIA	high
ENSG00000196352	CD55	high
ENSG00000196419	XRCC6	high
ENSG00000196428	TSC22D2	high
ENSG00000196504	PRPF40A	high
ENSG00000196531	NACA	high
ENSG00000196683	TOMM7	high
ENSG00000196754	S100A2	high
ENSG00000196878	LAMB3	high
ENSG00000196975	ANXA4	high
ENSG00000197448	GSTK1	high
ENSG00000197728	RPS26	high
ENSG00000197746	PSAP	high
ENSG00000197747	S100A10	high
ENSG00000197756	RPL37A	high
ENSG00000197894	ADH5	high
ENSG00000197956	S100A6	high
ENSG00000197958	RPL12	high
ENSG00000197982	C1orf122	high
ENSG00000198034	RPS4X	high
ENSG00000198242	RPL23A	high
ENSG00000198258	UBL5	high
ENSG00000198355	PIM3	high
ENSG00000198363	ASPH	high
ENSG00000198431	TXNRD1	high
ENSG00000198435	NRARP	high
ENSG00000198561	CTNND1	high
ENSG00000198643	FAM3D	high
ENSG00000198668	CALM1	high
ENSG00000198695	ND6	high
ENSG00000198712	COX2	high
ENSG00000198755	RPL10A	high
ENSG00000198804	COX1	high
ENSG00000198830	HMGN2	high
ENSG00000198856	OSTC	high
ENSG00000198886	ND4	high
ENSG00000198899	ATP6	high
ENSG00000198900	TOP1	high
ENSG00000198938	COX3	high
ENSG00000203875	SNHG5	high
ENSG00000204256	BRD2	high
ENSG00000204389	HSPA1A	high
ENSG00000204574	ABCF1	high
ENSG00000204628	RACK1	high
ENSG00000205403	CFI	high
ENSG00000205420	KRT6A	high
ENSG00000205542	TMSB4X	high
ENSG00000205544	TMEM256	high
ENSG00000206075	SERPINB5	high
ENSG00000210082	NA	high
ENSG00000211445	GPX3	high
ENSG00000211450	SELENOH	high
ENSG00000211459	NA	high
ENSG00000213465	ARL2	high
ENSG00000213625	LEPROT	high
ENSG00000213639	PPP1CB	high
ENSG00000213741	RPS29	high
ENSG00000214026	MRPL23	high
ENSG00000214026	LOC107987373	high
ENSG00000214253	FIS1	high
ENSG00000215845	TSTD1	high
ENSG00000220205	VAMP2	high
ENSG00000221983	UBA52	high
ENSG00000225921	NOL7	high
ENSG00000225972	MTND1P23	high
ENSG00000226950	DANCR	high
ENSG00000228253	ATP8	high
ENSG00000228474	OST4	high
ENSG00000229117	RPL41	high
ENSG00000229833	PET100	high
ENSG00000230202	NA	high
ENSG00000230937	MIR205HG	high
ENSG00000230989	HSBP1	high
ENSG00000231500	RPS18	high
ENSG00000231925	TAPBP	high
ENSG00000232112	TMA7	high
ENSG00000232388	SMIM26	high
ENSG00000233016	SNHG7	high
ENSG00000233276	GPX1	high
ENSG00000233927	RPS28	high
ENSG00000234741	GAS5	high
ENSG00000235162	C12orf75	high
ENSG00000236782	NA	high
ENSG00000237973	MTCO1P12	high
ENSG00000240583	AQP1	high
ENSG00000240972	MIF	high
ENSG00000241343	RPL36A	high
ENSG00000241468	ATP5MF	high
ENSG00000241794	SPRR2A	high
ENSG00000241837	ATP5PO	high
ENSG00000242372	EIF6	high
ENSG00000242485	MRPL20	high
ENSG00000243147	MRPL33	high
ENSG00000243317	STMP1	high
ENSG00000243449	C4orf48	high
ENSG00000244754	N4BP2L2	high
ENSG00000248527	MTATP6P1	high
ENSG00000250479	CHCHD10	high
ENSG00000254999	BRK1	high
ENSG00000255112	CHMP1B	high
ENSG00000255302	EID1	high
ENSG00000257727	CNPY2	high
ENSG00000260032	NORAD	high
ENSG00000260260	SNHG19	high
ENSG00000261040	WFDC21P	high
ENSG00000265681	RPL17	high
ENSG00000266472	MRPS21	high
ENSG00000267519	NA	high
ENSG00000267795	SMIM22	high
ENSG00000272047	GTF2H5	high
ENSG00000272398	CD24	high
ENSG00000272888	NA	high
ENSG00000277791	PSMB3	high
ENSG00000285417	NA	high
ENSG00000005810	MYCBP2	medium
ENSG00000010244	ZNF207	medium
ENSG00000011304	PTBP1	medium
ENSG00000011638	TMEM159	medium
ENSG00000014216	CAPN1	medium
ENSG00000023287	RB1CC1	medium
ENSG00000025039	RRAGD	medium
ENSG00000029363	BCLAF1	medium
ENSG00000035141	FAM136A	medium
ENSG00000037241	RPL26L1	medium
ENSG00000038274	MAT2B	medium
ENSG00000048544	MRPS10	medium
ENSG00000049245	VAMP3	medium
ENSG00000054116	TRAPPC3	medium
ENSG00000061794	MRPS35	medium
ENSG00000062194	GPBP1	medium
ENSG00000063245	EPN1	medium
ENSG00000065000	AP3D1	medium
ENSG00000065613	SLK	medium
ENSG00000071994	PDCD2	medium
ENSG00000072134	EPN2	medium
ENSG00000075785	RAB7A	medium
ENSG00000076604	TRAF4	medium
ENSG00000077312	SNRPA	medium
ENSG00000078902	TOLLIP	medium
ENSG00000080608	PUM3	medium
ENSG00000082515	MRPL22	medium
ENSG00000083896	YTHDC1	medium
ENSG00000084463	WBP11	medium
ENSG00000085733	CTTN	medium
ENSG00000086504	MRPL28	medium
ENSG00000087884	AAMDC	medium
ENSG00000088002	SULT2B1	medium
ENSG00000088833	NSFL1C	medium
ENSG00000089597	GANAB	medium
ENSG00000090989	EXOC1	medium
ENSG00000091039	OSBPL8	medium
ENSG00000091483	FH	medium
ENSG00000092010	PSME1	medium
ENSG00000092068	SLC7A8	medium
ENSG00000095139	ARCN1	medium
ENSG00000096060	FKBP5	medium
ENSG00000096401	CDC5L	medium
ENSG00000099901	RANBP1	medium
ENSG00000100075	SLC25A1	medium
ENSG00000100347	SAMM50	medium
ENSG00000100911	PSME2	medium
ENSG00000101040	ZMYND8	medium
ENSG00000101365	IDH3B	medium
ENSG00000101654	RNMT	medium
ENSG00000101856	PGRMC1	medium
ENSG00000102158	MAGT1	medium
ENSG00000103254	ANTKMT	medium
ENSG00000103485	QPRT	medium
ENSG00000104419	NDRG1	medium
ENSG00000104522	GFUS	medium
ENSG00000104852	SNRNP70	medium
ENSG00000105258	POLR2I	medium
ENSG00000105364	MRPL4	medium
ENSG00000105372	RPS19	medium
ENSG00000105443	CYTH2	medium
ENSG00000105699	LSR	medium
ENSG00000105953	OGDH	medium
ENSG00000106052	TAX1BP1	medium
ENSG00000108256	NUFIP2	medium
ENSG00000108828	VAT1	medium
ENSG00000109171	SLAIN2	medium
ENSG00000109519	GRPEL1	medium
ENSG00000110400	NECTIN1	medium
ENSG00000111321	LTBR	medium
ENSG00000112305	SMAP1	medium
ENSG00000113384	GOLPH3	medium
ENSG00000114503	NCBP2	medium
ENSG00000114796	KLHL24	medium
ENSG00000115129	TP53I3	medium
ENSG00000115286	NDUFS7	medium
ENSG00000115364	MRPL19	medium
ENSG00000115520	COQ10B	medium
ENSG00000115677	HDLBP	medium
ENSG00000115875	SRSF7	medium
ENSG00000116871	MAP7D1	medium
ENSG00000117318	ID3	medium
ENSG00000117362	APH1A	medium
ENSG00000118705	RPN2	medium
ENSG00000118939	UCHL3	medium
ENSG00000119471	HSDL2	medium
ENSG00000120690	ELF1	medium
ENSG00000120860	WASHC3	medium
ENSG00000120889	TNFRSF10B	medium
ENSG00000122545	SEPTIN7	medium
ENSG00000122958	VPS26A	medium
ENSG00000123159	GIPC1	medium
ENSG00000123395	ATG101	medium
ENSG00000124588	NQO2	medium
ENSG00000124733	MEA1	medium
ENSG00000124782	RREB1	medium
ENSG00000125520	SLC2A4RG	medium
ENSG00000125826	RBCK1	medium
ENSG00000125877	ITPA	medium
ENSG00000125977	EIF2S2	medium
ENSG00000126457	PRMT1	medium
ENSG00000126768	TIMM17B	medium
ENSG00000126945	HNRNPH2	medium
ENSG00000127616	SMARCA4	medium
ENSG00000128274	A4GALT	medium
ENSG00000128463	EMC4	medium
ENSG00000128524	ATP6V1F	medium
ENSG00000128626	MRPS12	medium
ENSG00000129055	ANAPC13	medium
ENSG00000129518	EAPP	medium
ENSG00000130202	NECTIN2	medium
ENSG00000130731	METTL26	medium
ENSG00000131508	UBE2D2	medium
ENSG00000131966	ACTR10	medium
ENSG00000132305	IMMT	medium
ENSG00000132388	UBE2G1	medium
ENSG00000133318	RTN3	medium
ENSG00000133710	SPINK5	medium
ENSG00000134265	NAPG	medium
ENSG00000134283	PPHLN1	medium
ENSG00000134308	YWHAQ	medium
ENSG00000134330	IAH1	medium
ENSG00000134709	HOOK1	medium
ENSG00000134779	TPGS2	medium
ENSG00000135441	BLOC1S1	medium
ENSG00000135829	DHX9	medium
ENSG00000135930	EIF4E2	medium
ENSG00000135968	GCC2	medium
ENSG00000136522	MRPL47	medium
ENSG00000136536	MARCHF7	medium
ENSG00000136718	IMP4	medium
ENSG00000137267	TUBB2A	medium
ENSG00000137500	CCDC90B	medium
ENSG00000138175	ARL3	medium
ENSG00000138398	PPIG	medium
ENSG00000138777	PPA2	medium
ENSG00000139146	SINHCAF	medium
ENSG00000139180	NDUFA9	medium
ENSG00000139233	LLPH	medium
ENSG00000140395	WDR61	medium
ENSG00000140497	SCAMP2	medium
ENSG00000141959	PFKL	medium
ENSG00000143013	LMO4	medium
ENSG00000143353	LYPLAL1	medium
ENSG00000143549	TPM3	medium
ENSG00000144034	TPRKB	medium
ENSG00000144635	DYNC1LI1	medium
ENSG00000144867	SRPRB	medium
ENSG00000147813	NAPRT	medium
ENSG00000148334	PTGES2	medium
ENSG00000148444	COMMD3	medium
ENSG00000149761	NUDT22	medium
ENSG00000149823	VPS51	medium
ENSG00000150527	MIA2	medium
ENSG00000152944	MED21	medium
ENSG00000153037	SRP19	medium
ENSG00000153944	MSI2	medium
ENSG00000156711	MAPK13	medium
ENSG00000157954	WIPI2	medium
ENSG00000157992	KRTCAP3	medium
ENSG00000158710	TAGLN2	medium
ENSG00000158828	PINK1	medium
ENSG00000160783	PMF1	medium
ENSG00000161547	SRSF2	medium
ENSG00000162032	SPSB3	medium
ENSG00000162664	ZNF326	medium
ENSG00000163382	NAXE	medium
ENSG00000163683	SMIM14	medium
ENSG00000163902	RPN1	medium
ENSG00000164022	AIMP1	medium
ENSG00000164172	MOCS2	medium
ENSG00000164300	SERINC5	medium
ENSG00000164733	CTSB	medium
ENSG00000165516	KLHDC2	medium
ENSG00000166165	CKB	medium
ENSG00000166170	BAG5	medium
ENSG00000166200	COPS2	medium
ENSG00000166275	BORCS7	medium
ENSG00000166592	RRAD	medium
ENSG00000166710	B2M	medium
ENSG00000166747	AP1G1	medium
ENSG00000167515	TRAPPC2L	medium
ENSG00000167699	GLOD4	medium
ENSG00000168002	POLR2G	medium
ENSG00000168066	SF1	medium
ENSG00000168275	COA6	medium
ENSG00000168300	PCMTD1	medium
ENSG00000168575	SLC20A2	medium
ENSG00000168672	LRATD2	medium
ENSG00000168824	NSG1	medium
ENSG00000169019	COMMD8	medium
ENSG00000169139	UBE2V2	medium
ENSG00000169718	DUS1L	medium
ENSG00000170584	NUDCD2	medium
ENSG00000171204	TMEM126B	medium
ENSG00000171421	MRPL36	medium
ENSG00000171475	WIPF2	medium
ENSG00000171634	BPTF	medium
ENSG00000172239	PAIP1	medium
ENSG00000172500	FIBP	medium
ENSG00000172586	CHCHD1	medium
ENSG00000172663	TMEM134	medium
ENSG00000172939	OXSR1	medium
ENSG00000173153	ESRRA	medium
ENSG00000173163	COMMD1	medium
ENSG00000173465	ZNRD2	medium
ENSG00000175215	CTDSP2	medium
ENSG00000175348	TMEM9B	medium
ENSG00000175505	CLCF1	medium
ENSG00000175768	TOMM5	medium
ENSG00000175854	SWI5	medium
ENSG00000176261	ZBTB8OS	medium
ENSG00000176386	CDC26	medium
ENSG00000176485	PLAAT3	medium
ENSG00000176978	DPP7	medium
ENSG00000177106	EPS8L2	medium
ENSG00000177954	RPS27	medium
ENSG00000179295	PTPN11	medium
ENSG00000179889	PDXDC1	medium
ENSG00000180957	PITPNB	medium
ENSG00000180992	MRPL14	medium
ENSG00000181222	POLR2A	medium
ENSG00000181610	MRPS23	medium
ENSG00000181722	ZBTB20	medium
ENSG00000182149	IST1	medium
ENSG00000182165	NA	medium
ENSG00000183576	SETD3	medium
ENSG00000183617	MRPL54	medium
ENSG00000184752	NDUFA12	medium
ENSG00000187954	CYHR1	medium
ENSG00000188342	GTF2F2	medium
ENSG00000188554	NBR1	medium
ENSG00000196655	TRAPPC4	medium
ENSG00000196712	NF1	medium
ENSG00000197324	LRP10	medium
ENSG00000197712	FAM114A1	medium
ENSG00000198130	HIBCH	medium
ENSG00000198142	SOWAHC	medium
ENSG00000198356	GET3	medium
ENSG00000198604	BAZ1A	medium
ENSG00000198763	ND2	medium
ENSG00000204220	PFDN6	medium
ENSG00000204356	NELFE	medium
ENSG00000204388	HSPA1B	medium
ENSG00000204580	DDR1	medium
ENSG00000204922	UQCC3	medium
ENSG00000211677	IGLC2	medium
ENSG00000211895	IGHA1	medium
ENSG00000213523	SRA1	medium
ENSG00000213853	EMP2	medium
ENSG00000213923	CSNK1E	medium
ENSG00000213977	TAX1BP3	medium
ENSG00000214194	SMIM30	medium
ENSG00000225663	MCRIP1	medium
ENSG00000229732	NA	medium
ENSG00000233493	TMEM238	medium
ENSG00000234545	FAM133B	medium
ENSG00000244187	TMEM141	medium
ENSG00000246705	H2AJ	medium
ENSG00000250722	SELENOP	medium
ENSG00000256338	RPL41P2	medium
ENSG00000256812	CAPNS2	medium
ENSG00000258289	CHURC1	medium
ENSG00000261183	SPINT1-AS1	medium
ENSG00000263001	GTF2I	medium
ENSG00000278053	DDX52	medium
