IdentityGene	GeneSymbol	Level
ENSG00000000419	DPM1	high
ENSG00000003436	TFPI	high
ENSG00000004059	ARF5	high
ENSG00000004779	NDUFAB1	high
ENSG00000005022	SLC25A5	high
ENSG00000006625	GGCT	high
ENSG00000006831	ADIPOR2	high
ENSG00000007402	CACNA2D2	high
ENSG00000008294	SPAG9	high
ENSG00000008394	MGST1	high
ENSG00000008441	NFIX	high
ENSG00000008853	RHOBTB2	high
ENSG00000008988	RPS20	high
ENSG00000009307	CSDE1	high
ENSG00000010270	STARD3NL	high
ENSG00000011007	ELOA	high
ENSG00000011198	ABHD5	high
ENSG00000011304	PTBP1	high
ENSG00000013364	MVP	high
ENSG00000013588	GPRC5A	high
ENSG00000015153	YAF2	high
ENSG00000018189	RUFY3	high
ENSG00000019582	CD74	high
ENSG00000021355	SERPINB1	high
ENSG00000025423	HSD17B6	high
ENSG00000025708	TYMP	high
ENSG00000025796	SEC63	high
ENSG00000026508	CD44	high
ENSG00000031698	SARS1	high
ENSG00000032219	ARID4A	high
ENSG00000034713	GABARAPL2	high
ENSG00000035115	SH3YL1	high
ENSG00000035928	RFC1	high
ENSG00000041357	PSMA4	high
ENSG00000042753	AP2S1	high
ENSG00000044115	CTNNA1	high
ENSG00000047644	WWC3	high
ENSG00000048740	CELF2	high
ENSG00000048828	FAM120A	high
ENSG00000049618	ARID1B	high
ENSG00000049759	NEDD4L	high
ENSG00000050393	MCUR1	high
ENSG00000051108	HERPUD1	high
ENSG00000051620	HEBP2	high
ENSG00000052795	FNIP2	high
ENSG00000052802	MSMO1	high
ENSG00000053372	MRTO4	high
ENSG00000054148	PHPT1	high
ENSG00000054282	SDCCAG8	high
ENSG00000055044	NOP58	high
ENSG00000058262	SEC61A1	high
ENSG00000058335	RASGRF1	high
ENSG00000060762	MPC1	high
ENSG00000060971	ACAA1	high
ENSG00000060982	BCAT1	high
ENSG00000062716	VMP1	high
ENSG00000063046	EIF4B	high
ENSG00000063177	RPL18	high
ENSG00000063244	U2AF2	high
ENSG00000064666	CNN2	high
ENSG00000064886	CHI3L2	high
ENSG00000065548	ZC3H15	high
ENSG00000065978	YBX1	high
ENSG00000066027	PPP2R5A	high
ENSG00000067064	IDI1	high
ENSG00000068366	ACSL4	high
ENSG00000068650	ATP11A	high
ENSG00000068912	ERLEC1	high
ENSG00000069122	ADGRF5	high
ENSG00000069849	ATP1B3	high
ENSG00000069974	RAB27A	high
ENSG00000070081	NUCB2	high
ENSG00000070756	PABPC1	high
ENSG00000071082	RPL31	high
ENSG00000071242	RPS6KA2	high
ENSG00000071462	BUD23	high
ENSG00000072364	AFF4	high
ENSG00000072506	HSD17B10	high
ENSG00000072778	ACADVL	high
ENSG00000073803	MAP3K13	high
ENSG00000074071	MRPS34	high
ENSG00000074527	NTN4	high
ENSG00000074695	LMAN1	high
ENSG00000074696	HACD3	high
ENSG00000074800	ENO1	high
ENSG00000074842	MYDGF	high
ENSG00000075415	SLC25A3	high
ENSG00000075785	RAB7A	high
ENSG00000076356	PLXNA2	high
ENSG00000076554	TPD52	high
ENSG00000077147	TM9SF3	high
ENSG00000078081	LAMP3	high
ENSG00000078140	UBE2K	high
ENSG00000078304	PPP2R5C	high
ENSG00000078369	GNB1	high
ENSG00000079246	XRCC5	high
ENSG00000079332	SAR1A	high
ENSG00000079459	FDFT1	high
ENSG00000079805	DNM2	high
ENSG00000080371	RAB21	high
ENSG00000080618	CPB2	high
ENSG00000081041	CXCL2	high
ENSG00000081479	LRP2	high
ENSG00000082153	BZW1	high
ENSG00000082438	COBLL1	high
ENSG00000082898	XPO1	high
ENSG00000083099	LYRM2	high
ENSG00000083457	ITGAE	high
ENSG00000083845	RPS5	high
ENSG00000084093	REST	high
ENSG00000084623	EIF3I	high
ENSG00000085224	ATRX	high
ENSG00000085276	MECOM	high
ENSG00000085719	CPNE3	high
ENSG00000085733	CTTN	high
ENSG00000085831	TTC39A	high
ENSG00000086061	DNAJA1	high
ENSG00000086289	EPDR1	high
ENSG00000086598	TMED2	high
ENSG00000086712	TXLNG	high
ENSG00000087191	PSMC5	high
ENSG00000087269	NOP14	high
ENSG00000087302	RTRAF	high
ENSG00000087365	SF3B2	high
ENSG00000088832	FKBP1A	high
ENSG00000089009	RPL6	high
ENSG00000089157	RPLP0	high
ENSG00000089248	ERP29	high
ENSG00000089693	MLF2	high
ENSG00000089737	DDX24	high
ENSG00000090013	BLVRB	high
ENSG00000090060	PAPOLA	high
ENSG00000090263	MRPS33	high
ENSG00000090266	NDUFB2	high
ENSG00000090273	NUDC	high
ENSG00000090339	ICAM1	high
ENSG00000090621	PABPC4	high
ENSG00000091527	CDV3	high
ENSG00000092010	PSME1	high
ENSG00000092820	EZR	high
ENSG00000095380	NANS	high
ENSG00000095713	CRTAC1	high
ENSG00000096088	PGC	high
ENSG00000097033	SH3GLB1	high
ENSG00000099194	SCD	high
ENSG00000099622	CIRBP	high
ENSG00000099624	ATP5F1D	high
ENSG00000099800	TIMM13	high
ENSG00000099860	GADD45B	high
ENSG00000099875	MKNK2	high
ENSG00000099901	RANBP1	high
ENSG00000099994	SUSD2	high
ENSG00000100028	SNRPD3	high
ENSG00000100138	SNU13	high
ENSG00000100292	HMOX1	high
ENSG00000100316	RPL3	high
ENSG00000100345	MYH9	high
ENSG00000100380	ST13	high
ENSG00000100417	PMM1	high
ENSG00000100592	DAAM1	high
ENSG00000100600	LGMN	high
ENSG00000100612	DHRS7	high
ENSG00000100632	ERH	high
ENSG00000100644	HIF1A	high
ENSG00000100650	SRSF5	high
ENSG00000100811	YY1	high
ENSG00000100823	APEX1	high
ENSG00000100906	NFKBIA	high
ENSG00000100911	PSME2	high
ENSG00000101294	HM13	high
ENSG00000101361	NOP56	high
ENSG00000101417	PXMP4	high
ENSG00000101444	AHCY	high
ENSG00000101745	ANKRD12	high
ENSG00000101856	PGRMC1	high
ENSG00000101966	XIAP	high
ENSG00000101972	STAG2	high
ENSG00000102007	PLP2	high
ENSG00000102024	PLS3	high
ENSG00000102030	NAA10	high
ENSG00000102317	RBM3	high
ENSG00000102409	BEX4	high
ENSG00000102531	FNDC3A	high
ENSG00000102554	KLF5	high
ENSG00000102804	TSC22D1	high
ENSG00000103035	PSMD7	high
ENSG00000103266	STUB1	high
ENSG00000103342	GSPT1	high
ENSG00000103363	ELOB	high
ENSG00000103534	TMC5	high
ENSG00000103811	CTSH	high
ENSG00000103994	ZNF106	high
ENSG00000104131	EIF3J	high
ENSG00000104267	CA2	high
ENSG00000104341	LAPTM4B	high
ENSG00000104388	RAB2A	high
ENSG00000104408	EIF3E	high
ENSG00000104529	EEF1D	high
ENSG00000104549	SQLE	high
ENSG00000104695	PPP2CB	high
ENSG00000104765	BNIP3L	high
ENSG00000104964	TLE5	high
ENSG00000104979	C19orf53	high
ENSG00000105185	PDCD5	high
ENSG00000105193	RPS16	high
ENSG00000105202	FBL	high
ENSG00000105223	PLD3	high
ENSG00000105258	POLR2I	high
ENSG00000105372	RPS19	high
ENSG00000105373	NOP53	high
ENSG00000105379	ETFB	high
ENSG00000105438	KDELR1	high
ENSG00000105640	RPL18A	high
ENSG00000105677	TMEM147	high
ENSG00000105701	FKBP8	high
ENSG00000105835	NAMPT	high
ENSG00000105968	H2AZ2	high
ENSG00000106028	SSBP1	high
ENSG00000106052	TAX1BP1	high
ENSG00000106105	GARS1	high
ENSG00000106245	BUD31	high
ENSG00000106263	EIF3B	high
ENSG00000106355	LSM5	high
ENSG00000106400	ZNHIT1	high
ENSG00000106541	AGR2	high
ENSG00000106682	EIF4H	high
ENSG00000106771	TMEM245	high
ENSG00000106780	MEGF9	high
ENSG00000106803	SEC61B	high
ENSG00000107372	ZFAND5	high
ENSG00000107581	EIF3A	high
ENSG00000108107	RPL28	high
ENSG00000108298	RPL19	high
ENSG00000108424	KPNB1	high
ENSG00000108561	C1QBP	high
ENSG00000108588	CCDC47	high
ENSG00000108654	DDX5	high
ENSG00000108774	RAB5C	high
ENSG00000108829	LRRC59	high
ENSG00000108848	LUC7L3	high
ENSG00000109084	TMEM97	high
ENSG00000109321	AREG	high
ENSG00000109390	NDUFC1	high
ENSG00000109475	RPL34	high
ENSG00000109610	SOD3	high
ENSG00000109906	ZBTB16	high
ENSG00000110092	CCND1	high
ENSG00000110700	RPS13	high
ENSG00000110917	MLEC	high
ENSG00000111011	RSRC2	high
ENSG00000111142	METAP2	high
ENSG00000111144	LTA4H	high
ENSG00000111328	CDK2AP1	high
ENSG00000111371	SLC38A1	high
ENSG00000111412	SPRING1	high
ENSG00000111639	MRPL51	high
ENSG00000111669	TPI1	high
ENSG00000111678	C12orf57	high
ENSG00000111707	SUDS3	high
ENSG00000111716	LDHB	high
ENSG00000111786	SRSF9	high
ENSG00000111832	RWDD1	high
ENSG00000111843	TMEM14C	high
ENSG00000111859	NEDD9	high
ENSG00000111907	TPD52L1	high
ENSG00000111912	NCOA7	high
ENSG00000112096	SOD2	high
ENSG00000112110	MRPL18	high
ENSG00000112149	CD83	high
ENSG00000112306	RPS12	high
ENSG00000112335	SNX3	high
ENSG00000112379	ARFGEF3	high
ENSG00000112695	COX7A2	high
ENSG00000112697	TMEM30A	high
ENSG00000112972	HMGCS1	high
ENSG00000113282	CLINT1	high
ENSG00000113387	SUB1	high
ENSG00000113448	PDE4D	high
ENSG00000113594	LIFR	high
ENSG00000113648	MACROH2A1	high
ENSG00000113719	ERGIC1	high
ENSG00000113732	ATP6V0E1	high
ENSG00000114120	SLC25A36	high
ENSG00000114125	RNF7	high
ENSG00000114353	GNAI2	high
ENSG00000114391	RPL24	high
ENSG00000114416	FXR1	high
ENSG00000114541	FRMD4B	high
ENSG00000114573	ATP6V1A	high
ENSG00000114784	EIF1B	high
ENSG00000114796	KLHL24	high
ENSG00000114850	SSR3	high
ENSG00000114854	TNNC1	high
ENSG00000114861	FOXP1	high
ENSG00000114867	EIF4G1	high
ENSG00000114942	EEF1B2	high
ENSG00000115053	NCL	high
ENSG00000115091	ACTR3	high
ENSG00000115112	TFCP2L1	high
ENSG00000115128	SF3B6	high
ENSG00000115129	TP53I3	high
ENSG00000115221	ITGB6	high
ENSG00000115241	PPM1G	high
ENSG00000115268	RPS15	high
ENSG00000115350	POLE4	high
ENSG00000115484	CCT4	high
ENSG00000115524	SF3B1	high
ENSG00000115525	ST3GAL5	high
ENSG00000115541	HSPE1	high
ENSG00000115648	MLPH	high
ENSG00000115677	HDLBP	high
ENSG00000115738	ID2	high
ENSG00000115758	ODC1	high
ENSG00000115816	CEBPZ	high
ENSG00000115944	COX7A2L	high
ENSG00000116016	EPAS1	high
ENSG00000116030	SUMO1	high
ENSG00000116133	DHCR24	high
ENSG00000116171	SCP2	high
ENSG00000116251	RPL22	high
ENSG00000116260	QSOX1	high
ENSG00000116285	ERRFI1	high
ENSG00000116288	PARK7	high
ENSG00000116350	SRSF4	high
ENSG00000116459	ATP5PB	high
ENSG00000116539	ASH1L	high
ENSG00000116560	SFPQ	high
ENSG00000116586	LAMTOR2	high
ENSG00000116649	SRM	high
ENSG00000116667	C1orf21	high
ENSG00000116754	SRSF11	high
ENSG00000116898	MRPS15	high
ENSG00000117395	EBNA1BP2	high
ENSG00000117419	ERI3	high
ENSG00000117448	AKR1A1	high
ENSG00000117500	TMED5	high
ENSG00000117523	PRRC2C	high
ENSG00000117525	F3	high
ENSG00000117528	ABCD3	high
ENSG00000118181	RPS25	high
ENSG00000118363	SPCS2	high
ENSG00000118418	HMGN3	high
ENSG00000118503	TNFAIP3	high
ENSG00000118515	SGK1	high
ENSG00000119048	UBE2B	high
ENSG00000119138	KLF9	high
ENSG00000119314	PTBP3	high
ENSG00000119318	RAD23B	high
ENSG00000119335	SET	high
ENSG00000119396	RAB14	high
ENSG00000119535	CSF3R	high
ENSG00000119655	NPC2	high
ENSG00000119705	SLIRP	high
ENSG00000119707	RBM25	high
ENSG00000119711	ALDH6A1	high
ENSG00000119862	LGALSL	high
ENSG00000120437	ACAT2	high
ENSG00000120438	TCP1	high
ENSG00000120533	ENY2	high
ENSG00000120675	DNAJC15	high
ENSG00000120694	HSPH1	high
ENSG00000120727	PAIP2	high
ENSG00000120992	LYPLA1	high
ENSG00000121644	DESI2	high
ENSG00000121774	KHDRBS1	high
ENSG00000122026	RPL21	high
ENSG00000122034	GTF3A	high
ENSG00000122378	PRXL2A	high
ENSG00000122406	RPL5	high
ENSG00000122545	SEPTIN7	high
ENSG00000122852	SFTPA1	high
ENSG00000122912	SLC25A16	high
ENSG00000123066	MED13L	high
ENSG00000123131	PRDX4	high
ENSG00000123159	GIPC1	high
ENSG00000123179	EBPL	high
ENSG00000123200	ZC3H13	high
ENSG00000123349	PFDN5	high
ENSG00000123358	NR4A1	high
ENSG00000123416	TUBA1B	high
ENSG00000123505	AMD1	high
ENSG00000123562	MORF4L2	high
ENSG00000124107	SLPI	high
ENSG00000124171	PARD6B	high
ENSG00000124172	ATP5F1E	high
ENSG00000124562	SNRPC	high
ENSG00000124614	RPS10	high
ENSG00000124762	CDKN1A	high
ENSG00000124767	GLO1	high
ENSG00000124783	SSR1	high
ENSG00000124795	DEK	high
ENSG00000124831	LRRFIP1	high
ENSG00000124942	AHNAK	high
ENSG00000125037	EMC3	high
ENSG00000125148	MT2A	high
ENSG00000125257	ABCC4	high
ENSG00000125356	NDUFA1	high
ENSG00000125656	CLPP	high
ENSG00000125691	RPL23	high
ENSG00000125730	C3	high
ENSG00000125743	SNRPD2	high
ENSG00000125844	RRBP1	high
ENSG00000125845	BMP2	high
ENSG00000125944	HNRNPR	high
ENSG00000125968	ID1	high
ENSG00000125991	ERGIC3	high
ENSG00000125995	ROMO1	high
ENSG00000126005	MMP24OS	high
ENSG00000126067	PSMB2	high
ENSG00000126267	COX6B1	high
ENSG00000126432	PRDX5	high
ENSG00000126457	PRMT1	high
ENSG00000126522	ASL	high
ENSG00000126524	SBDS	high
ENSG00000126581	BECN1	high
ENSG00000126756	UXT	high
ENSG00000126934	MAP2K2	high
ENSG00000127022	CANX	high
ENSG00000127184	COX7C	high
ENSG00000127483	HP1BP3	high
ENSG00000127540	UQCR11	high
ENSG00000127838	PNKD	high
ENSG00000127884	ECHS1	high
ENSG00000127948	POR	high
ENSG00000127954	STEAP4	high
ENSG00000128016	ZFP36	high
ENSG00000128228	SDF2L1	high
ENSG00000128272	ATF4	high
ENSG00000128309	MPST	high
ENSG00000128311	TST	high
ENSG00000128595	CALU	high
ENSG00000128609	NDUFA5	high
ENSG00000128641	MYO1B	high
ENSG00000129084	PSMA1	high
ENSG00000129128	SPCS3	high
ENSG00000129235	TXNDC17	high
ENSG00000129255	MPDU1	high
ENSG00000129351	ILF3	high
ENSG00000129422	MTUS1	high
ENSG00000129559	NEDD8	high
ENSG00000129625	REEP5	high
ENSG00000130066	SAT1	high
ENSG00000130164	LDLR	high
ENSG00000130254	SAFB2	high
ENSG00000130255	RPL36	high
ENSG00000130313	PGLS	high
ENSG00000130332	LSM7	high
ENSG00000130429	ARPC1B	high
ENSG00000130520	LSM4	high
ENSG00000130724	CHMP2A	high
ENSG00000130725	UBE2M	high
ENSG00000130726	TRIM28	high
ENSG00000130731	METTL26	high
ENSG00000130770	ATP5IF1	high
ENSG00000130811	EIF3G	high
ENSG00000131143	COX4I1	high
ENSG00000131174	COX7B	high
ENSG00000131400	NAPSA	high
ENSG00000131437	KIF3A	high
ENSG00000131469	RPL27	high
ENSG00000131495	NDUFA2	high
ENSG00000131781	FMO5	high
ENSG00000132341	RAN	high
ENSG00000132432	SEC61G	high
ENSG00000132471	WBP2	high
ENSG00000132485	ZRANB2	high
ENSG00000132507	EIF5A	high
ENSG00000132780	NASP	high
ENSG00000133048	CHI3L1	high
ENSG00000133112	TPT1	high
ENSG00000133134	BEX2	high
ENSG00000133142	TCEAL4	high
ENSG00000133313	CNDP2	high
ENSG00000133639	BTG1	high
ENSG00000133661	SFTPD	high
ENSG00000133706	LARS1	high
ENSG00000133872	SARAF	high
ENSG00000133935	ERG28	high
ENSG00000134020	PEBP4	high
ENSG00000134056	MRPS36	high
ENSG00000134107	BHLHE40	high
ENSG00000134248	LAMTOR5	high
ENSG00000134294	SLC38A2	high
ENSG00000134313	KIDINS220	high
ENSG00000134352	IL6ST	high
ENSG00000134419	RPS15A	high
ENSG00000134440	NARS1	high
ENSG00000134825	TMEM258	high
ENSG00000134851	TMEM165	high
ENSG00000135090	TAOK3	high
ENSG00000135185	TMEM243	high
ENSG00000135218	CD36	high
ENSG00000135316	SYNCRIP	high
ENSG00000135390	ATP5MC2	high
ENSG00000135441	BLOC1S1	high
ENSG00000135480	KRT7	high
ENSG00000135486	HNRNPA1	high
ENSG00000135624	CCT7	high
ENSG00000135720	DYNC1LI2	high
ENSG00000135940	COX5B	high
ENSG00000136003	ISCU	high
ENSG00000136026	CKAP4	high
ENSG00000136048	DRAM1	high
ENSG00000136240	KDELR2	high
ENSG00000136261	BZW2	high
ENSG00000136521	NDUFB5	high
ENSG00000136527	TRA2B	high
ENSG00000136628	EPRS1	high
ENSG00000136810	TXN	high
ENSG00000136830	NIBAN2	high
ENSG00000136877	FPGS	high
ENSG00000136888	ATP6V1G1	high
ENSG00000136908	DPM2	high
ENSG00000136938	ANP32B	high
ENSG00000136942	RPL35	high
ENSG00000136950	ARPC5L	high
ENSG00000137154	RPS6	high
ENSG00000137210	TMEM14B	high
ENSG00000137331	IER3	high
ENSG00000137409	MTCH1	high
ENSG00000137440	FGFBP1	high
ENSG00000137767	SQOR	high
ENSG00000137776	SLTM	high
ENSG00000137818	RPLP1	high
ENSG00000137857	DUOX1	high
ENSG00000137876	RSL24D1	high
ENSG00000137880	GCHFR	high
ENSG00000138071	ACTR2	high
ENSG00000138085	ATRAID	high
ENSG00000138119	MYOF	high
ENSG00000138162	TACC2	high
ENSG00000138326	RPS24	high
ENSG00000138385	SSB	high
ENSG00000138398	PPIG	high
ENSG00000138413	IDH1	high
ENSG00000138495	COX17	high
ENSG00000138592	USP8	high
ENSG00000138593	SECISBP2L	high
ENSG00000138594	TMOD3	high
ENSG00000138594	LOC112268148	high
ENSG00000138640	FAM13A	high
ENSG00000138668	HNRNPD	high
ENSG00000138777	PPA2	high
ENSG00000138814	PPP3CA	high
ENSG00000139318	DUSP6	high
ENSG00000139343	SNRPF	high
ENSG00000139428	MMAB	high
ENSG00000139496	NUP58	high
ENSG00000139684	ESD	high
ENSG00000140044	JDP2	high
ENSG00000140254	DUOXA1	high
ENSG00000140264	SERF2	high
ENSG00000140350	ANP32A	high
ENSG00000140416	TPM1	high
ENSG00000140526	ABHD2	high
ENSG00000140612	SEC11A	high
ENSG00000140836	ZFHX3	high
ENSG00000140941	MAP1LC3B	high
ENSG00000140988	RPS2	high
ENSG00000140990	NDUFB10	high
ENSG00000141002	TCF25	high
ENSG00000141027	NCOR1	high
ENSG00000141232	TOB1	high
ENSG00000141367	CLTC	high
ENSG00000141401	IMPA2	high
ENSG00000141504	SAT2	high
ENSG00000141522	ARHGDIA	high
ENSG00000141741	MIEN1	high
ENSG00000141759	TXNL4A	high
ENSG00000141905	NFIC	high
ENSG00000142089	IFITM3	high
ENSG00000142534	RPS11	high
ENSG00000142541	RPL13A	high
ENSG00000142669	SH3BGRL3	high
ENSG00000142676	RPL11	high
ENSG00000142684	ZNF593	high
ENSG00000142864	SERBP1	high
ENSG00000142937	RPS8	high
ENSG00000143106	PSMA5	high
ENSG00000143153	ATP1B1	high
ENSG00000143256	PFDN2	high
ENSG00000143333	RGS16	high
ENSG00000143384	MCL1	high
ENSG00000143416	SELENBP1	high
ENSG00000143420	ENSA	high
ENSG00000143543	JTB	high
ENSG00000143549	TPM3	high
ENSG00000143554	SLC27A3	high
ENSG00000143621	ILF2	high
ENSG00000143742	SRP9	high
ENSG00000143761	ARF1	high
ENSG00000143771	CNIH4	high
ENSG00000143799	PARP1	high
ENSG00000143819	EPHX1	high
ENSG00000143870	PDIA6	high
ENSG00000143947	RPS27A	high
ENSG00000143977	SNRPG	high
ENSG00000144063	MALL	high
ENSG00000144331	ZNF385B	high
ENSG00000144381	HSPD1	high
ENSG00000144674	GOLGA4	high
ENSG00000144713	RPL32	high
ENSG00000144802	NFKBIZ	high
ENSG00000144895	EIF2A	high
ENSG00000145012	LPP	high
ENSG00000145050	MANF	high
ENSG00000145425	RPS3A	high
ENSG00000145494	NDUFS6	high
ENSG00000145592	RPL37	high
ENSG00000145741	BTF3	high
ENSG00000145833	DDX46	high
ENSG00000145860	RNF145	high
ENSG00000145912	NHP2	high
ENSG00000145919	BOD1	high
ENSG00000146066	HIGD2A	high
ENSG00000146223	RPL7L1	high
ENSG00000146247	PHIP	high
ENSG00000146278	PNRC1	high
ENSG00000146433	TMEM181	high
ENSG00000146540	C7orf50	high
ENSG00000146701	MDH2	high
ENSG00000146729	NIPSNAP2	high
ENSG00000146731	CCT6A	high
ENSG00000147065	MSN	high
ENSG00000147123	NDUFB11	high
ENSG00000147140	NONO	high
ENSG00000147155	EBP	high
ENSG00000147274	RBMX	high
ENSG00000147403	RPL10	high
ENSG00000147526	TACC1	high
ENSG00000147604	RPL7	high
ENSG00000147649	MTDH	high
ENSG00000147654	EBAG9	high
ENSG00000147684	NDUFB9	high
ENSG00000148158	SNX30	high
ENSG00000148175	STOM	high
ENSG00000148248	SURF4	high
ENSG00000148303	RPL7A	high
ENSG00000148730	EIF4EBP2	high
ENSG00000149021	SCGB1A1	high
ENSG00000149084	HSD17B12	high
ENSG00000149257	SERPINH1	high
ENSG00000149273	RPS3	high
ENSG00000149357	LAMTOR1	high
ENSG00000149485	FADS1	high
ENSG00000149573	MPZL2	high
ENSG00000149806	FAU	high
ENSG00000149809	TM7SF2	high
ENSG00000149932	TMEM219	high
ENSG00000150093	ITGB1	high
ENSG00000150753	CCT5	high
ENSG00000151150	ANK3	high
ENSG00000151327	FAM177A1	high
ENSG00000151327	LOC101927178	high
ENSG00000151332	MBIP	high
ENSG00000151491	EPS8	high
ENSG00000151726	ACSL1	high
ENSG00000152061	RABGAP1L	high
ENSG00000152234	ATP5F1A	high
ENSG00000152284	TCF7L1	high
ENSG00000152558	TMEM123	high
ENSG00000152795	HNRNPDL	high
ENSG00000152818	UTRN	high
ENSG00000153113	CAST	high
ENSG00000153187	HNRNPU	high
ENSG00000153395	LPCAT1	high
ENSG00000153446	C16orf89	high
ENSG00000154582	ELOC	high
ENSG00000154639	CXADR	high
ENSG00000154640	BTG3	high
ENSG00000154723	ATP5PF	high
ENSG00000155368	DBI	high
ENSG00000155506	LARP1	high
ENSG00000155657	TTN	high
ENSG00000155660	PDIA4	high
ENSG00000156076	WIF1	high
ENSG00000156110	ADK	high
ENSG00000156256	USP16	high
ENSG00000156261	CCT8	high
ENSG00000156467	UQCRB	high
ENSG00000156482	RPL30	high
ENSG00000156508	EEF1A1	high
ENSG00000156675	RAB11FIP1	high
ENSG00000157107	FCHO2	high
ENSG00000157514	TSC22D3	high
ENSG00000157551	KCNJ15	high
ENSG00000157557	ETS2	high
ENSG00000157613	CREB3L1	high
ENSG00000157765	SLC34A2	high
ENSG00000157916	RER1	high
ENSG00000158417	EIF5B	high
ENSG00000158467	AHCYL2	high
ENSG00000158710	TAGLN2	high
ENSG00000159199	ATP5MC1	high
ENSG00000159346	ADIPOR1	high
ENSG00000159377	PSMB4	high
ENSG00000159388	BTG2	high
ENSG00000160075	SSU72	high
ENSG00000160194	NDUFV3	high
ENSG00000160209	PDXK	high
ENSG00000160209	LOC105372824	high
ENSG00000160216	AGPAT3	high
ENSG00000160752	FDPS	high
ENSG00000160789	LMNA	high
ENSG00000160888	IER2	high
ENSG00000160948	VPS28	high
ENSG00000161016	RPL8	high
ENSG00000161055	SCGB3A1	high
ENSG00000161203	AP2M1	high
ENSG00000161249	DMKN	high
ENSG00000161547	SRSF2	high
ENSG00000161654	LSM12	high
ENSG00000161671	EMC10	high
ENSG00000161970	RPL26	high
ENSG00000162174	ASRGL1	high
ENSG00000162191	UBXN1	high
ENSG00000162244	RPL29	high
ENSG00000162434	JAK1	high
ENSG00000162551	ALPL	high
ENSG00000162585	FAAP20	high
ENSG00000162599	NFIA	high
ENSG00000162613	FUBP1	high
ENSG00000162772	ATF3	high
ENSG00000162896	PIGR	high
ENSG00000163170	BOLA3	high
ENSG00000163220	S100A9	high
ENSG00000163399	ATP1A1	high
ENSG00000163435	ELF3	high
ENSG00000163444	TMEM183A	high
ENSG00000163463	KRTCAP2	high
ENSG00000163466	ARPC2	high
ENSG00000163468	CCT3	high
ENSG00000163492	CCDC141	high
ENSG00000163558	PRKCI	high
ENSG00000163584	RPL22L1	high
ENSG00000163634	THOC7	high
ENSG00000163659	TIPARP	high
ENSG00000163660	CCNL1	high
ENSG00000163682	RPL9	high
ENSG00000163683	SMIM14	high
ENSG00000163694	RBM47	high
ENSG00000163734	CXCL3	high
ENSG00000163902	RPN1	high
ENSG00000163931	TKT	high
ENSG00000163956	LRPAP1	high
ENSG00000164022	AIMP1	high
ENSG00000164023	SGMS2	high
ENSG00000164096	C4orf3	high
ENSG00000164134	NAA15	high
ENSG00000164161	HHIP	high
ENSG00000164265	SCGB3A2	high
ENSG00000164323	CFAP97	high
ENSG00000164346	NSA2	high
ENSG00000164405	UQCRQ	high
ENSG00000164442	CITED2	high
ENSG00000164587	RPS14	high
ENSG00000164659	ELAPOR2	high
ENSG00000164687	FABP5	high
ENSG00000164741	DLC1	high
ENSG00000164919	COX6C	high
ENSG00000165175	MID1IP1	high
ENSG00000165272	AQP3	high
ENSG00000165280	VCP	high
ENSG00000165283	STOML2	high
ENSG00000165389	SPTSSA	high
ENSG00000165502	RPL36AL	high
ENSG00000165629	ATP5F1C	high
ENSG00000165672	PRDX3	high
ENSG00000165678	GHITM	high
ENSG00000165732	DDX21	high
ENSG00000165929	TC2N	high
ENSG00000166012	TAF1D	high
ENSG00000166136	NDUFB8	high
ENSG00000166226	CCT2	high
ENSG00000166278	C2	high
ENSG00000166295	ANAPC16	high
ENSG00000166337	TAF10	high
ENSG00000166347	CYB5A	high
ENSG00000166441	RPL27A	high
ENSG00000166471	TMEM41B	high
ENSG00000166557	TMED3	high
ENSG00000166562	SEC11C	high
ENSG00000166592	RRAD	high
ENSG00000166595	CIAO2B	high
ENSG00000166598	HSP90B1	high
ENSG00000166741	NNMT	high
ENSG00000166794	PPIB	high
ENSG00000167004	PDIA3	high
ENSG00000167085	PHB	high
ENSG00000167088	SNRPD1	high
ENSG00000167460	TPM4	high
ENSG00000167468	GPX4	high
ENSG00000167508	MVD	high
ENSG00000167522	ANKRD11	high
ENSG00000167526	RPL13	high
ENSG00000167658	EEF2	high
ENSG00000167711	SERPINF2	high
ENSG00000167775	CD320	high
ENSG00000167792	NDUFV1	high
ENSG00000167797	CDK2AP2	high
ENSG00000167815	PRDX2	high
ENSG00000167863	ATP5PD	high
ENSG00000167972	ABCA3	high
ENSG00000168002	POLR2G	high
ENSG00000168028	RPSA	high
ENSG00000168036	CTNNB1	high
ENSG00000168066	SF1	high
ENSG00000168175	MAPK1IP1L	high
ENSG00000168264	IRF2BP2	high
ENSG00000168385	SEPTIN2	high
ENSG00000168389	MFSD2A	high
ENSG00000168484	SFTPC	high
ENSG00000168487	BMP1	high
ENSG00000168610	STAT3	high
ENSG00000168653	NDUFS5	high
ENSG00000168710	AHCYL1	high
ENSG00000168724	DNAJC21	high
ENSG00000168743	NPNT	high
ENSG00000168878	SFTPB	high
ENSG00000168906	MAT2A	high
ENSG00000168907	PLA2G4F	high
ENSG00000169020	ATP5ME	high
ENSG00000169021	UQCRFS1	high
ENSG00000169045	HNRNPH1	high
ENSG00000169223	LMAN2	high
ENSG00000169230	PRELID1	high
ENSG00000169429	CXCL8	high
ENSG00000169689	CENPX	high
ENSG00000169692	AGPAT2	high
ENSG00000169710	FASN	high
ENSG00000169714	CNBP	high
ENSG00000169715	MT1E	high
ENSG00000169738	DCXR	high
ENSG00000169764	UGP2	high
ENSG00000169813	HNRNPF	high
ENSG00000169908	TM4SF1	high
ENSG00000169926	KLF13	high
ENSG00000170043	TRAPPC1	high
ENSG00000170144	HNRNPA3	high
ENSG00000170293	CMTM8	high
ENSG00000170348	TMED10	high
ENSG00000170515	PA2G4	high
ENSG00000170545	SMAGP	high
ENSG00000170776	AKAP13	high
ENSG00000170786	SDR16C5	high
ENSG00000170860	LSM3	high
ENSG00000170889	RPS9	high
ENSG00000170890	PLA2G1B	high
ENSG00000170899	GSTA4	high
ENSG00000170906	NDUFA3	high
ENSG00000171202	TMEM126A	high
ENSG00000171222	SCAND1	high
ENSG00000171223	JUNB	high
ENSG00000171490	RSL1D1	high
ENSG00000171557	FGG	high
ENSG00000171634	BPTF	high
ENSG00000171858	RPS21	high
ENSG00000171863	RPS7	high
ENSG00000172115	CYCS	high
ENSG00000172201	ID4	high
ENSG00000172264	MACROD2	high
ENSG00000172354	GNB2	high
ENSG00000172366	MCRIP2	high
ENSG00000172428	COPS9	high
ENSG00000172456	FGGY	high
ENSG00000172590	MRPL52	high
ENSG00000172757	CFL1	high
ENSG00000172809	RPL38	high
ENSG00000172893	DHCR7	high
ENSG00000173141	MRPL57	high
ENSG00000173230	GOLGB1	high
ENSG00000173334	TRIB1	high
ENSG00000173457	PPP1R14B	high
ENSG00000173467	AGR3	high
ENSG00000173575	CHD2	high
ENSG00000173660	UQCRH	high
ENSG00000173674	EIF1AX	high
ENSG00000173692	PSMD1	high
ENSG00000173905	GOLIM4	high
ENSG00000173915	ATP5MD	high
ENSG00000173930	SLCO4C1	high
ENSG00000174444	RPL4	high
ENSG00000174695	TMEM167A	high
ENSG00000174748	RPL15	high
ENSG00000174780	SRP72	high
ENSG00000174903	RAB1B	high
ENSG00000174917	MICOS13	high
ENSG00000175061	SNHG29	high
ENSG00000175334	BANF1	high
ENSG00000175390	EIF3F	high
ENSG00000175416	CLTB	high
ENSG00000175445	LPL	high
ENSG00000175701	MTLN	high
ENSG00000175793	SFN	high
ENSG00000175826	CTDNEP1	high
ENSG00000175854	SWI5	high
ENSG00000176046	NUPR1	high
ENSG00000176340	COX8A	high
ENSG00000176485	PLAAT3	high
ENSG00000176731	RBIS	high
ENSG00000176907	TCIM	high
ENSG00000177189	RPS6KA3	high
ENSG00000177508	IRX3	high
ENSG00000177600	RPLP2	high
ENSG00000177700	POLR2L	high
ENSG00000177954	RPS27	high
ENSG00000178057	NDUFAF3	high
ENSG00000178449	COX14	high
ENSG00000178922	HYI	high
ENSG00000178951	ZBTB7A	high
ENSG00000178952	TUFM	high
ENSG00000179178	TMEM125	high
ENSG00000179218	CALR	high
ENSG00000179262	RAD23A	high
ENSG00000179271	GADD45GIP1	high
ENSG00000179403	VWA1	high
ENSG00000179593	ALOX15B	high
ENSG00000180398	MCFD2	high
ENSG00000180817	PPA1	high
ENSG00000180879	SSR4	high
ENSG00000181061	HIGD1A	high
ENSG00000181163	NPM1	high
ENSG00000181649	PHLDA2	high
ENSG00000181885	CLDN7	high
ENSG00000181924	COA4	high
ENSG00000182004	SNRPE	high
ENSG00000182154	MRPL41	high
ENSG00000182196	ARL6IP4	high
ENSG00000182220	ATP6AP2	high
ENSG00000182670	TTC3	high
ENSG00000182774	RPS17	high
ENSG00000182827	ACBD3	high
ENSG00000182899	RPL35A	high
ENSG00000182934	SRPRA	high
ENSG00000183011	NAA38	high
ENSG00000183172	SMDT1	high
ENSG00000183255	PTTG1IP	high
ENSG00000183283	DAZAP2	high
ENSG00000183291	SELENOF	high
ENSG00000183520	UTP11	high
ENSG00000183607	GKN2	high
ENSG00000183617	MRPL54	high
ENSG00000183648	NDUFB1	high
ENSG00000183978	COA3	high
ENSG00000184012	TMPRSS2	high
ENSG00000184076	UQCR10	high
ENSG00000184432	COPB2	high
ENSG00000184557	SOCS3	high
ENSG00000184787	UBE2G2	high
ENSG00000184840	TMED9	high
ENSG00000184897	H1-10	high
ENSG00000185088	RPS27L	high
ENSG00000185129	PURA	high
ENSG00000185201	IFITM2	high
ENSG00000185222	TCEAL9	high
ENSG00000185303	SFTPA2	high
ENSG00000185499	MUC1	high
ENSG00000185608	MRPL40	high
ENSG00000185624	P4HB	high
ENSG00000185650	ZFP36L1	high
ENSG00000185651	UBE2L3	high
ENSG00000185825	BCAP31	high
ENSG00000186063	AIDA	high
ENSG00000186184	POLR1D	high
ENSG00000186395	KRT10	high
ENSG00000186468	RPS23	high
ENSG00000186480	INSIG1	high
ENSG00000187051	RPS19BP1	high
ENSG00000187109	NAP1L1	high
ENSG00000187244	BCAM	high
ENSG00000187446	CHP1	high
ENSG00000187479	C11orf96	high
ENSG00000187735	TCEA1	high
ENSG00000187908	DMBT1	high
ENSG00000188186	LAMTOR4	high
ENSG00000188529	SRSF10	high
ENSG00000188612	SUMO2	high
ENSG00000188641	DPYD	high
ENSG00000188643	S100A16	high
ENSG00000188906	LRRK2	high
ENSG00000189060	H1-0	high
ENSG00000189171	S100A13	high
ENSG00000189221	MAOA	high
ENSG00000189266	PNRC2	high
ENSG00000189334	S100A14	high
ENSG00000189377	CXCL17	high
ENSG00000196199	MPHOSPH8	high
ENSG00000196230	TUBB	high
ENSG00000196419	XRCC6	high
ENSG00000196502	SULT1A1	high
ENSG00000196504	PRPF40A	high
ENSG00000196531	NACA	high
ENSG00000196636	SDHAF3	high
ENSG00000196683	TOMM7	high
ENSG00000196715	VKORC1L1	high
ENSG00000196924	FLNA	high
ENSG00000196975	ANXA4	high
ENSG00000197019	SERTAD1	high
ENSG00000197111	PCBP2	high
ENSG00000197249	SERPINA1	high
ENSG00000197415	VEPH1	high
ENSG00000197451	HNRNPAB	high
ENSG00000197728	RPS26	high
ENSG00000197746	PSAP	high
ENSG00000197747	S100A10	high
ENSG00000197756	RPL37A	high
ENSG00000197894	ADH5	high
ENSG00000197982	C1orf122	high
ENSG00000198034	RPS4X	high
ENSG00000198242	RPL23A	high
ENSG00000198258	UBL5	high
ENSG00000198363	ASPH	high
ENSG00000198431	TXNRD1	high
ENSG00000198585	NUDT16	high
ENSG00000198695	ND6	high
ENSG00000198755	RPL10A	high
ENSG00000198818	SFT2D1	high
ENSG00000198832	SELENOM	high
ENSG00000198898	CAPZA2	high
ENSG00000198900	TOP1	high
ENSG00000198918	RPL39	high
ENSG00000198931	APRT	high
ENSG00000203875	SNHG5	high
ENSG00000204256	BRD2	high
ENSG00000204287	HLA-DRA	high
ENSG00000204569	PPP1R10	high
ENSG00000204628	RACK1	high
ENSG00000205339	IPO7	high
ENSG00000205352	PRR13	high
ENSG00000205581	HMGN1	high
ENSG00000205937	RNPS1	high
ENSG00000206527	HACD2	high
ENSG00000212907	ND4L	high
ENSG00000213465	ARL2	high
ENSG00000213585	VDAC1	high
ENSG00000213639	PPP1CB	high
ENSG00000213719	CLIC1	high
ENSG00000213741	RPS29	high
ENSG00000214026	MRPL23	high
ENSG00000214026	LOC107987373	high
ENSG00000214063	TSPAN4	high
ENSG00000214530	STARD10	high
ENSG00000214708	LOC105371730	high
ENSG00000215021	PHB2	high
ENSG00000220205	VAMP2	high
ENSG00000221869	CEBPD	high
ENSG00000221983	UBA52	high
ENSG00000223865	HLA-DPB1	high
ENSG00000224078	NA	high
ENSG00000225921	NOL7	high
ENSG00000225972	MTND1P23	high
ENSG00000228474	OST4	high
ENSG00000229117	RPL41	high
ENSG00000230989	HSBP1	high
ENSG00000231389	HLA-DPA1	high
ENSG00000231500	RPS18	high
ENSG00000231925	TAPBP	high
ENSG00000232388	SMIM26	high
ENSG00000233016	SNHG7	high
ENSG00000233913	RPL10P9	high
ENSG00000233927	RPS28	high
ENSG00000234545	FAM133B	high
ENSG00000234741	GAS5	high
ENSG00000239467	ERICH2	high
ENSG00000239672	NME1	high
ENSG00000240583	AQP1	high
ENSG00000240972	MIF	high
ENSG00000241343	RPL36A	high
ENSG00000241399	CD302	high
ENSG00000241468	ATP5MF	high
ENSG00000241685	ARPC1A	high
ENSG00000242247	ARFGAP3	high
ENSG00000242265	PEG10	high
ENSG00000242372	EIF6	high
ENSG00000242485	MRPL20	high
ENSG00000243147	MRPL33	high
ENSG00000243927	MRPS6	high
ENSG00000244038	DDOST	high
ENSG00000244187	TMEM141	high
ENSG00000244405	ETV5	high
ENSG00000244754	N4BP2L2	high
ENSG00000244879	NA	high
ENSG00000245532	NEAT1	high
ENSG00000245694	CRNDE	high
ENSG00000245694	LOC101927480	high
ENSG00000245910	SNHG6	high
ENSG00000248890	HHIP-AS1	high
ENSG00000250479	CHCHD10	high
ENSG00000250722	SELENOP	high
ENSG00000253313	C1orf210	high
ENSG00000253729	PRKDC	high
ENSG00000254999	BRK1	high
ENSG00000257727	CNPY2	high
ENSG00000258844	NA	high
ENSG00000259803	SLC22A31	high
ENSG00000260032	NORAD	high
ENSG00000262814	MRPL12	high
ENSG00000265241	RBM8A	high
ENSG00000266472	MRPS21	high
ENSG00000268104	SLC6A14	high
ENSG00000269821	KCNQ1OT1	high
ENSG00000269893	SNHG8	high
ENSG00000272047	GTF2H5	high
ENSG00000272888	NA	high
ENSG00000277791	PSMB3	high
ENSG00000278311	GGNBP2	high
ENSG00000280138	NA	high
ENSG00000280285	NA	high
ENSG00000001036	FUCA2	medium
ENSG00000013306	SLC25A39	medium
ENSG00000015171	ZMYND11	medium
ENSG00000023330	ALAS1	medium
ENSG00000052841	TTC17	medium
ENSG00000053254	FOXN3	medium
ENSG00000061794	MRPS35	medium
ENSG00000064607	SUGP2	medium
ENSG00000065427	KARS1	medium
ENSG00000066322	ELOVL1	medium
ENSG00000067533	RRP15	medium
ENSG00000067829	IDH3G	medium
ENSG00000069345	DNAJA2	medium
ENSG00000071189	SNX13	medium
ENSG00000071626	DAZAP1	medium
ENSG00000071994	PDCD2	medium
ENSG00000074201	CLNS1A	medium
ENSG00000077097	TOP2B	medium
ENSG00000079785	DDX1	medium
ENSG00000081803	CADPS2	medium
ENSG00000082641	NFE2L1	medium
ENSG00000084234	APLP2	medium
ENSG00000086232	EIF2AK1	medium
ENSG00000086504	MRPL28	medium
ENSG00000086666	ZFAND6	medium
ENSG00000087460	GNAS	medium
ENSG00000090470	PDCD7	medium
ENSG00000091039	OSBPL8	medium
ENSG00000091490	SEL1L3	medium
ENSG00000096063	SRPK1	medium
ENSG00000100528	CNIH1	medium
ENSG00000101161	PRPF6	medium
ENSG00000101310	SEC23B	medium
ENSG00000101443	WFDC2	medium
ENSG00000101457	DNTTIP1	medium
ENSG00000102309	PIN4	medium
ENSG00000103657	HERC1	medium
ENSG00000104164	BLOC1S6	medium
ENSG00000104412	EMC2	medium
ENSG00000104824	HNRNPL	medium
ENSG00000105552	BCAT2	medium
ENSG00000105700	KXD1	medium
ENSG00000105755	ETHE1	medium
ENSG00000105819	PMPCB	medium
ENSG00000106603	COA1	medium
ENSG00000107854	TNKS2	medium
ENSG00000108587	GOSR1	medium
ENSG00000109111	SUPT6H	medium
ENSG00000109171	SLAIN2	medium
ENSG00000109572	CLCN3	medium
ENSG00000109787	KLF3	medium
ENSG00000109814	UGDH	medium
ENSG00000110422	HIPK3	medium
ENSG00000110911	SLC11A2	medium
ENSG00000112977	DAP	medium
ENSG00000113407	TARS1	medium
ENSG00000113460	BRIX1	medium
ENSG00000113575	PPP2CA	medium
ENSG00000114503	NCBP2	medium
ENSG00000115339	GALNT3	medium
ENSG00000115486	GGCX	medium
ENSG00000115806	GORASP2	medium
ENSG00000116752	BCAS2	medium
ENSG00000117868	ESYT2	medium
ENSG00000118579	MED28	medium
ENSG00000121073	SLC35B1	medium
ENSG00000121851	POLR3GL	medium
ENSG00000122958	VPS26A	medium
ENSG00000123136	DDX39A	medium
ENSG00000123989	CHPF	medium
ENSG00000124299	PEPD	medium
ENSG00000124486	USP9X	medium
ENSG00000125107	CNOT1	medium
ENSG00000125827	TMX4	medium
ENSG00000125967	NECAB3	medium
ENSG00000128185	DGCR6L	medium
ENSG00000129968	ABHD17A	medium
ENSG00000130222	GADD45G	medium
ENSG00000131828	PDHA1	medium
ENSG00000131981	LGALS3	medium
ENSG00000132153	DHX30	medium
ENSG00000132589	FLOT2	medium
ENSG00000133703	KRAS	medium
ENSG00000134152	KATNBL1	medium
ENSG00000134278	SPIRE1	medium
ENSG00000134285	FKBP11	medium
ENSG00000134686	PHC2	medium
ENSG00000134910	STT3A	medium
ENSG00000135018	UBQLN1	medium
ENSG00000135241	PNPLA8	medium
ENSG00000135945	REV1	medium
ENSG00000136279	DBNL	medium
ENSG00000136436	CALCOCO2	medium
ENSG00000136813	ECPAS	medium
ENSG00000136819	C9orf78	medium
ENSG00000137692	DCUN1D5	medium
ENSG00000138078	PREPL	medium
ENSG00000138363	ATIC	medium
ENSG00000138430	OLA1	medium
ENSG00000139168	ZCRB1	medium
ENSG00000140905	GCSH	medium
ENSG00000140992	PDPK1	medium
ENSG00000141298	SSH2	medium
ENSG00000141458	NPC1	medium
ENSG00000141971	MVB12A	medium
ENSG00000143641	GALNT2	medium
ENSG00000143815	LBR	medium
ENSG00000143933	CALM2	medium
ENSG00000144028	SNRNP200	medium
ENSG00000144029	MRPS5	medium
ENSG00000144848	ATG3	medium
ENSG00000146477	SLC22A3	medium
ENSG00000146676	PURB	medium
ENSG00000147010	SH3KBP1	medium
ENSG00000147162	OGT	medium
ENSG00000148335	NTMT1	medium
ENSG00000149600	COMMD7	medium
ENSG00000150054	MPP7	medium
ENSG00000150527	MIA2	medium
ENSG00000150991	UBC	medium
ENSG00000151465	CDC123	medium
ENSG00000152128	TMEM163	medium
ENSG00000153922	CHD1	medium
ENSG00000155090	KLF10	medium
ENSG00000155463	OXA1L	medium
ENSG00000156515	HK1	medium
ENSG00000158042	MRPL17	medium
ENSG00000158470	B4GALT5	medium
ENSG00000159692	CTBP1	medium
ENSG00000162980	ARL5A	medium
ENSG00000163605	PPP4R2	medium
ENSG00000163738	MTHFD2L	medium
ENSG00000163932	PRKCD	medium
ENSG00000164163	ABCE1	medium
ENSG00000164172	MOCS2	medium
ENSG00000164211	STARD4	medium
ENSG00000165030	NFIL3	medium
ENSG00000165105	RASEF	medium
ENSG00000165487	MICU2	medium
ENSG00000165609	NUDT5	medium
ENSG00000166340	TPP1	medium
ENSG00000167770	OTUB1	medium
ENSG00000168291	PDHB	medium
ENSG00000168958	MFF	medium
ENSG00000169727	GPS1	medium
ENSG00000169762	TAPT1	medium
ENSG00000169895	SYAP1	medium
ENSG00000170142	UBE2E1	medium
ENSG00000170275	CRTAP	medium
ENSG00000171421	MRPL36	medium
ENSG00000171867	PRNP	medium
ENSG00000172164	SNTB1	medium
ENSG00000172301	COPRS	medium
ENSG00000173153	ESRRA	medium
ENSG00000175274	TP53I11	medium
ENSG00000175287	PHYHD1	medium
ENSG00000175324	LSM1	medium
ENSG00000176261	ZBTB8OS	medium
ENSG00000176871	WSB2	medium
ENSG00000177479	ARIH2	medium
ENSG00000177885	GRB2	medium
ENSG00000180957	PITPNB	medium
ENSG00000181704	YIPF6	medium
ENSG00000181789	COPG1	medium
ENSG00000182718	ANXA2	medium
ENSG00000183741	CBX6	medium
ENSG00000183864	TOB2	medium
ENSG00000183955	KMT5A	medium
ENSG00000184924	PTRHD1	medium
ENSG00000187193	MT1X	medium
ENSG00000187555	USP7	medium
ENSG00000188559	RALGAPA2	medium
ENSG00000189306	RRP7A	medium
ENSG00000196262	PPIA	medium
ENSG00000197345	MRPL21	medium
ENSG00000197858	GPAA1	medium
ENSG00000197956	S100A6	medium
ENSG00000198160	MIER1	medium
ENSG00000198162	MAN1A2	medium
ENSG00000198498	TMA16	medium
ENSG00000198692	EIF1AY	medium
ENSG00000198791	CNOT7	medium
ENSG00000198833	UBE2J1	medium
ENSG00000204120	GIGYF2	medium
ENSG00000204272	NBDY	medium
ENSG00000204356	NELFE	medium
ENSG00000204469	PRRC2A	medium
ENSG00000213463	SYNJ2BP	medium
ENSG00000214753	HNRNPUL2	medium
ENSG00000244313	NA	medium
ENSG00000250317	SMIM20	medium
