IdentityGene	GeneSymbol	Level
ENSG00000003056	M6PR	high
ENSG00000003402	CFLAR	high
ENSG00000003436	TFPI	high
ENSG00000005020	SKAP2	high
ENSG00000006210	CX3CL1	high
ENSG00000008513	ST3GAL1	high
ENSG00000010810	FYN	high
ENSG00000013441	CLK1	high
ENSG00000014123	UFL1	high
ENSG00000018408	WWTR1	high
ENSG00000027697	IFNGR1	high
ENSG00000030582	GRN	high
ENSG00000049618	ARID1B	high
ENSG00000054598	FOXC1	high
ENSG00000064989	CALCRL	high
ENSG00000067082	KLF6	high
ENSG00000067167	TRAM1	high
ENSG00000069702	TGFBR3	high
ENSG00000070831	CDC42	high
ENSG00000072163	LIMS2	high
ENSG00000074590	NUAK1	high
ENSG00000077238	IL4R	high
ENSG00000078401	EDN1	high
ENSG00000078596	ITM2A	high
ENSG00000079102	RUNX1T1	high
ENSG00000081041	CXCL2	high
ENSG00000083168	KAT6A	high
ENSG00000087274	ADD1	high
ENSG00000087884	AAMDC	high
ENSG00000088205	DDX18	high
ENSG00000088387	DOCK9	high
ENSG00000089159	PXN	high
ENSG00000089248	ERP29	high
ENSG00000090376	IRAK3	high
ENSG00000095303	PTGS1	high
ENSG00000097033	SH3GLB1	high
ENSG00000099260	PALMD	high
ENSG00000099622	CIRBP	high
ENSG00000099795	NDUFB7	high
ENSG00000099860	GADD45B	high
ENSG00000100097	LGALS1	high
ENSG00000100234	TIMP3	high
ENSG00000101187	SLCO4A1	high
ENSG00000101335	MYL9	high
ENSG00000101955	SRPX	high
ENSG00000102760	RGCC	high
ENSG00000103187	COTL1	high
ENSG00000103429	BFAR	high
ENSG00000104325	DECR1	high
ENSG00000104368	PLAT	high
ENSG00000104388	RAB2A	high
ENSG00000104870	FCGRT	high
ENSG00000105518	TMEM205	high
ENSG00000105835	NAMPT	high
ENSG00000105854	PON2	high
ENSG00000105887	MTPN	high
ENSG00000105887	LUZP6	high
ENSG00000107317	PTGDS	high
ENSG00000108219	TSPAN14	high
ENSG00000108424	KPNB1	high
ENSG00000108582	CPD	high
ENSG00000109046	WSB1	high
ENSG00000109180	OCIAD1	high
ENSG00000110799	VWF	high
ENSG00000111275	ALDH2	high
ENSG00000111678	C12orf57	high
ENSG00000112414	ADGRG6	high
ENSG00000112679	DUSP22	high
ENSG00000112936	C7	high
ENSG00000113594	LIFR	high
ENSG00000114857	NKTR	high
ENSG00000114861	FOXP1	high
ENSG00000114948	ADAM23	high
ENSG00000115414	FN1	high
ENSG00000115524	SF3B1	high
ENSG00000115594	IL1R1	high
ENSG00000115602	IL1RL1	high
ENSG00000116005	PCYOX1	high
ENSG00000116016	EPAS1	high
ENSG00000116095	PLEKHA3	high
ENSG00000116574	RHOU	high
ENSG00000116678	LEPR	high
ENSG00000116729	WLS	high
ENSG00000116815	CD58	high
ENSG00000117318	ID3	high
ENSG00000117362	APH1A	high
ENSG00000117461	PIK3R3	high
ENSG00000118515	SGK1	high
ENSG00000118523	CCN2	high
ENSG00000118946	PCDH17	high
ENSG00000119707	RBM25	high
ENSG00000120738	EGR1	high
ENSG00000120833	SOCS2	high
ENSG00000121774	KHDRBS1	high
ENSG00000122679	RAMP3	high
ENSG00000122786	CALD1	high
ENSG00000123358	NR4A1	high
ENSG00000124212	PTGIS	high
ENSG00000124440	HIF3A	high
ENSG00000124570	SERPINB6	high
ENSG00000125148	MT2A	high
ENSG00000125347	IRF1	high
ENSG00000125652	ALKBH7	high
ENSG00000125740	FOSB	high
ENSG00000125968	ID1	high
ENSG00000125991	ERGIC3	high
ENSG00000126432	PRDX5	high
ENSG00000127329	PTPRB	high
ENSG00000127528	KLF2	high
ENSG00000127838	PNKD	high
ENSG00000127947	PTPN12	high
ENSG00000128294	TPST2	high
ENSG00000128789	PSMG2	high
ENSG00000129559	NEDD8	high
ENSG00000129657	SEC14L1	high
ENSG00000130164	LDLR	high
ENSG00000130202	NECTIN2	high
ENSG00000130520	LSM4	high
ENSG00000130522	JUND	high
ENSG00000130638	ATXN10	high
ENSG00000130770	ATP5IF1	high
ENSG00000131171	SH3BGRL	high
ENSG00000131238	PPT1	high
ENSG00000131408	NR1H2	high
ENSG00000131477	RAMP2	high
ENSG00000131634	TMEM204	high
ENSG00000131724	IL13RA1	high
ENSG00000132424	PNISR	high
ENSG00000132432	SEC61G	high
ENSG00000132824	SERINC3	high
ENSG00000133872	SARAF	high
ENSG00000134049	IER3IP1	high
ENSG00000134107	BHLHE40	high
ENSG00000134138	MEIS2	high
ENSG00000134152	KATNBL1	high
ENSG00000134453	RBM17	high
ENSG00000134996	OSTF1	high
ENSG00000135048	CEMIP2	high
ENSG00000135250	SRPK2	high
ENSG00000135926	TMBIM1	high
ENSG00000136003	ISCU	high
ENSG00000136160	EDNRB	high
ENSG00000136997	MYC	high
ENSG00000137033	IL33	high
ENSG00000137076	TLN1	high
ENSG00000137207	YIPF3	high
ENSG00000137500	CCDC90B	high
ENSG00000137834	SMAD6	high
ENSG00000138061	CYP1B1	high
ENSG00000138085	ATRAID	high
ENSG00000138166	DUSP5	high
ENSG00000138185	ENTPD1	high
ENSG00000138772	ANXA3	high
ENSG00000139112	GABARAPL1	high
ENSG00000139567	ACVRL1	high
ENSG00000140990	NDUFB10	high
ENSG00000141522	ARHGDIA	high
ENSG00000141905	NFIC	high
ENSG00000142227	EMP3	high
ENSG00000142748	FCN3	high
ENSG00000142871	CCN1	high
ENSG00000143079	CTTNBP2NL	high
ENSG00000143252	SDHC	high
ENSG00000143384	MCL1	high
ENSG00000143669	LYST	high
ENSG00000143742	SRP9	high
ENSG00000144635	DYNC1LI1	high
ENSG00000144677	CTDSPL	high
ENSG00000144724	PTPRG	high
ENSG00000144810	COL8A1	high
ENSG00000144837	PLA1A	high
ENSG00000145012	LPP	high
ENSG00000145632	PLK2	high
ENSG00000146374	RSPO3	high
ENSG00000147649	MTDH	high
ENSG00000148154	UGCG	high
ENSG00000148737	TCF7L2	high
ENSG00000149115	TNKS1BP1	high
ENSG00000149196	HIKESHI	high
ENSG00000149573	MPZL2	high
ENSG00000149591	TAGLN	high
ENSG00000150687	PRSS23	high
ENSG00000150907	FOXO1	high
ENSG00000150938	CRIM1	high
ENSG00000152558	TMEM123	high
ENSG00000153071	DAB2	high
ENSG00000153071	LOC112267931	high
ENSG00000153721	CNKSR3	high
ENSG00000154556	SORBS2	high
ENSG00000155366	RHOC	high
ENSG00000155508	CNOT8	high
ENSG00000156313	RPGR	high
ENSG00000156411	ATP5MPL	high
ENSG00000157107	FCHO2	high
ENSG00000157514	TSC22D3	high
ENSG00000157933	SKI	high
ENSG00000159403	C1R	high
ENSG00000160752	FDPS	high
ENSG00000162174	ASRGL1	high
ENSG00000162191	UBXN1	high
ENSG00000162517	PEF1	high
ENSG00000162692	VCAM1	high
ENSG00000162772	ATF3	high
ENSG00000163072	NOSTRIN	high
ENSG00000163687	DNASE1L3	high
ENSG00000163788	SNRK	high
ENSG00000163956	LRPAP1	high
ENSG00000164167	LSM6	high
ENSG00000164405	UQCRQ	high
ENSG00000164741	DLC1	high
ENSG00000165637	VDAC2	high
ENSG00000166128	RAB8B	high
ENSG00000168092	PAFAH1B2	high
ENSG00000168264	IRF2BP2	high
ENSG00000168309	FAM107A	high
ENSG00000168385	SEPTIN2	high
ENSG00000168405	CMAHP	high
ENSG00000168685	IL7R	high
ENSG00000168807	SNTB2	high
ENSG00000168899	VAMP5	high
ENSG00000168938	PPIC	high
ENSG00000168993	CPLX1	high
ENSG00000169715	MT1E	high
ENSG00000169738	DCXR	high
ENSG00000169756	LIMS1	high
ENSG00000171056	SOX7	high
ENSG00000171159	C9orf16	high
ENSG00000171530	TBCA	high
ENSG00000172216	CEBPB	high
ENSG00000172493	AFF1	high
ENSG00000173706	HEG1	high
ENSG00000174175	SELP	high
ENSG00000174640	SLCO2A1	high
ENSG00000174886	NDUFA11	high
ENSG00000175348	TMEM9B	high
ENSG00000175390	EIF3F	high
ENSG00000176485	PLAAT3	high
ENSG00000177303	CASKIN2	high
ENSG00000177311	ZBTB38	high
ENSG00000177606	JUN	high
ENSG00000179144	GIMAP7	high
ENSG00000179218	CALR	high
ENSG00000179388	EGR3	high
ENSG00000183087	GAS6	high
ENSG00000183255	PTTG1IP	high
ENSG00000183283	DAZAP2	high
ENSG00000183722	LHFPL6	high
ENSG00000184432	COPB2	high
ENSG00000184640	SEPTIN9	high
ENSG00000184897	H1-10	high
ENSG00000185010	F8	high
ENSG00000185339	TCN2	high
ENSG00000185432	METTL7A	high
ENSG00000185551	NR2F2	high
ENSG00000185630	PBX1	high
ENSG00000185896	LAMP1	high
ENSG00000186260	MRTFB	high
ENSG00000187109	NAP1L1	high
ENSG00000187193	MT1X	high
ENSG00000188186	LAMTOR4	high
ENSG00000189067	LITAF	high
ENSG00000196154	S100A4	high
ENSG00000196199	MPHOSPH8	high
ENSG00000196562	SULF2	high
ENSG00000196655	TRAPPC4	high
ENSG00000197879	MYO1C	high
ENSG00000198189	HSD17B11	high
ENSG00000198791	CNOT7	high
ENSG00000198959	TGM2	high
ENSG00000203727	SAMD5	high
ENSG00000204217	BMPR2	high
ENSG00000204370	SDHD	high
ENSG00000204389	HSPA1A	high
ENSG00000204642	HLA-F	high
ENSG00000205364	MT1M	high
ENSG00000211445	GPX3	high
ENSG00000211450	SELENOH	high
ENSG00000213316	LTC4S	high
ENSG00000213465	ARL2	high
ENSG00000213853	EMP2	high
ENSG00000223865	HLA-DPB1	high
ENSG00000225670	NA	high
ENSG00000233016	SNHG7	high
ENSG00000253276	CCDC71L	high
ENSG00000260032	NORAD	high
ENSG00000267519	NA	high
ENSG00000274736	CCL23	high
ENSG00000275832	ARHGAP23	high
ENSG00000276550	HERC2P2	high
ENSG00000277258	PCGF2	high
ENSG00000277494	GPIHBP1	high
ENSG00000006451	RALA	medium
ENSG00000008988	RPS20	medium
ENSG00000035403	VCL	medium
ENSG00000055211	GINM1	medium
ENSG00000064393	HIPK2	medium
ENSG00000071242	RPS6KA2	medium
ENSG00000074527	NTN4	medium
ENSG00000075292	ZNF638	medium
ENSG00000081154	PCNP	medium
ENSG00000089009	RPL6	medium
ENSG00000090863	GLG1	medium
ENSG00000092841	MYL6	medium
ENSG00000100316	RPL3	medium
ENSG00000101161	PRPF6	medium
ENSG00000102030	NAA10	medium
ENSG00000102580	DNAJC3	medium
ENSG00000103241	FOXF1	medium
ENSG00000104365	IKBKB	medium
ENSG00000105223	PLD3	medium
ENSG00000105372	RPS19	medium
ENSG00000106245	BUD31	medium
ENSG00000108100	CCNY	medium
ENSG00000108854	SMURF2	medium
ENSG00000109906	ZBTB16	medium
ENSG00000111640	GAPDH	medium
ENSG00000112576	CCND3	medium
ENSG00000112851	ERBIN	medium
ENSG00000113068	PFDN1	medium
ENSG00000114698	PLSCR4	medium
ENSG00000114784	EIF1B	medium
ENSG00000117335	CD46	medium
ENSG00000118482	PHF3	medium
ENSG00000119669	IRF2BPL	medium
ENSG00000122026	RPL21	medium
ENSG00000123933	MXD4	medium
ENSG00000124767	GLO1	medium
ENSG00000125304	TM9SF2	medium
ENSG00000127884	ECHS1	medium
ENSG00000128016	ZFP36	medium
ENSG00000129968	ABHD17A	medium
ENSG00000130208	APOC1	medium
ENSG00000130414	NDUFA10	medium
ENSG00000130731	METTL26	medium
ENSG00000133800	LYVE1	medium
ENSG00000134480	CCNH	medium
ENSG00000135111	TBX3	medium
ENSG00000136156	ITM2B	medium
ENSG00000136802	LRRC8A	medium
ENSG00000137726	FXYD6	medium
ENSG00000140577	CRTC3	medium
ENSG00000142937	RPS8	medium
ENSG00000145247	OCIAD2	medium
ENSG00000145592	RPL37	medium
ENSG00000145860	RNF145	medium
ENSG00000147403	RPL10	medium
ENSG00000147454	SLC25A37	medium
ENSG00000148053	NTRK2	medium
ENSG00000148488	ST8SIA6	medium
ENSG00000149547	EI24	medium
ENSG00000150630	VEGFC	medium
ENSG00000152583	SPARCL1	medium
ENSG00000153827	TRIP12	medium
ENSG00000156508	EEF1A1	medium
ENSG00000160551	TAOK1	medium
ENSG00000165813	CCDC186	medium
ENSG00000165916	PSMC3	medium
ENSG00000166292	TMEM100	medium
ENSG00000167283	ATP5MG	medium
ENSG00000167397	VKORC1	medium
ENSG00000167996	FTH1	medium
ENSG00000168484	SFTPC	medium
ENSG00000168672	LRATD2	medium
ENSG00000169291	SHE	medium
ENSG00000170458	CD14	medium
ENSG00000172428	COPS9	medium
ENSG00000173166	RAPH1	medium
ENSG00000173418	NAA20	medium
ENSG00000174748	RPL15	medium
ENSG00000176907	TCIM	medium
ENSG00000179094	PER1	medium
ENSG00000181104	F2R	medium
ENSG00000181722	ZBTB20	medium
ENSG00000183615	FAM167B	medium
ENSG00000184076	UQCR10	medium
ENSG00000187514	PTMA	medium
ENSG00000189221	MAOA	medium
ENSG00000198625	MDM4	medium
ENSG00000198727	CYTB	medium
ENSG00000198763	ND2	medium
ENSG00000198843	SELENOT	medium
ENSG00000204435	CSNK2B	medium
ENSG00000205038	PKHD1L1	medium
ENSG00000205362	MT1A	medium
ENSG00000205542	TMSB4X	medium
ENSG00000205981	DNAJC19	medium
ENSG00000206503	HLA-A	medium
ENSG00000211455	STK38L	medium
ENSG00000213088	ACKR1	medium
ENSG00000213741	RPS29	medium
ENSG00000225783	MIAT	medium
ENSG00000229117	RPL41	medium
ENSG00000240583	AQP1	medium
ENSG00000245532	NEAT1	medium
ENSG00000246705	H2AJ	medium
ENSG00000261371	PECAM1	medium
ENSG00000265972	TXNIP	medium
ENSG00000278931	NA	medium
