IdentityGene	GeneSymbol	Level
ENSG00000000938	FGR	high
ENSG00000003056	M6PR	high
ENSG00000003402	CFLAR	high
ENSG00000004059	ARF5	high
ENSG00000004455	AK2	high
ENSG00000005020	SKAP2	high
ENSG00000005022	SLC25A5	high
ENSG00000008988	RPS20	high
ENSG00000010244	ZNF207	high
ENSG00000010610	CD4	high
ENSG00000010810	FYN	high
ENSG00000011422	PLAUR	high
ENSG00000012660	ELOVL5	high
ENSG00000012983	MAP4K5	high
ENSG00000015285	WAS	high
ENSG00000015475	BID	high
ENSG00000018189	RUFY3	high
ENSG00000023191	RNH1	high
ENSG00000023445	BIRC3	high
ENSG00000023902	PLEKHO1	high
ENSG00000025293	PHF20	high
ENSG00000025708	TYMP	high
ENSG00000026297	RNASET2	high
ENSG00000027697	IFNGR1	high
ENSG00000028277	POU2F2	high
ENSG00000029363	BCLAF1	high
ENSG00000032219	ARID4A	high
ENSG00000034713	GABARAPL2	high
ENSG00000038219	BOD1L1	high
ENSG00000042753	AP2S1	high
ENSG00000042980	ADAM28	high
ENSG00000043462	LCP2	high
ENSG00000046651	OFD1	high
ENSG00000047410	TPR	high
ENSG00000048052	HDAC9	high
ENSG00000048740	CELF2	high
ENSG00000049618	ARID1B	high
ENSG00000051108	HERPUD1	high
ENSG00000052795	FNIP2	high
ENSG00000053254	FOXN3	high
ENSG00000054118	THRAP3	high
ENSG00000054148	PHPT1	high
ENSG00000054267	ARID4B	high
ENSG00000058272	PPP1R12A	high
ENSG00000059377	TBXAS1	high
ENSG00000059804	SLC2A3	high
ENSG00000060138	YBX3	high
ENSG00000060237	WNK1	high
ENSG00000060339	CCAR1	high
ENSG00000060971	ACAA1	high
ENSG00000062485	CS	high
ENSG00000063177	RPL18	high
ENSG00000064666	CNN2	high
ENSG00000065413	ANKRD44	high
ENSG00000065548	ZC3H15	high
ENSG00000065615	CYB5R4	high
ENSG00000066294	CD84	high
ENSG00000066336	SPI1	high
ENSG00000066777	ARFGEF1	high
ENSG00000067082	KLF6	high
ENSG00000068305	MEF2A	high
ENSG00000068796	KIF2A	high
ENSG00000069275	NUCKS1	high
ENSG00000069329	VPS35	high
ENSG00000069849	ATP1B3	high
ENSG00000071082	RPL31	high
ENSG00000071462	BUD23	high
ENSG00000072364	AFF4	high
ENSG00000072778	ACADVL	high
ENSG00000073614	KDM5A	high
ENSG00000073803	MAP3K13	high
ENSG00000074201	CLNS1A	high
ENSG00000074800	ENO1	high
ENSG00000075142	SRI	high
ENSG00000075151	EIF4G3	high
ENSG00000075426	FOSL2	high
ENSG00000075618	FSCN1	high
ENSG00000075785	RAB7A	high
ENSG00000076662	ICAM3	high
ENSG00000077721	UBE2A	high
ENSG00000078668	VDAC3	high
ENSG00000080503	SMARCA2	high
ENSG00000080546	SESN1	high
ENSG00000081189	MEF2C	high
ENSG00000081237	PTPRC	high
ENSG00000081320	STK17B	high
ENSG00000082074	FYB1	high
ENSG00000082996	RNF13	high
ENSG00000083799	CYLD	high
ENSG00000083896	YTHDC1	high
ENSG00000084070	SMAP2	high
ENSG00000084207	GSTP1	high
ENSG00000084234	APLP2	high
ENSG00000084623	EIF3I	high
ENSG00000084733	RAB10	high
ENSG00000084754	HADHA	high
ENSG00000085719	CPNE3	high
ENSG00000086061	DNAJA1	high
ENSG00000086300	SNX10	high
ENSG00000087302	RTRAF	high
ENSG00000088205	DDX18	high
ENSG00000089009	RPL6	high
ENSG00000089220	PEBP1	high
ENSG00000089248	ERP29	high
ENSG00000089327	FXYD5	high
ENSG00000089693	MLF2	high
ENSG00000089737	DDX24	high
ENSG00000089820	ARHGAP4	high
ENSG00000090013	BLVRB	high
ENSG00000090104	RGS1	high
ENSG00000090266	NDUFB2	high
ENSG00000090339	ICAM1	high
ENSG00000090382	LYZ	high
ENSG00000090470	PDCD7	high
ENSG00000090621	PABPC4	high
ENSG00000090863	GLG1	high
ENSG00000091039	OSBPL8	high
ENSG00000091164	TXNL1	high
ENSG00000091317	CMTM6	high
ENSG00000092201	SUPT16H	high
ENSG00000092531	SNAP23	high
ENSG00000092964	DPYSL2	high
ENSG00000093010	COMT	high
ENSG00000093072	ADA2	high
ENSG00000096060	FKBP5	high
ENSG00000097033	SH3GLB1	high
ENSG00000099337	KCNK6	high
ENSG00000099622	CIRBP	high
ENSG00000099860	GADD45B	high
ENSG00000099875	MKNK2	high
ENSG00000099901	RANBP1	high
ENSG00000100079	LGALS2	high
ENSG00000100097	LGALS1	high
ENSG00000100138	SNU13	high
ENSG00000100243	CYB5R3	high
ENSG00000100345	MYH9	high
ENSG00000100387	RBX1	high
ENSG00000100442	FKBP3	high
ENSG00000100503	NIN	high
ENSG00000100567	PSMA3	high
ENSG00000100632	ERH	high
ENSG00000100650	SRSF5	high
ENSG00000100811	YY1	high
ENSG00000100852	ARHGAP5	high
ENSG00000100906	NFKBIA	high
ENSG00000101040	ZMYND8	high
ENSG00000101109	STK4	high
ENSG00000101220	C20orf27	high
ENSG00000101265	RASSF2	high
ENSG00000101336	HCK	high
ENSG00000101347	SAMHD1	high
ENSG00000101367	MAPRE1	high
ENSG00000101439	CST3	high
ENSG00000101745	ANKRD12	high
ENSG00000102103	PQBP1	high
ENSG00000102309	PIN4	high
ENSG00000102317	RBM3	high
ENSG00000102445	RUBCNL	high
ENSG00000102760	RGCC	high
ENSG00000102879	CORO1A	high
ENSG00000103024	NME3	high
ENSG00000103035	PSMD7	high
ENSG00000103187	COTL1	high
ENSG00000103342	GSPT1	high
ENSG00000103381	CPPED1	high
ENSG00000103490	PYCARD	high
ENSG00000103495	MAZ	high
ENSG00000103653	CSK	high
ENSG00000103769	RAB11A	high
ENSG00000103811	CTSH	high
ENSG00000103994	ZNF106	high
ENSG00000104131	EIF3J	high
ENSG00000104164	BLOC1S6	high
ENSG00000104312	RIPK2	high
ENSG00000104325	DECR1	high
ENSG00000104408	EIF3E	high
ENSG00000104447	TRPS1	high
ENSG00000104714	ERICH1	high
ENSG00000104763	ASAH1	high
ENSG00000104852	SNRNP70	high
ENSG00000104870	FCGRT	high
ENSG00000104964	TLE5	high
ENSG00000104979	C19orf53	high
ENSG00000105185	PDCD5	high
ENSG00000105202	FBL	high
ENSG00000105246	EBI3	high
ENSG00000105254	TBCB	high
ENSG00000105323	HNRNPUL1	high
ENSG00000105373	NOP53	high
ENSG00000105401	CDC37	high
ENSG00000105755	ETHE1	high
ENSG00000105835	NAMPT	high
ENSG00000106028	SSBP1	high
ENSG00000106052	TAX1BP1	high
ENSG00000106066	CPVL	high
ENSG00000106268	NUDT1	high
ENSG00000106400	ZNHIT1	high
ENSG00000106546	AHR	high
ENSG00000106682	EIF4H	high
ENSG00000106829	TLE4	high
ENSG00000107262	BAG1	high
ENSG00000107290	SETX	high
ENSG00000107341	UBE2R2	high
ENSG00000107372	ZFAND5	high
ENSG00000107551	RASSF4	high
ENSG00000107581	EIF3A	high
ENSG00000107738	VSIR	high
ENSG00000107968	MAP3K8	high
ENSG00000108091	CCDC6	high
ENSG00000108100	CCNY	high
ENSG00000108106	UBE2S	high
ENSG00000108179	PPIF	high
ENSG00000108298	RPL19	high
ENSG00000108424	KPNB1	high
ENSG00000108639	SYNGR2	high
ENSG00000108848	LUC7L3	high
ENSG00000108946	PRKAR1A	high
ENSG00000109180	OCIAD1	high
ENSG00000109320	NFKB1	high
ENSG00000109321	AREG	high
ENSG00000109390	NDUFC1	high
ENSG00000109475	RPL34	high
ENSG00000109684	CLNK	high
ENSG00000109787	KLF3	high
ENSG00000109920	FNBP4	high
ENSG00000110011	DNAJC4	high
ENSG00000110077	MS4A6A	high
ENSG00000110324	IL10RA	high
ENSG00000110395	CBL	high
ENSG00000110651	CD81	high
ENSG00000110717	NDUFS8	high
ENSG00000110848	CD69	high
ENSG00000110917	MLEC	high
ENSG00000110958	PTGES3	high
ENSG00000110987	BCL7A	high
ENSG00000111011	RSRC2	high
ENSG00000111237	VPS29	high
ENSG00000111275	ALDH2	high
ENSG00000111276	CDKN1B	high
ENSG00000111328	CDK2AP1	high
ENSG00000111348	ARHGDIB	high
ENSG00000111371	SLC38A1	high
ENSG00000111666	CHPT1	high
ENSG00000111678	C12orf57	high
ENSG00000111679	PTPN6	high
ENSG00000111716	LDHB	high
ENSG00000111775	COX6A1	high
ENSG00000111817	DSE	high
ENSG00000111843	TMEM14C	high
ENSG00000111859	NEDD9	high
ENSG00000111913	RIPOR2	high
ENSG00000112137	PHACTR1	high
ENSG00000112149	CD83	high
ENSG00000112297	CRYBG1	high
ENSG00000112335	SNX3	high
ENSG00000112343	TRIM38	high
ENSG00000112576	CCND3	high
ENSG00000112739	PRPF4B	high
ENSG00000112799	LY86	high
ENSG00000112851	ERBIN	high
ENSG00000113070	HBEGF	high
ENSG00000113141	IK	high
ENSG00000113282	CLINT1	high
ENSG00000113532	ST8SIA4	high
ENSG00000113580	NR3C1	high
ENSG00000113648	MACROH2A1	high
ENSG00000113712	CSNK1A1	high
ENSG00000113811	SELENOK	high
ENSG00000113916	BCL6	high
ENSG00000114125	RNF7	high
ENSG00000114353	GNAI2	high
ENSG00000114391	RPL24	high
ENSG00000114416	FXR1	high
ENSG00000114784	EIF1B	high
ENSG00000114850	SSR3	high
ENSG00000114861	FOXP1	high
ENSG00000114978	MOB1A	high
ENSG00000115091	ACTR3	high
ENSG00000115128	SF3B6	high
ENSG00000115165	CYTIP	high
ENSG00000115232	ITGA4	high
ENSG00000115234	SNX17	high
ENSG00000115241	PPM1G	high
ENSG00000115268	RPS15	high
ENSG00000115271	GCA	high
ENSG00000115286	NDUFS7	high
ENSG00000115310	RTN4	high
ENSG00000115355	CCDC88A	high
ENSG00000115484	CCT4	high
ENSG00000115738	ID2	high
ENSG00000115760	BIRC6	high
ENSG00000115762	PLEKHB2	high
ENSG00000115935	WIPF1	high
ENSG00000115944	COX7A2L	high
ENSG00000115956	PLEK	high
ENSG00000116030	SUMO1	high
ENSG00000116044	NFE2L2	high
ENSG00000116251	RPL22	high
ENSG00000116350	SRSF4	high
ENSG00000116473	RAP1A	high
ENSG00000116586	LAMTOR2	high
ENSG00000116701	NCF2	high
ENSG00000116717	GADD45A	high
ENSG00000116741	RGS2	high
ENSG00000117091	CD48	high
ENSG00000117280	RAB29	high
ENSG00000117450	PRDX1	high
ENSG00000117614	SYF2	high
ENSG00000117713	ARID1A	high
ENSG00000118292	C1orf54	high
ENSG00000118503	TNFAIP3	high
ENSG00000118508	RAB32	high
ENSG00000118515	SGK1	high
ENSG00000118564	FBXL5	high
ENSG00000118680	MYL12B	high
ENSG00000118816	CCNI	high
ENSG00000118855	MFSD1	high
ENSG00000119048	UBE2B	high
ENSG00000119138	KLF9	high
ENSG00000119314	PTBP3	high
ENSG00000119508	NR4A3	high
ENSG00000119655	NPC2	high
ENSG00000119705	SLIRP	high
ENSG00000119707	RBM25	high
ENSG00000120129	DUSP1	high
ENSG00000120438	TCP1	high
ENSG00000120533	ENY2	high
ENSG00000120616	EPC1	high
ENSG00000120675	DNAJC15	high
ENSG00000120690	ELF1	high
ENSG00000120709	FAM53C	high
ENSG00000120709	LOC100128966	high
ENSG00000120727	PAIP2	high
ENSG00000120742	SERP1	high
ENSG00000120875	DUSP4	high
ENSG00000120992	LYPLA1	high
ENSG00000121552	CSTA	high
ENSG00000121691	CAT	high
ENSG00000121774	KHDRBS1	high
ENSG00000121966	CXCR4	high
ENSG00000122025	FLT3	high
ENSG00000122033	MTIF3	high
ENSG00000122257	RBBP6	high
ENSG00000122644	ARL4A	high
ENSG00000122705	CLTA	high
ENSG00000123066	MED13L	high
ENSG00000123144	TRIR	high
ENSG00000123200	ZC3H13	high
ENSG00000123338	NCKAP1L	high
ENSG00000123349	PFDN5	high
ENSG00000123358	NR4A1	high
ENSG00000123505	AMD1	high
ENSG00000123684	LPGAT1	high
ENSG00000123933	MXD4	high
ENSG00000124126	PREX1	high
ENSG00000124151	NCOA3	high
ENSG00000124193	SRSF6	high
ENSG00000124357	NAGK	high
ENSG00000124570	SERPINB6	high
ENSG00000124575	H1-3	high
ENSG00000124614	RPS10	high
ENSG00000124762	CDKN1A	high
ENSG00000124767	GLO1	high
ENSG00000124783	SSR1	high
ENSG00000124795	DEK	high
ENSG00000124831	LRRFIP1	high
ENSG00000124942	AHNAK	high
ENSG00000125347	IRF1	high
ENSG00000125375	DMAC2L	high
ENSG00000125534	PPDPF	high
ENSG00000125538	IL1B	high
ENSG00000125652	ALKBH7	high
ENSG00000125691	RPL23	high
ENSG00000125740	FOSB	high
ENSG00000125753	VASP	high
ENSG00000125868	DSTN	high
ENSG00000125870	SNRPB2	high
ENSG00000125970	RALY	high
ENSG00000125977	EIF2S2	high
ENSG00000126067	PSMB2	high
ENSG00000126264	HCST	high
ENSG00000126267	COX6B1	high
ENSG00000126353	CCR7	high
ENSG00000126432	PRDX5	high
ENSG00000126698	DNAJC8	high
ENSG00000126934	MAP2K2	high
ENSG00000127125	PPCS	high
ENSG00000127483	HP1BP3	high
ENSG00000127540	UQCR11	high
ENSG00000127603	MACF1	high
ENSG00000127951	FGL2	high
ENSG00000128272	ATF4	high
ENSG00000128340	RAC2	high
ENSG00000128534	LSM8	high
ENSG00000128699	ORMDL1	high
ENSG00000128815	WDFY4	high
ENSG00000128829	EIF2AK4	high
ENSG00000128951	DUT	high
ENSG00000128989	ARPP19	high
ENSG00000129515	SNX6	high
ENSG00000129534	MIS18BP1	high
ENSG00000129559	NEDD8	high
ENSG00000129657	SEC14L1	high
ENSG00000129824	RPS4Y1	high
ENSG00000130313	PGLS	high
ENSG00000130592	LSP1	high
ENSG00000130770	ATP5IF1	high
ENSG00000130775	THEMIS2	high
ENSG00000130811	EIF3G	high
ENSG00000130844	ZNF331	high
ENSG00000131051	RBM39	high
ENSG00000131143	COX4I1	high
ENSG00000131171	SH3BGRL	high
ENSG00000131203	IDO1	high
ENSG00000131236	CAP1	high
ENSG00000131238	PPT1	high
ENSG00000131378	RFTN1	high
ENSG00000131401	NAPSB	high
ENSG00000131446	MGAT1	high
ENSG00000131495	NDUFA2	high
ENSG00000131504	DIAPH1	high
ENSG00000131508	UBE2D2	high
ENSG00000131724	IL13RA1	high
ENSG00000131828	PDHA1	high
ENSG00000132002	DNAJB1	high
ENSG00000132205	EMILIN2	high
ENSG00000132274	TRIM22	high
ENSG00000132334	PTPRE	high
ENSG00000132424	PNISR	high
ENSG00000132507	EIF5A	high
ENSG00000132510	KDM6B	high
ENSG00000132589	FLOT2	high
ENSG00000132780	NASP	high
ENSG00000133313	CNDP2	high
ENSG00000133574	GIMAP4	high
ENSG00000133703	KRAS	high
ENSG00000134046	MBD2	high
ENSG00000134107	BHLHE40	high
ENSG00000134186	PRPF38B	high
ENSG00000134294	SLC38A2	high
ENSG00000134308	YWHAQ	high
ENSG00000134330	IAH1	high
ENSG00000134369	NAV1	high
ENSG00000134419	RPS15A	high
ENSG00000134480	CCNH	high
ENSG00000134884	ARGLU1	high
ENSG00000134996	OSTF1	high
ENSG00000135046	ANXA1	high
ENSG00000135090	TAOK3	high
ENSG00000135269	TES	high
ENSG00000135390	ATP5MC2	high
ENSG00000135441	BLOC1S1	high
ENSG00000135506	OS9	high
ENSG00000135521	LTV1	high
ENSG00000135535	CD164	high
ENSG00000135596	MICAL1	high
ENSG00000135821	GLUL	high
ENSG00000135837	CEP350	high
ENSG00000135899	SP110	high
ENSG00000135905	DOCK10	high
ENSG00000135930	EIF4E2	high
ENSG00000136003	ISCU	high
ENSG00000136250	AOAH	high
ENSG00000136279	DBNL	high
ENSG00000136490	LIMD2	high
ENSG00000136521	NDUFB5	high
ENSG00000136536	MARCHF7	high
ENSG00000136560	TANK	high
ENSG00000136628	EPRS1	high
ENSG00000136819	C9orf78	high
ENSG00000136826	KLF4	high
ENSG00000136938	ANP32B	high
ENSG00000137076	TLN1	high
ENSG00000137210	TMEM14B	high
ENSG00000137309	HMGA1	high
ENSG00000137312	FLOT1	high
ENSG00000137331	IER3	high
ENSG00000137393	RNF144B	high
ENSG00000137409	MTCH1	high
ENSG00000137509	PRCP	high
ENSG00000137776	SLTM	high
ENSG00000137876	RSL24D1	high
ENSG00000138071	ACTR2	high
ENSG00000138166	DUSP5	high
ENSG00000138279	ANXA7	high
ENSG00000138326	RPS24	high
ENSG00000138398	PPIG	high
ENSG00000138668	HNRNPD	high
ENSG00000138744	NAAA	high
ENSG00000138757	G3BP2	high
ENSG00000138767	CNOT6L	high
ENSG00000139083	ETV6	high
ENSG00000139218	SCAF11	high
ENSG00000139278	GLIPR1	high
ENSG00000139343	SNRPF	high
ENSG00000140105	WARS1	high
ENSG00000140350	ANP32A	high
ENSG00000140379	BCL2A1	high
ENSG00000140575	IQGAP1	high
ENSG00000140612	SEC11A	high
ENSG00000140678	ITGAX	high
ENSG00000140749	IGSF6	high
ENSG00000140941	MAP1LC3B	high
ENSG00000140968	IRF8	high
ENSG00000140988	RPS2	high
ENSG00000140990	NDUFB10	high
ENSG00000141002	TCF25	high
ENSG00000141027	NCOR1	high
ENSG00000141232	TOB1	high
ENSG00000141480	ARRB2	high
ENSG00000141682	PMAIP1	high
ENSG00000141959	PFKL	high
ENSG00000142089	IFITM3	high
ENSG00000142168	SOD1	high
ENSG00000142347	MYO1F	high
ENSG00000142512	SIGLEC10	high
ENSG00000142534	RPS11	high
ENSG00000142541	RPL13A	high
ENSG00000142634	EFHD2	high
ENSG00000142864	SERBP1	high
ENSG00000143106	PSMA5	high
ENSG00000143110	C1orf162	high
ENSG00000143153	ATP1B1	high
ENSG00000143158	MPC2	high
ENSG00000143198	MGST3	high
ENSG00000143222	UFC1	high
ENSG00000143543	JTB	high
ENSG00000143612	C1orf43	high
ENSG00000143621	ILF2	high
ENSG00000143669	LYST	high
ENSG00000143742	SRP9	high
ENSG00000143761	ARF1	high
ENSG00000143799	PARP1	high
ENSG00000143815	LBR	high
ENSG00000143878	RHOB	high
ENSG00000144426	NBEAL1	high
ENSG00000144655	CSRNP1	high
ENSG00000144746	ARL6IP5	high
ENSG00000144802	NFKBIZ	high
ENSG00000144848	ATG3	high
ENSG00000144895	EIF2A	high
ENSG00000145012	LPP	high
ENSG00000145349	CAMK2D	high
ENSG00000145416	MARCHF1	high
ENSG00000145494	NDUFS6	high
ENSG00000145687	SSBP2	high
ENSG00000145703	IQGAP2	high
ENSG00000145741	BTF3	high
ENSG00000145779	TNFAIP8	high
ENSG00000145833	DDX46	high
ENSG00000145907	G3BP1	high
ENSG00000145912	NHP2	high
ENSG00000146066	HIGD2A	high
ENSG00000146112	PPP1R18	high
ENSG00000146112	LOC107987457	high
ENSG00000146192	FGD2	high
ENSG00000146247	PHIP	high
ENSG00000146386	ABRACL	high
ENSG00000146425	DYNLT1	high
ENSG00000146701	MDH2	high
ENSG00000146731	CCT6A	high
ENSG00000147274	RBMX	high
ENSG00000147403	RPL10	high
ENSG00000147548	NSD3	high
ENSG00000147649	MTDH	high
ENSG00000147677	EIF3H	high
ENSG00000148303	RPL7A	high
ENSG00000148516	ZEB1	high
ENSG00000148700	ADD3	high
ENSG00000148908	RGS10	high
ENSG00000149089	APIP	high
ENSG00000149100	EIF3M	high
ENSG00000149269	PAK1	high
ENSG00000149781	FERMT3	high
ENSG00000149806	FAU	high
ENSG00000149932	TMEM219	high
ENSG00000150093	ITGB1	high
ENSG00000150593	PDCD4	high
ENSG00000150782	IL18	high
ENSG00000150867	PIP4K2A	high
ENSG00000150977	RILPL2	high
ENSG00000151366	NDUFC2	high
ENSG00000151461	UPF2	high
ENSG00000152082	MZT2B	high
ENSG00000152332	UHMK1	high
ENSG00000152518	ZFP36L2	high
ENSG00000152558	TMEM123	high
ENSG00000152818	UTRN	high
ENSG00000153147	SMARCA5	high
ENSG00000153201	RANBP2	high
ENSG00000153234	NR4A2	high
ENSG00000153310	CYRIB	high
ENSG00000153317	ASAP1	high
ENSG00000153922	CHD1	high
ENSG00000154237	LRRK1	high
ENSG00000154582	ELOC	high
ENSG00000154723	ATP5PF	high
ENSG00000154978	VOPP1	high
ENSG00000155307	SAMSN1	high
ENSG00000155307	LOC388813	high
ENSG00000155463	OXA1L	high
ENSG00000155849	ELMO1	high
ENSG00000155926	SLA	high
ENSG00000155957	TMBIM4	high
ENSG00000155962	CLIC2	high
ENSG00000156052	GNAQ	high
ENSG00000156411	ATP5MPL	high
ENSG00000156467	UQCRB	high
ENSG00000156587	UBE2L6	high
ENSG00000156675	RAB11FIP1	high
ENSG00000156976	EIF4A2	high
ENSG00000157500	APPL1	high
ENSG00000157557	ETS2	high
ENSG00000157916	RER1	high
ENSG00000158050	DUSP2	high
ENSG00000158195	WASF2	high
ENSG00000158417	EIF5B	high
ENSG00000158457	TSPAN33	high
ENSG00000158481	CD1C	high
ENSG00000158488	CD1E	high
ENSG00000158717	RNF166	high
ENSG00000158985	CDC42SE2	high
ENSG00000159128	IFNGR2	high
ENSG00000159140	SON	high
ENSG00000159189	C1QC	high
ENSG00000159335	PTMS	high
ENSG00000159377	PSMB4	high
ENSG00000159388	BTG2	high
ENSG00000159720	ATP6V0D1	high
ENSG00000159840	ZYX	high
ENSG00000160075	SSU72	high
ENSG00000160194	NDUFV3	high
ENSG00000160255	ITGB2	high
ENSG00000160256	FAM207A	high
ENSG00000160307	S100B	high
ENSG00000160310	PRMT2	high
ENSG00000160410	SHKBP1	high
ENSG00000160593	JAML	high
ENSG00000160932	LY6E	high
ENSG00000160948	VPS28	high
ENSG00000161011	SQSTM1	high
ENSG00000161835	TAMALIN	high
ENSG00000161921	CXCL16	high
ENSG00000161970	RPL26	high
ENSG00000162191	UBXN1	high
ENSG00000162434	JAK1	high
ENSG00000162521	RBBP4	high
ENSG00000162585	FAAP20	high
ENSG00000162623	TYW3	high
ENSG00000162704	ARPC5	high
ENSG00000162711	NLRP3	high
ENSG00000162772	ATF3	high
ENSG00000162910	MRPL55	high
ENSG00000163131	CTSS	high
ENSG00000163162	RNF149	high
ENSG00000163220	S100A9	high
ENSG00000163399	ATP1A1	high
ENSG00000163453	IGFBP7	high
ENSG00000163463	KRTCAP2	high
ENSG00000163466	ARPC2	high
ENSG00000163563	MNDA	high
ENSG00000163602	RYBP	high
ENSG00000163605	PPP4R2	high
ENSG00000163634	THOC7	high
ENSG00000163659	TIPARP	high
ENSG00000163660	CCNL1	high
ENSG00000163682	RPL9	high
ENSG00000163683	SMIM14	high
ENSG00000163687	DNASE1L3	high
ENSG00000163714	U2SURP	high
ENSG00000163931	TKT	high
ENSG00000164096	C4orf3	high
ENSG00000164105	SAP30	high
ENSG00000164167	LSM6	high
ENSG00000164190	NIPBL	high
ENSG00000164258	NDUFS4	high
ENSG00000164346	NSA2	high
ENSG00000164587	RPS14	high
ENSG00000164713	BRI3	high
ENSG00000165025	SYK	high
ENSG00000165030	NFIL3	high
ENSG00000165525	NEMF	high
ENSG00000165527	ARF6	high
ENSG00000165637	VDAC2	high
ENSG00000165672	PRDX3	high
ENSG00000165732	DDX21	high
ENSG00000166012	TAF1D	high
ENSG00000166164	BRD7	high
ENSG00000166337	TAF10	high
ENSG00000166340	TPP1	high
ENSG00000166441	RPL27A	high
ENSG00000166523	CLEC4E	high
ENSG00000166557	TMED3	high
ENSG00000166848	TERF2IP	high
ENSG00000166848	LOC105371348	high
ENSG00000166913	YWHAB	high
ENSG00000167004	PDIA3	high
ENSG00000167088	SNRPD1	high
ENSG00000167460	TPM4	high
ENSG00000167461	RAB8A	high
ENSG00000167470	MIDN	high
ENSG00000167526	RPL13	high
ENSG00000167552	TUBA1A	high
ENSG00000167604	NFKBID	high
ENSG00000167613	LAIR1	high
ENSG00000167642	SPINT2	high
ENSG00000167645	YIF1B	high
ENSG00000167797	CDK2AP2	high
ENSG00000167851	CD300A	high
ENSG00000167863	ATP5PD	high
ENSG00000168028	RPSA	high
ENSG00000168066	SF1	high
ENSG00000168172	HOOK3	high
ENSG00000168214	RBPJ	high
ENSG00000168264	IRF2BP2	high
ENSG00000168385	SEPTIN2	high
ENSG00000168386	FILIP1L	high
ENSG00000168394	TAP1	high
ENSG00000168610	STAT3	high
ENSG00000168685	IL7R	high
ENSG00000168724	DNAJC21	high
ENSG00000168769	TET2	high
ENSG00000168899	VAMP5	high
ENSG00000168906	MAT2A	high
ENSG00000168961	LGALS9	high
ENSG00000169021	UQCRFS1	high
ENSG00000169045	HNRNPH1	high
ENSG00000169230	PRELID1	high
ENSG00000169413	RNASE6	high
ENSG00000169508	GPR183	high
ENSG00000169554	ZEB2	high
ENSG00000169738	DCXR	high
ENSG00000169756	LIMS1	high
ENSG00000169895	SYAP1	high
ENSG00000169976	SF3B5	high
ENSG00000170004	CHD3	high
ENSG00000170266	GLB1	high
ENSG00000170296	GABARAP	high
ENSG00000170345	FOS	high
ENSG00000170348	TMED10	high
ENSG00000170515	PA2G4	high
ENSG00000170542	SERPINB9	high
ENSG00000170638	TRABD	high
ENSG00000170759	KIF5B	high
ENSG00000170860	LSM3	high
ENSG00000170889	RPS9	high
ENSG00000171159	C9orf16	high
ENSG00000171222	SCAND1	high
ENSG00000171223	JUNB	high
ENSG00000171490	RSL1D1	high
ENSG00000171522	PTGER4	high
ENSG00000171634	BPTF	high
ENSG00000171700	RGS19	high
ENSG00000171862	PTEN	high
ENSG00000172115	CYCS	high
ENSG00000172183	ISG20	high
ENSG00000172216	CEBPB	high
ENSG00000172243	CLEC7A	high
ENSG00000172292	CERS6	high
ENSG00000172349	IL16	high
ENSG00000172428	COPS9	high
ENSG00000172500	FIBP	high
ENSG00000172590	MRPL52	high
ENSG00000172809	RPL38	high
ENSG00000172936	MYD88	high
ENSG00000173141	MRPL57	high
ENSG00000173221	GLRX	high
ENSG00000173369	C1QB	high
ENSG00000173372	C1QA	high
ENSG00000173578	XCR1	high
ENSG00000173660	UQCRH	high
ENSG00000173848	NET1	high
ENSG00000173992	CCS	high
ENSG00000174500	GCSAM	high
ENSG00000174574	AKIRIN1	high
ENSG00000174695	TMEM167A	high
ENSG00000174780	SRP72	high
ENSG00000174886	NDUFA11	high
ENSG00000174917	MICOS13	high
ENSG00000175130	MARCKSL1	high
ENSG00000175354	PTPN2	high
ENSG00000175390	EIF3F	high
ENSG00000175550	DRAP1	high
ENSG00000175567	UCP2	high
ENSG00000176731	RBIS	high
ENSG00000176788	BASP1	high
ENSG00000176845	METRNL	high
ENSG00000177105	RHOG	high
ENSG00000177156	TALDO1	high
ENSG00000177189	RPS6KA3	high
ENSG00000177565	TBL1XR1	high
ENSG00000177575	CD163	high
ENSG00000177600	RPLP2	high
ENSG00000177606	JUN	high
ENSG00000177733	HNRNPA0	high
ENSG00000178035	IMPDH2	high
ENSG00000178449	COX14	high
ENSG00000178695	KCTD12	high
ENSG00000178719	GRINA	high
ENSG00000178913	TAF7	high
ENSG00000178952	TUFM	high
ENSG00000178980	SELENOW	high
ENSG00000178982	EIF3K	high
ENSG00000179010	MRFAP1	high
ENSG00000179085	DPM3	high
ENSG00000179091	CYC1	high
ENSG00000179094	PER1	high
ENSG00000179344	HLA-DQB1	high
ENSG00000179583	CIITA	high
ENSG00000179820	MYADM	high
ENSG00000180353	HCLS1	high
ENSG00000180370	PAK2	high
ENSG00000180530	NRIP1	high
ENSG00000180758	GPR157	high
ENSG00000180817	PPA1	high
ENSG00000181467	RAP2B	high
ENSG00000181744	DIPK2A	high
ENSG00000182004	SNRPE	high
ENSG00000182054	IDH2	high
ENSG00000182117	NOP10	high
ENSG00000182220	ATP6AP2	high
ENSG00000182287	AP1S2	high
ENSG00000182578	CSF1R	high
ENSG00000182670	TTC3	high
ENSG00000182774	RPS17	high
ENSG00000182899	RPL35A	high
ENSG00000182985	CADM1	high
ENSG00000183011	NAA38	high
ENSG00000183255	PTTG1IP	high
ENSG00000183291	SELENOF	high
ENSG00000183648	NDUFB1	high
ENSG00000183726	TMEM50A	high
ENSG00000183741	CBX6	high
ENSG00000184007	PTP4A2	high
ENSG00000184009	ACTG1	high
ENSG00000184076	UQCR10	high
ENSG00000184203	PPP1R2	high
ENSG00000184557	SOCS3	high
ENSG00000184588	PDE4B	high
ENSG00000184752	NDUFA12	high
ENSG00000184897	H1-10	high
ENSG00000184900	SUMO3	high
ENSG00000185043	CIB1	high
ENSG00000185201	IFITM2	high
ENSG00000185215	TNFAIP2	high
ENSG00000185432	METTL7A	high
ENSG00000185650	ZFP36L1	high
ENSG00000185651	UBE2L3	high
ENSG00000185862	EVI2B	high
ENSG00000186010	NDUFA13	high
ENSG00000186184	POLR1D	high
ENSG00000186468	RPS23	high
ENSG00000186687	LYRM7	high
ENSG00000187109	NAP1L1	high
ENSG00000187164	SHTN1	high
ENSG00000187239	FNBP1	high
ENSG00000187735	TCEA1	high
ENSG00000188042	ARL4C	high
ENSG00000188186	LAMTOR4	high
ENSG00000188229	TUBB4B	high
ENSG00000188243	COMMD6	high
ENSG00000188290	HES4	high
ENSG00000188313	PLSCR1	high
ENSG00000188820	CALHM6	high
ENSG00000188994	ZNF292	high
ENSG00000189159	JPT1	high
ENSG00000189266	PNRC2	high
ENSG00000196126	HLA-DRB1	high
ENSG00000196139	AKR1C3	high
ENSG00000196352	CD55	high
ENSG00000196396	PTPN1	high
ENSG00000196405	EVL	high
ENSG00000196504	PRPF40A	high
ENSG00000196683	TOMM7	high
ENSG00000196735	HLA-DQA1	high
ENSG00000196776	CD47	high
ENSG00000196935	SRGAP1	high
ENSG00000196954	CASP4	high
ENSG00000197043	ANXA6	high
ENSG00000197102	DYNC1H1	high
ENSG00000197249	SERPINA1	high
ENSG00000197329	PELI1	high
ENSG00000197448	GSTK1	high
ENSG00000197622	CDC42SE1	high
ENSG00000197629	MPEG1	high
ENSG00000197728	RPS26	high
ENSG00000197747	S100A10	high
ENSG00000197756	RPL37A	high
ENSG00000197872	CYRIA	high
ENSG00000197971	MBP	high
ENSG00000197992	CLEC9A	high
ENSG00000198189	HSD17B11	high
ENSG00000198355	PIM3	high
ENSG00000198382	UVRAG	high
ENSG00000198399	ITSN2	high
ENSG00000198435	NRARP	high
ENSG00000198498	TMA16	high
ENSG00000198585	NUDT16	high
ENSG00000198604	BAZ1A	high
ENSG00000198625	MDM4	high
ENSG00000198695	ND6	high
ENSG00000198755	RPL10A	high
ENSG00000198771	RCSD1	high
ENSG00000198818	SFT2D1	high
ENSG00000198900	TOP1	high
ENSG00000198931	APRT	high
ENSG00000203667	COX20	high
ENSG00000203875	SNHG5	high
ENSG00000204256	BRD2	high
ENSG00000204257	HLA-DMA	high
ENSG00000204264	PSMB8	high
ENSG00000204272	NBDY	high
ENSG00000204287	HLA-DRA	high
ENSG00000204370	SDHD	high
ENSG00000204388	HSPA1B	high
ENSG00000204389	HSPA1A	high
ENSG00000204397	CARD16	high
ENSG00000204435	CSNK2B	high
ENSG00000204472	AIF1	high
ENSG00000204482	LST1	high
ENSG00000204525	HLA-C	high
ENSG00000204569	PPP1R10	high
ENSG00000204592	HLA-E	high
ENSG00000204634	TBC1D8	high
ENSG00000204642	HLA-F	high
ENSG00000205302	SNX2	high
ENSG00000205352	PRR13	high
ENSG00000205542	TMSB4X	high
ENSG00000212907	ND4L	high
ENSG00000213064	SFT2D2	high
ENSG00000213585	VDAC1	high
ENSG00000213625	LEPROT	high
ENSG00000213639	PPP1CB	high
ENSG00000213654	GPSM3	high
ENSG00000213741	RPS29	high
ENSG00000214022	REPIN1	high
ENSG00000214046	SMIM7	high
ENSG00000214253	FIS1	high
ENSG00000214262	ANKRD36BP1	high
ENSG00000215301	DDX3X	high
ENSG00000216490	IFI30	high
ENSG00000217555	CKLF	high
ENSG00000221869	CEBPD	high
ENSG00000221983	UBA52	high
ENSG00000222041	CYTOR	high
ENSG00000223865	HLA-DPB1	high
ENSG00000224032	NA	high
ENSG00000224557	HLA-DPB2	high
ENSG00000225972	MTND1P23	high
ENSG00000228253	ATP8	high
ENSG00000229807	XIST	high
ENSG00000229833	PET100	high
ENSG00000230202	NA	high
ENSG00000230989	HSBP1	high
ENSG00000231389	HLA-DPA1	high
ENSG00000232112	TMA7	high
ENSG00000232388	SMIM26	high
ENSG00000233016	SNHG7	high
ENSG00000233913	RPL10P9	high
ENSG00000234745	HLA-B	high
ENSG00000237550	RPL9P8	high
ENSG00000240065	PSMB9	high
ENSG00000241399	CD302	high
ENSG00000241553	ARPC4	high
ENSG00000242485	MRPL20	high
ENSG00000242574	HLA-DMB	high
ENSG00000243147	MRPL33	high
ENSG00000244038	DDOST	high
ENSG00000244313	NA	high
ENSG00000246705	H2AJ	high
ENSG00000247596	TWF2	high
ENSG00000248527	MTATP6P1	high
ENSG00000250479	CHCHD10	high
ENSG00000253729	PRKDC	high
ENSG00000255112	CHMP1B	high
ENSG00000255302	EID1	high
ENSG00000257764	NA	high
ENSG00000257923	CUX1	high
ENSG00000258289	CHURC1	high
ENSG00000260314	MRC1	high
ENSG00000261040	WFDC21P	high
ENSG00000265206	NA	high
ENSG00000265972	TXNIP	high
ENSG00000266028	SRGAP2	high
ENSG00000266412	NCOA4	high
ENSG00000266472	MRPS21	high
ENSG00000267519	NA	high
ENSG00000269293	ZSCAN16-AS1	high
ENSG00000269893	SNHG8	high
ENSG00000270170	NCBP2AS2	high
ENSG00000270647	TAF15	high
ENSG00000271204	NA	high
ENSG00000274008	NA	high
ENSG00000277443	MARCKS	high
ENSG00000277791	PSMB3	high
ENSG00000278311	GGNBP2	high
ENSG00000048544	MRPS10	medium
ENSG00000065978	YBX1	medium
ENSG00000078140	UBE2K	medium
ENSG00000087460	GNAS	medium
ENSG00000090905	TNRC6A	medium
ENSG00000102265	TIMP1	medium
ENSG00000105193	RPS16	medium
ENSG00000105640	RPL18A	medium
ENSG00000107672	NSMCE4A	medium
ENSG00000108510	MED13	medium
ENSG00000108861	DUSP3	medium
ENSG00000111229	ARPC3	medium
ENSG00000113749	HRH2	medium
ENSG00000117036	ETV3	medium
ENSG00000118939	UCHL3	medium
ENSG00000121851	POLR3GL	medium
ENSG00000122406	RPL5	medium
ENSG00000122566	HNRNPA2B1	medium
ENSG00000125445	MRPS7	medium
ENSG00000125818	PSMF1	medium
ENSG00000127184	COX7C	medium
ENSG00000128284	APOL3	medium
ENSG00000128626	MRPS12	medium
ENSG00000131473	ACLY	medium
ENSG00000132467	UTP3	medium
ENSG00000133639	BTG1	medium
ENSG00000136238	RAC1	medium
ENSG00000136451	VEZF1	medium
ENSG00000136810	TXN	medium
ENSG00000137154	RPS6	medium
ENSG00000137818	RPLP1	medium
ENSG00000138623	SEMA7A	medium
ENSG00000142409	ZNF787	medium
ENSG00000143033	MTF2	medium
ENSG00000143384	MCL1	medium
ENSG00000143442	POGZ	medium
ENSG00000143947	RPS27A	medium
ENSG00000153187	HNRNPU	medium
ENSG00000159592	GPBP1L1	medium
ENSG00000161671	EMC10	medium
ENSG00000163041	H3-3A	medium
ENSG00000163191	S100A11	medium
ENSG00000166128	RAB8B	medium
ENSG00000166822	TMEM170A	medium
ENSG00000166927	MS4A7	medium
ENSG00000167658	EEF2	medium
ENSG00000168071	CCDC88B	medium
ENSG00000170881	RNF139	medium
ENSG00000171055	FEZ2	medium
ENSG00000175193	PARL	medium
ENSG00000180964	TCEAL8	medium
ENSG00000181163	NPM1	medium
ENSG00000182923	CEP63	medium
ENSG00000185825	BCAP31	medium
ENSG00000196154	S100A4	medium
ENSG00000196262	PPIA	medium
ENSG00000198786	ND5	medium
ENSG00000198886	ND4	medium
ENSG00000198899	ATP6	medium
ENSG00000198938	COX3	medium
ENSG00000211459	NA	medium
ENSG00000213719	CLIC1	medium
ENSG00000223361	FTH1P10	medium
ENSG00000233276	GPX1	medium
ENSG00000237541	HLA-DQA1	medium
ENSG00000237541	HLA-DQA2	medium
ENSG00000272211	NA	medium
