IdentityGene	GeneSymbol	Level
ENSG00000000971	CFH	high
ENSG00000003436	TFPI	high
ENSG00000003989	SLC7A2	high
ENSG00000004776	HSPB6	high
ENSG00000004779	NDUFAB1	high
ENSG00000004799	PDK4	high
ENSG00000005483	KMT2E	high
ENSG00000006016	CRLF1	high
ENSG00000006327	TNFRSF12A	high
ENSG00000008018	PSMB1	high
ENSG00000008282	SYPL1	high
ENSG00000009307	CSDE1	high
ENSG00000014641	MDH1	high
ENSG00000017797	RALBP1	high
ENSG00000018625	ATP1A2	high
ENSG00000022267	FHL1	high
ENSG00000023902	PLEKHO1	high
ENSG00000026025	VIM	high
ENSG00000031698	SARS1	high
ENSG00000035403	VCL	high
ENSG00000035862	TIMP2	high
ENSG00000038427	VCAN	high
ENSG00000044115	CTNNA1	high
ENSG00000047849	MAP4	high
ENSG00000048649	RSF1	high
ENSG00000049323	LTBP1	high
ENSG00000049540	ELN	high
ENSG00000050165	DKK3	high
ENSG00000051620	HEBP2	high
ENSG00000054148	PHPT1	high
ENSG00000054267	ARID4B	high
ENSG00000054654	SYNE2	high
ENSG00000055163	CYFIP2	high
ENSG00000057608	GDI2	high
ENSG00000058272	PPP1R12A	high
ENSG00000061676	NCKAP1	high
ENSG00000062716	VMP1	high
ENSG00000064205	CCN5	high
ENSG00000065518	NDUFB4	high
ENSG00000065526	SPEN	high
ENSG00000065534	MYLK	high
ENSG00000065548	ZC3H15	high
ENSG00000065911	MTHFD2	high
ENSG00000069431	ABCC9	high
ENSG00000069849	ATP1B3	high
ENSG00000071127	WDR1	high
ENSG00000071205	ARHGAP10	high
ENSG00000071282	LMCD1	high
ENSG00000072110	ACTN1	high
ENSG00000072364	AFF4	high
ENSG00000072778	ACADVL	high
ENSG00000072952	IRAG1	high
ENSG00000073712	FERMT2	high
ENSG00000074181	NOTCH3	high
ENSG00000074416	MGLL	high
ENSG00000074695	LMAN1	high
ENSG00000075142	SRI	high
ENSG00000075426	FOSL2	high
ENSG00000075624	ACTB	high
ENSG00000075790	BCAP29	high
ENSG00000075790	DUS4L-BCAP29	high
ENSG00000076706	MCAM	high
ENSG00000077147	TM9SF3	high
ENSG00000077380	DYNC1I2	high
ENSG00000077549	CAPZB	high
ENSG00000077782	FGFR1	high
ENSG00000077943	ITGA8	high
ENSG00000078369	GNB1	high
ENSG00000079308	TNS1	high
ENSG00000080845	DLGAP4	high
ENSG00000081154	PCNP	high
ENSG00000081189	MEF2C	high
ENSG00000084623	EIF3I	high
ENSG00000085063	CD59	high
ENSG00000085224	ATRX	high
ENSG00000086598	TMED2	high
ENSG00000087074	PPP1R15A	high
ENSG00000087191	PSMC5	high
ENSG00000087274	ADD1	high
ENSG00000087365	SF3B2	high
ENSG00000088832	FKBP1A	high
ENSG00000088986	DYNLL1	high
ENSG00000089063	TMEM230	high
ENSG00000089693	MLF2	high
ENSG00000090006	LTBP4	high
ENSG00000090266	NDUFB2	high
ENSG00000091436	MAP3K20	high
ENSG00000092820	EZR	high
ENSG00000092841	MYL6	high
ENSG00000092964	DPYSL2	high
ENSG00000094963	FMO2	high
ENSG00000095637	SORBS1	high
ENSG00000095794	CREM	high
ENSG00000096746	HNRNPH3	high
ENSG00000099341	PSMD8	high
ENSG00000099622	CIRBP	high
ENSG00000099860	GADD45B	high
ENSG00000100097	LGALS1	high
ENSG00000100234	TIMP3	high
ENSG00000100243	CYB5R3	high
ENSG00000100345	MYH9	high
ENSG00000100387	RBX1	high
ENSG00000100567	PSMA3	high
ENSG00000100644	HIF1A	high
ENSG00000100650	SRSF5	high
ENSG00000100811	YY1	high
ENSG00000101335	MYL9	high
ENSG00000101347	SAMHD1	high
ENSG00000101384	JAG1	high
ENSG00000101558	VAPA	high
ENSG00000101745	ANKRD12	high
ENSG00000102007	PLP2	high
ENSG00000102189	EEA1	high
ENSG00000102317	RBM3	high
ENSG00000102580	DNAJC3	high
ENSG00000102760	RGCC	high
ENSG00000102786	INTS6	high
ENSG00000102802	MEDAG	high
ENSG00000102804	TSC22D1	high
ENSG00000103024	NME3	high
ENSG00000103035	PSMD7	high
ENSG00000103145	HCFC1R1	high
ENSG00000103175	WFDC1	high
ENSG00000103196	CRISPLD2	high
ENSG00000103266	STUB1	high
ENSG00000103275	UBE2I	high
ENSG00000104067	TJP1	high
ENSG00000104331	BPNT2	high
ENSG00000104388	RAB2A	high
ENSG00000104408	EIF3E	high
ENSG00000104763	ASAH1	high
ENSG00000104765	BNIP3L	high
ENSG00000104805	NUCB1	high
ENSG00000104823	ECH1	high
ENSG00000105185	PDCD5	high
ENSG00000105669	COPE	high
ENSG00000105701	FKBP8	high
ENSG00000105835	NAMPT	high
ENSG00000105971	CAV2	high
ENSG00000105974	CAV1	high
ENSG00000106211	HSPB1	high
ENSG00000106244	PDAP1	high
ENSG00000106333	PCOLCE	high
ENSG00000106366	SERPINE1	high
ENSG00000106400	ZNHIT1	high
ENSG00000106538	RARRES2	high
ENSG00000106615	RHEB	high
ENSG00000106624	AEBP1	high
ENSG00000106682	EIF4H	high
ENSG00000106772	PRUNE2	high
ENSG00000106809	OGN	high
ENSG00000106819	ASPN	high
ENSG00000106991	ENG	high
ENSG00000107262	BAG1	high
ENSG00000107581	EIF3A	high
ENSG00000107796	ACTA2	high
ENSG00000107874	CUEDC2	high
ENSG00000108551	RASD1	high
ENSG00000108691	CCL2	high
ENSG00000108799	EZH1	high
ENSG00000108821	COL1A1	high
ENSG00000108848	LUC7L3	high
ENSG00000109099	PMP22	high
ENSG00000109180	OCIAD1	high
ENSG00000109452	INPP4B	high
ENSG00000109472	CPE	high
ENSG00000109610	SOD3	high
ENSG00000109846	CRYAB	high
ENSG00000110092	CCND1	high
ENSG00000110321	EIF4G2	high
ENSG00000110651	CD81	high
ENSG00000110717	NDUFS8	high
ENSG00000110955	ATP5F1B	high
ENSG00000111077	TNS2	high
ENSG00000111142	METAP2	high
ENSG00000111275	ALDH2	high
ENSG00000111341	MGP	high
ENSG00000111348	ARHGDIB	high
ENSG00000111404	RERGL	high
ENSG00000111639	MRPL51	high
ENSG00000111832	RWDD1	high
ENSG00000111843	TMEM14C	high
ENSG00000111859	NEDD9	high
ENSG00000111897	SERINC1	high
ENSG00000112096	SOD2	high
ENSG00000112531	QKI	high
ENSG00000112562	SMOC2	high
ENSG00000112651	MRPL2	high
ENSG00000112695	COX7A2	high
ENSG00000112715	VEGFA	high
ENSG00000113140	SPARC	high
ENSG00000113141	IK	high
ENSG00000113558	SKP1	high
ENSG00000113721	PDGFRB	high
ENSG00000113732	ATP6V0E1	high
ENSG00000113916	BCL6	high
ENSG00000114125	RNF7	high
ENSG00000114315	HES1	high
ENSG00000114353	GNAI2	high
ENSG00000114439	BBX	high
ENSG00000114857	NKTR	high
ENSG00000114861	FOXP1	high
ENSG00000115053	NCL	high
ENSG00000115091	ACTR3	high
ENSG00000115306	SPTBN1	high
ENSG00000115380	EFEMP1	high
ENSG00000115414	FN1	high
ENSG00000115457	IGFBP2	high
ENSG00000115461	IGFBP5	high
ENSG00000115468	EFHD1	high
ENSG00000115484	CCT4	high
ENSG00000115524	SF3B1	high
ENSG00000115738	ID2	high
ENSG00000115944	COX7A2L	high
ENSG00000115963	RND3	high
ENSG00000116016	EPAS1	high
ENSG00000116132	PRRX1	high
ENSG00000116171	SCP2	high
ENSG00000116194	ANGPTL1	high
ENSG00000116285	ERRFI1	high
ENSG00000116350	SRSF4	high
ENSG00000116459	ATP5PB	high
ENSG00000116473	RAP1A	high
ENSG00000116539	ASH1L	high
ENSG00000116560	SFPQ	high
ENSG00000116741	RGS2	high
ENSG00000116962	NID1	high
ENSG00000117318	ID3	high
ENSG00000117335	CD46	high
ENSG00000117519	CNN3	high
ENSG00000117523	PRRC2C	high
ENSG00000117614	SYF2	high
ENSG00000117691	NENF	high
ENSG00000118257	NRP2	high
ENSG00000118407	FILIP1	high
ENSG00000118523	CCN2	high
ENSG00000118689	FOXO3	high
ENSG00000118816	CCNI	high
ENSG00000118985	ELL2	high
ENSG00000119048	UBE2B	high
ENSG00000119138	KLF9	high
ENSG00000119147	ECRG4	high
ENSG00000119335	SET	high
ENSG00000119508	NR4A3	high
ENSG00000119655	NPC2	high
ENSG00000119681	LTBP2	high
ENSG00000119938	PPP1R3C	high
ENSG00000120306	CYSTM1	high
ENSG00000120738	EGR1	high
ENSG00000120885	CLU	high
ENSG00000121068	TBX2	high
ENSG00000121774	KHDRBS1	high
ENSG00000122545	SEPTIN7	high
ENSG00000122641	INHBA	high
ENSG00000122786	CALD1	high
ENSG00000122862	SRGN	high
ENSG00000123066	MED13L	high
ENSG00000123096	SSPN	high
ENSG00000123200	ZC3H13	high
ENSG00000123358	NR4A1	high
ENSG00000123562	MORF4L2	high
ENSG00000124225	PMEPA1	high
ENSG00000124762	CDKN1A	high
ENSG00000124795	DEK	high
ENSG00000125148	MT2A	high
ENSG00000125347	IRF1	high
ENSG00000125356	NDUFA1	high
ENSG00000125652	ALKBH7	high
ENSG00000125868	DSTN	high
ENSG00000125944	HNRNPR	high
ENSG00000125968	ID1	high
ENSG00000126247	CAPNS1	high
ENSG00000126261	UBA2	high
ENSG00000126458	RRAS	high
ENSG00000126698	DNAJC8	high
ENSG00000127314	RAP1B	high
ENSG00000127528	KLF2	high
ENSG00000127603	MACF1	high
ENSG00000127920	GNG11	high
ENSG00000127951	FGL2	high
ENSG00000127954	STEAP4	high
ENSG00000128016	ZFP36	high
ENSG00000128245	YWHAH	high
ENSG00000128272	ATF4	high
ENSG00000128595	CALU	high
ENSG00000128609	NDUFA5	high
ENSG00000128641	MYO1B	high
ENSG00000129084	PSMA1	high
ENSG00000129116	PALLD	high
ENSG00000129250	KIF1C	high
ENSG00000129562	DAD1	high
ENSG00000129625	REEP5	high
ENSG00000129824	RPS4Y1	high
ENSG00000130164	LDLR	high
ENSG00000130176	CNN1	high
ENSG00000130203	APOE	high
ENSG00000130303	BST2	high
ENSG00000130402	ACTN4	high
ENSG00000130600	H19	high
ENSG00000130600	LOC102724852	high
ENSG00000130702	LAMA5	high
ENSG00000130724	CHMP2A	high
ENSG00000130725	UBE2M	high
ENSG00000130741	EIF2S3	high
ENSG00000130779	CLIP1	high
ENSG00000130844	ZNF331	high
ENSG00000131055	COX4I2	high
ENSG00000131097	HIGD1B	high
ENSG00000131171	SH3BGRL	high
ENSG00000131236	CAP1	high
ENSG00000131495	NDUFA2	high
ENSG00000131711	MAP1B	high
ENSG00000132002	DNAJB1	high
ENSG00000132329	RAMP1	high
ENSG00000132424	PNISR	high
ENSG00000132432	SEC61G	high
ENSG00000132507	EIF5A	high
ENSG00000132510	KDM6B	high
ENSG00000132824	SERINC3	high
ENSG00000132963	POMP	high
ENSG00000133026	MYH10	high
ENSG00000133142	TCEAL4	high
ENSG00000133392	MYH11	high
ENSG00000134107	BHLHE40	high
ENSG00000134138	MEIS2	high
ENSG00000134202	GSTM3	high
ENSG00000134243	SORT1	high
ENSG00000134480	CCNH	high
ENSG00000134871	COL4A2	high
ENSG00000134954	ETS1	high
ENSG00000135047	CTSL	high
ENSG00000135218	CD36	high
ENSG00000135316	SYNCRIP	high
ENSG00000135624	CCT7	high
ENSG00000135678	CPM	high
ENSG00000135720	DYNC1LI2	high
ENSG00000135744	AGT	high
ENSG00000135842	NIBAN1	high
ENSG00000135862	LAMC1	high
ENSG00000135916	ITM2C	high
ENSG00000136240	KDELR2	high
ENSG00000136244	IL6	high
ENSG00000136732	GYPC	high
ENSG00000136826	KLF4	high
ENSG00000136938	ANP32B	high
ENSG00000136997	MYC	high
ENSG00000136999	CCN3	high
ENSG00000137076	TLN1	high
ENSG00000137331	IER3	high
ENSG00000137409	MTCH1	high
ENSG00000137573	SULF1	high
ENSG00000137693	YAP1	high
ENSG00000137801	THBS1	high
ENSG00000137815	RTF1	high
ENSG00000137876	RSL24D1	high
ENSG00000137962	ARHGAP29	high
ENSG00000138069	RAB1A	high
ENSG00000138071	ACTR2	high
ENSG00000138085	ATRAID	high
ENSG00000138135	CH25H	high
ENSG00000138279	ANXA7	high
ENSG00000138385	SSB	high
ENSG00000138495	COX17	high
ENSG00000138674	SEC31A	high
ENSG00000138735	PDE5A	high
ENSG00000139112	GABARAPL1	high
ENSG00000139168	ZCRB1	high
ENSG00000139218	SCAF11	high
ENSG00000139289	PHLDA1	high
ENSG00000139684	ESD	high
ENSG00000139793	MBNL2	high
ENSG00000140092	FBLN5	high
ENSG00000140285	FGF7	high
ENSG00000140365	COMMD4	high
ENSG00000140416	TPM1	high
ENSG00000140545	MFGE8	high
ENSG00000140740	UQCRC2	high
ENSG00000140836	ZFHX3	high
ENSG00000140945	CDH13	high
ENSG00000141027	NCOR1	high
ENSG00000141052	MYOCD	high
ENSG00000141232	TOB1	high
ENSG00000141522	ARHGDIA	high
ENSG00000141552	ANAPC11	high
ENSG00000141753	IGFBP4	high
ENSG00000141867	BRD4	high
ENSG00000141905	NFIC	high
ENSG00000142089	IFITM3	high
ENSG00000142156	COL6A1	high
ENSG00000142173	COL6A2	high
ENSG00000142192	APP	high
ENSG00000142798	HSPG2	high
ENSG00000142871	CCN1	high
ENSG00000142910	TINAGL1	high
ENSG00000143198	MGST3	high
ENSG00000143248	RGS5	high
ENSG00000143333	RGS16	high
ENSG00000143742	SRP9	high
ENSG00000143753	DEGS1	high
ENSG00000143761	ARF1	high
ENSG00000143878	RHOB	high
ENSG00000143933	CALM2	high
ENSG00000144426	NBEAL1	high
ENSG00000144476	ACKR3	high
ENSG00000144674	GOLGA4	high
ENSG00000144746	ARL6IP5	high
ENSG00000144802	NFKBIZ	high
ENSG00000144810	COL8A1	high
ENSG00000144824	PHLDB2	high
ENSG00000145012	LPP	high
ENSG00000145494	NDUFS6	high
ENSG00000145675	PIK3R1	high
ENSG00000145833	DDX46	high
ENSG00000145936	KCNMB1	high
ENSG00000146457	WTAP	high
ENSG00000146731	CCT6A	high
ENSG00000147027	TMEM47	high
ENSG00000147065	MSN	high
ENSG00000147526	TACC1	high
ENSG00000147669	POLR2K	high
ENSG00000147862	NFIB	high
ENSG00000148053	NTRK2	high
ENSG00000148154	UGCG	high
ENSG00000148175	STOM	high
ENSG00000148180	GSN	high
ENSG00000148671	ADIRF	high
ENSG00000148834	GSTO1	high
ENSG00000149131	SERPING1	high
ENSG00000149196	HIKESHI	high
ENSG00000149218	ENDOD1	high
ENSG00000149257	SERPINH1	high
ENSG00000149564	ESAM	high
ENSG00000149591	TAGLN	high
ENSG00000150093	ITGB1	high
ENSG00000150347	ARID5B	high
ENSG00000150459	SAP18	high
ENSG00000150687	PRSS23	high
ENSG00000150753	CCT5	high
ENSG00000150938	CRIM1	high
ENSG00000151353	TMEM18	high
ENSG00000151491	EPS8	high
ENSG00000151729	SLC25A4	high
ENSG00000152049	KCNE4	high
ENSG00000152217	SETBP1	high
ENSG00000152234	ATP5F1A	high
ENSG00000152583	SPARCL1	high
ENSG00000153147	SMARCA5	high
ENSG00000153234	NR4A2	high
ENSG00000153922	CHD1	high
ENSG00000154553	PDLIM3	high
ENSG00000154556	SORBS2	high
ENSG00000154734	ADAMTS1	high
ENSG00000155366	RHOC	high
ENSG00000155957	TMBIM4	high
ENSG00000156261	CCT8	high
ENSG00000156411	ATP5MPL	high
ENSG00000156642	NPTN	high
ENSG00000156976	EIF4A2	high
ENSG00000157110	RBPMS	high
ENSG00000157557	ETS2	high
ENSG00000158195	WASF2	high
ENSG00000158417	EIF5B	high
ENSG00000158859	ADAMTS4	high
ENSG00000158864	NDUFS2	high
ENSG00000159176	CSRP1	high
ENSG00000159199	ATP5MC1	high
ENSG00000159335	PTMS	high
ENSG00000159377	PSMB4	high
ENSG00000159388	BTG2	high
ENSG00000159840	ZYX	high
ENSG00000159884	CCDC107	high
ENSG00000160613	PCSK7	high
ENSG00000160801	PTH1R	high
ENSG00000160888	IER2	high
ENSG00000161638	ITGA5	high
ENSG00000162191	UBXN1	high
ENSG00000162434	JAK1	high
ENSG00000162545	CAMK2N1	high
ENSG00000162599	NFIA	high
ENSG00000162614	NEXN	high
ENSG00000162704	ARPC5	high
ENSG00000162772	ATF3	high
ENSG00000162909	CAPN2	high
ENSG00000163017	ACTG2	high
ENSG00000163110	PDLIM5	high
ENSG00000163430	FSTL1	high
ENSG00000163431	LMOD1	high
ENSG00000163453	IGFBP7	high
ENSG00000163466	ARPC2	high
ENSG00000163468	CCT3	high
ENSG00000163565	IFI16	high
ENSG00000163584	RPL22L1	high
ENSG00000163590	PPM1L	high
ENSG00000163638	ADAMTS9	high
ENSG00000163681	SLMAP	high
ENSG00000163909	HEYL	high
ENSG00000163931	TKT	high
ENSG00000164056	SPRY1	high
ENSG00000164096	C4orf3	high
ENSG00000164116	GUCY1A1	high
ENSG00000164176	EDIL3	high
ENSG00000164463	CREBRF	high
ENSG00000164615	CAMLG	high
ENSG00000164687	FABP5	high
ENSG00000164692	COL1A2	high
ENSG00000164741	DLC1	high
ENSG00000164949	GEM	high
ENSG00000165030	NFIL3	high
ENSG00000165119	HNRNPK	high
ENSG00000165280	VCP	high
ENSG00000165507	DEPP1	high
ENSG00000165637	VDAC2	high
ENSG00000165732	DDX21	high
ENSG00000165775	FUNDC2	high
ENSG00000165795	NDRG2	high
ENSG00000165916	PSMC3	high
ENSG00000165959	CLMN	high
ENSG00000166012	TAF1D	high
ENSG00000166136	NDUFB8	high
ENSG00000166165	CKB	high
ENSG00000166226	CCT2	high
ENSG00000166295	ANAPC16	high
ENSG00000166333	ILK	high
ENSG00000166347	CYB5A	high
ENSG00000166482	MFAP4	high
ENSG00000166592	RRAD	high
ENSG00000166681	BEX3	high
ENSG00000166741	NNMT	high
ENSG00000166848	TERF2IP	high
ENSG00000166848	LOC105371348	high
ENSG00000167004	PDIA3	high
ENSG00000167460	TPM4	high
ENSG00000167470	MIDN	high
ENSG00000167552	TUBA1A	high
ENSG00000167553	TUBA1C	high
ENSG00000167641	PPP1R14A	high
ENSG00000167772	ANGPTL4	high
ENSG00000167779	IGFBP6	high
ENSG00000168036	CTNNB1	high
ENSG00000168140	VASN	high
ENSG00000168209	DDIT4	high
ENSG00000168386	FILIP1L	high
ENSG00000168542	COL3A1	high
ENSG00000168653	NDUFS5	high
ENSG00000168906	MAT2A	high
ENSG00000169282	KCNAB1	high
ENSG00000169398	PTK2	high
ENSG00000169554	ZEB2	high
ENSG00000169564	PCBP1	high
ENSG00000169714	CNBP	high
ENSG00000169715	MT1E	high
ENSG00000169756	LIMS1	high
ENSG00000169908	TM4SF1	high
ENSG00000169976	SF3B5	high
ENSG00000170144	HNRNPA3	high
ENSG00000170275	CRTAP	high
ENSG00000170323	FABP4	high
ENSG00000170345	FOS	high
ENSG00000170759	KIF5B	high
ENSG00000170860	LSM3	high
ENSG00000170955	CAVIN3	high
ENSG00000171159	C9orf16	high
ENSG00000171222	SCAND1	high
ENSG00000171223	JUNB	high
ENSG00000171490	RSL1D1	high
ENSG00000171703	TCEA2	high
ENSG00000171735	CAMTA1	high
ENSG00000172115	CYCS	high
ENSG00000172201	ID4	high
ENSG00000172216	CEBPB	high
ENSG00000172403	SYNPO2	high
ENSG00000172922	RNASEH2C	high
ENSG00000173230	GOLGB1	high
ENSG00000173267	SNCG	high
ENSG00000173457	PPP1R14B	high
ENSG00000173511	VEGFB	high
ENSG00000173598	NUDT4	high
ENSG00000173641	HSPB7	high
ENSG00000173660	UQCRH	high
ENSG00000173674	EIF1AX	high
ENSG00000173848	NET1	high
ENSG00000173918	C1QTNF1	high
ENSG00000174099	MSRB3	high
ENSG00000174437	ATP2A2	high
ENSG00000174917	MICOS13	high
ENSG00000175084	DES	high
ENSG00000175183	CSRP2	high
ENSG00000175416	CLTB	high
ENSG00000175899	A2M	high
ENSG00000176014	TUBB6	high
ENSG00000176731	RBIS	high
ENSG00000176907	TCIM	high
ENSG00000177156	TALDO1	high
ENSG00000177200	CHD9	high
ENSG00000177469	CAVIN1	high
ENSG00000177606	JUN	high
ENSG00000177697	CD151	high
ENSG00000178878	APOLD1	high
ENSG00000178952	TUFM	high
ENSG00000178982	EIF3K	high
ENSG00000179091	CYC1	high
ENSG00000179218	CALR	high
ENSG00000179262	RAD23A	high
ENSG00000179271	GADD45GIP1	high
ENSG00000179820	MYADM	high
ENSG00000181649	PHLDA2	high
ENSG00000182196	ARL6IP4	high
ENSG00000182208	MOB2	high
ENSG00000182253	SYNM	high
ENSG00000182326	C1S	high
ENSG00000182492	BGN	high
ENSG00000182534	MXRA7	high
ENSG00000182670	TTC3	high
ENSG00000182774	RPS17	high
ENSG00000182809	CRIP2	high
ENSG00000182871	COL18A1	high
ENSG00000183011	NAA38	high
ENSG00000183036	PCP4	high
ENSG00000183087	GAS6	high
ENSG00000183722	LHFPL6	high
ENSG00000183864	TOB2	high
ENSG00000183963	SMTN	high
ENSG00000184007	PTP4A2	high
ENSG00000184160	ADRA2C	high
ENSG00000184489	PTP4A3	high
ENSG00000184557	SOCS3	high
ENSG00000184897	H1-10	high
ENSG00000184983	NDUFA6	high
ENSG00000184990	SIVA1	high
ENSG00000185022	MAFF	high
ENSG00000185122	HSF1	high
ENSG00000185129	PURA	high
ENSG00000185201	IFITM2	high
ENSG00000185222	TCEAL9	high
ENSG00000185551	NR2F2	high
ENSG00000185624	P4HB	high
ENSG00000185630	PBX1	high
ENSG00000185633	NDUFA4L2	high
ENSG00000185787	MORF4L1	high
ENSG00000185885	IFITM1	high
ENSG00000186281	GPAT2	high
ENSG00000186340	THBS2	high
ENSG00000187079	TEAD1	high
ENSG00000187193	MT1X	high
ENSG00000187244	BCAM	high
ENSG00000187479	C11orf96	high
ENSG00000187498	COL4A1	high
ENSG00000187513	GJA4	high
ENSG00000187955	COL14A1	high
ENSG00000188243	COMMD6	high
ENSG00000188290	HES4	high
ENSG00000188612	SUMO2	high
ENSG00000188783	PRELP	high
ENSG00000189043	NDUFA4	high
ENSG00000189067	LITAF	high
ENSG00000189129	PLAC9	high
ENSG00000189171	S100A13	high
ENSG00000189266	PNRC2	high
ENSG00000196154	S100A4	high
ENSG00000196199	MPHOSPH8	high
ENSG00000196230	TUBB	high
ENSG00000196419	XRCC6	high
ENSG00000196507	TCEAL3	high
ENSG00000196616	ADH1B	high
ENSG00000196628	TCF4	high
ENSG00000196923	PDLIM7	high
ENSG00000196924	FLNA	high
ENSG00000197019	SERTAD1	high
ENSG00000197043	ANXA6	high
ENSG00000197256	KANK2	high
ENSG00000197321	SVIL	high
ENSG00000197461	PDGFA	high
ENSG00000197879	MYO1C	high
ENSG00000197894	ADH5	high
ENSG00000197956	S100A6	high
ENSG00000198160	MIER1	high
ENSG00000198258	UBL5	high
ENSG00000198363	ASPH	high
ENSG00000198431	TXNRD1	high
ENSG00000198467	TPM2	high
ENSG00000198523	PLN	high
ENSG00000198832	SELENOM	high
ENSG00000198947	DMD	high
ENSG00000198959	TGM2	high
ENSG00000198961	PJA2	high
ENSG00000204256	BRD2	high
ENSG00000204389	HSPA1A	high
ENSG00000205339	IPO7	high
ENSG00000205362	MT1A	high
ENSG00000205364	MT1M	high
ENSG00000211445	GPX3	high
ENSG00000213145	CRIP1	high
ENSG00000213160	KLHL23	high
ENSG00000213160	PHOSPHO2-KLHL23	high
ENSG00000213465	ARL2	high
ENSG00000213625	LEPROT	high
ENSG00000213626	LBH	high
ENSG00000213639	PPP1CB	high
ENSG00000213722	DDAH2	high
ENSG00000213949	ITGA1	high
ENSG00000220205	VAMP2	high
ENSG00000221869	CEBPD	high
ENSG00000221968	FADS3	high
ENSG00000225921	NOL7	high
ENSG00000225972	MTND1P23	high
ENSG00000228253	ATP8	high
ENSG00000230202	NA	high
ENSG00000230590	FTX	high
ENSG00000230989	HSBP1	high
ENSG00000232388	SMIM26	high
ENSG00000232956	SNHG15	high
ENSG00000233913	RPL10P9	high
ENSG00000234745	HLA-B	high
ENSG00000235162	C12orf75	high
ENSG00000237973	MTCO1P12	high
ENSG00000240583	AQP1	high
ENSG00000241468	ATP5MF	high
ENSG00000241685	ARPC1A	high
ENSG00000242485	MRPL20	high
ENSG00000243147	MRPL33	high
ENSG00000244754	N4BP2L2	high
ENSG00000249669	NA	high
ENSG00000250479	CHCHD10	high
ENSG00000255302	EID1	high
ENSG00000256235	SMIM3	high
ENSG00000260032	NORAD	high
ENSG00000260549	MT1L	high
ENSG00000265972	TXNIP	high
ENSG00000266472	MRPS21	high
ENSG00000272888	NA	high
ENSG00000280143	NA	high
ENSG00000005243	COPZ2	medium
ENSG00000005810	MYCBP2	medium
ENSG00000005884	ITGA3	medium
ENSG00000010818	HIVEP2	medium
ENSG00000011304	PTBP1	medium
ENSG00000011465	DCN	medium
ENSG00000011638	TMEM159	medium
ENSG00000012822	CALCOCO1	medium
ENSG00000013441	CLK1	medium
ENSG00000015153	YAF2	medium
ENSG00000020577	SAMD4A	medium
ENSG00000023287	RB1CC1	medium
ENSG00000028203	VEZT	medium
ENSG00000029363	BCLAF1	medium
ENSG00000036672	USP2	medium
ENSG00000042753	AP2S1	medium
ENSG00000049245	VAMP3	medium
ENSG00000049618	ARID1B	medium
ENSG00000050405	LIMA1	medium
ENSG00000054116	TRAPPC3	medium
ENSG00000056050	HPF1	medium
ENSG00000059804	SLC2A3	medium
ENSG00000061918	GUCY1B1	medium
ENSG00000064393	HIPK2	medium
ENSG00000067113	PLPP1	medium
ENSG00000067208	EVI5	medium
ENSG00000067992	PDK3	medium
ENSG00000072134	EPN2	medium
ENSG00000075391	RASAL2	medium
ENSG00000075785	RAB7A	medium
ENSG00000080802	CNOT4	medium
ENSG00000082515	MRPL22	medium
ENSG00000083642	PDS5B	medium
ENSG00000084463	WBP11	medium
ENSG00000086504	MRPL28	medium
ENSG00000087448	KLHL42	medium
ENSG00000087884	AAMDC	medium
ENSG00000089597	GANAB	medium
ENSG00000090013	BLVRB	medium
ENSG00000092010	PSME1	medium
ENSG00000093010	COMT	medium
ENSG00000095139	ARCN1	medium
ENSG00000095209	TMEM38B	medium
ENSG00000096060	FKBP5	medium
ENSG00000096401	CDC5L	medium
ENSG00000099991	CABIN1	medium
ENSG00000100307	CBX7	medium
ENSG00000100320	RBFOX2	medium
ENSG00000101040	ZMYND8	medium
ENSG00000101290	CDS2	medium
ENSG00000101365	IDH3B	medium
ENSG00000101654	RNMT	medium
ENSG00000101752	MIB1	medium
ENSG00000102038	SMARCA1	medium
ENSG00000102144	PGK1	medium
ENSG00000103202	NME4	medium
ENSG00000103415	HMOX2	medium
ENSG00000103502	CDIPT	medium
ENSG00000103710	RASL12	medium
ENSG00000104047	DTWD1	medium
ENSG00000104131	EIF3J	medium
ENSG00000104231	ZFAND1	medium
ENSG00000104419	NDRG1	medium
ENSG00000104852	SNRNP70	medium
ENSG00000104979	C19orf53	medium
ENSG00000105258	POLR2I	medium
ENSG00000105372	RPS19	medium
ENSG00000105618	PRPF31	medium
ENSG00000105655	ISYNA1	medium
ENSG00000105887	MTPN	medium
ENSG00000105887	LUZP6	medium
ENSG00000106034	CPED1	medium
ENSG00000106052	TAX1BP1	medium
ENSG00000106299	WASL	medium
ENSG00000106635	BCL7B	medium
ENSG00000106723	SPIN1	medium
ENSG00000106823	ECM2	medium
ENSG00000107625	DDX50	medium
ENSG00000107816	LZTS2	medium
ENSG00000108405	P2RX1	medium
ENSG00000108561	C1QBP	medium
ENSG00000108587	GOSR1	medium
ENSG00000108823	SGCA	medium
ENSG00000108840	HDAC5	medium
ENSG00000108861	DUSP3	medium
ENSG00000109171	SLAIN2	medium
ENSG00000109390	NDUFC1	medium
ENSG00000109519	GRPEL1	medium
ENSG00000109906	ZBTB16	medium
ENSG00000110237	ARHGEF17	medium
ENSG00000111011	RSRC2	medium
ENSG00000111237	VPS29	medium
ENSG00000111321	LTBR	medium
ENSG00000111540	RAB5B	medium
ENSG00000111640	GAPDH	medium
ENSG00000111707	SUDS3	medium
ENSG00000112200	ZNF451	medium
ENSG00000112214	FHL5	medium
ENSG00000112305	SMAP1	medium
ENSG00000113384	GOLPH3	medium
ENSG00000113657	DPYSL3	medium
ENSG00000114784	EIF1B	medium
ENSG00000114796	KLHL24	medium
ENSG00000115128	SF3B6	medium
ENSG00000115364	MRPL19	medium
ENSG00000115520	COQ10B	medium
ENSG00000115875	SRSF7	medium
ENSG00000116717	GADD45A	medium
ENSG00000116754	SRSF11	medium
ENSG00000116871	MAP7D1	medium
ENSG00000117020	AKT3	medium
ENSG00000117616	RSRP1	medium
ENSG00000118200	CAMSAP2	medium
ENSG00000118363	SPCS2	medium
ENSG00000119004	CYP20A1	medium
ENSG00000119013	NDUFB3	medium
ENSG00000119242	CCDC92	medium
ENSG00000119471	HSDL2	medium
ENSG00000119705	SLIRP	medium
ENSG00000119878	CRIPT	medium
ENSG00000120860	WASHC3	medium
ENSG00000121057	AKAP1	medium
ENSG00000121067	SPOP	medium
ENSG00000121413	ZSCAN18	medium
ENSG00000121644	DESI2	medium
ENSG00000121879	PIK3CA	medium
ENSG00000122958	VPS26A	medium
ENSG00000123143	PKN1	medium
ENSG00000123395	ATG101	medium
ENSG00000124733	MEA1	medium
ENSG00000125520	SLC2A4RG	medium
ENSG00000125977	EIF2S2	medium
ENSG00000126214	KLC1	medium
ENSG00000126254	RBM42	medium
ENSG00000126457	PRMT1	medium
ENSG00000126653	NSRP1	medium
ENSG00000126945	HNRNPH2	medium
ENSG00000127922	SEM1	medium
ENSG00000127946	HIP1	medium
ENSG00000128274	A4GALT	medium
ENSG00000128463	EMC4	medium
ENSG00000128524	ATP6V1F	medium
ENSG00000129518	EAPP	medium
ENSG00000129680	MAP7D3	medium
ENSG00000130811	EIF3G	medium
ENSG00000131013	PPIL4	medium
ENSG00000131016	AKAP12	medium
ENSG00000131408	NR1H2	medium
ENSG00000131469	RPL27	medium
ENSG00000131471	AOC3	medium
ENSG00000131620	ANO1	medium
ENSG00000131626	PPFIA1	medium
ENSG00000131966	ACTR10	medium
ENSG00000132155	RAF1	medium
ENSG00000132305	IMMT	medium
ENSG00000132688	NES	medium
ENSG00000132792	CTNNBL1	medium
ENSG00000133816	MICAL2	medium
ENSG00000133816	MICALCL	medium
ENSG00000134072	CAMK1	medium
ENSG00000134265	NAPG	medium
ENSG00000134283	PPHLN1	medium
ENSG00000134308	YWHAQ	medium
ENSG00000134330	IAH1	medium
ENSG00000134371	CDC73	medium
ENSG00000134769	DTNA	medium
ENSG00000135108	FBXO21	medium
ENSG00000135441	BLOC1S1	medium
ENSG00000135829	DHX9	medium
ENSG00000136003	ISCU	medium
ENSG00000136045	PWP1	medium
ENSG00000136237	RAPGEF5	medium
ENSG00000136450	SRSF1	medium
ENSG00000136522	MRPL47	medium
ENSG00000136536	MARCHF7	medium
ENSG00000136718	IMP4	medium
ENSG00000136936	XPA	medium
ENSG00000137500	CCDC90B	medium
ENSG00000137726	FXYD6	medium
ENSG00000138031	ADCY3	medium
ENSG00000138193	PLCE1	medium
ENSG00000138398	PPIG	medium
ENSG00000138668	HNRNPD	medium
ENSG00000138758	SEPTIN11	medium
ENSG00000139083	ETV6	medium
ENSG00000139154	AEBP2	medium
ENSG00000139343	SNRPF	medium
ENSG00000139697	SBNO1	medium
ENSG00000140538	NTRK3	medium
ENSG00000140553	UNC45A	medium
ENSG00000140575	IQGAP1	medium
ENSG00000140612	SEC11A	medium
ENSG00000140750	ARHGAP17	medium
ENSG00000140939	NOL3	medium
ENSG00000140943	MBTPS1	medium
ENSG00000141447	OSBPL1A	medium
ENSG00000141933	TPGS1	medium
ENSG00000141959	PFKL	medium
ENSG00000142208	AKT1	medium
ENSG00000143013	LMO4	medium
ENSG00000143256	PFDN2	medium
ENSG00000143442	POGZ	medium
ENSG00000143549	TPM3	medium
ENSG00000144034	TPRKB	medium
ENSG00000144366	GULP1	medium
ENSG00000144635	DYNC1LI1	medium
ENSG00000144642	RBMS3	medium
ENSG00000144655	CSRNP1	medium
ENSG00000145730	PAM	medium
ENSG00000146122	DAAM2	medium
ENSG00000146963	LUC7L2	medium
ENSG00000148335	NTMT1	medium
ENSG00000148690	FRA10AC1	medium
ENSG00000149273	RPS3	medium
ENSG00000149823	VPS51	medium
ENSG00000151135	TMEM263	medium
ENSG00000151414	NEK7	medium
ENSG00000151461	UPF2	medium
ENSG00000151914	DST	medium
ENSG00000152944	MED21	medium
ENSG00000153037	SRP19	medium
ENSG00000153179	RASSF3	medium
ENSG00000153902	LGI4	medium
ENSG00000154144	TBRG1	medium
ENSG00000154188	ANGPT1	medium
ENSG00000155254	MARVELD1	medium
ENSG00000156804	FBXO32	medium
ENSG00000157954	WIPI2	medium
ENSG00000158122	PRXL2C	medium
ENSG00000158526	TSR2	medium
ENSG00000158710	TAGLN2	medium
ENSG00000158828	PINK1	medium
ENSG00000159403	C1R	medium
ENSG00000160013	PTGIR	medium
ENSG00000160014	CALM3	medium
ENSG00000160953	PWWP3A	medium
ENSG00000161526	SAP30BP	medium
ENSG00000161547	SRSF2	medium
ENSG00000161970	RPL26	medium
ENSG00000162032	SPSB3	medium
ENSG00000162244	RPL29	medium
ENSG00000162384	CZIB	medium
ENSG00000162517	PEF1	medium
ENSG00000162604	TM2D1	medium
ENSG00000162623	TYW3	medium
ENSG00000162664	ZNF326	medium
ENSG00000162885	B3GALNT2	medium
ENSG00000162998	FRZB	medium
ENSG00000163069	SGCB	medium
ENSG00000163382	NAXE	medium
ENSG00000163531	NFASC	medium
ENSG00000163536	SERPINI1	medium
ENSG00000163597	SNHG16	medium
ENSG00000163697	APBB2	medium
ENSG00000164022	AIMP1	medium
ENSG00000164114	MAP9	medium
ENSG00000164172	MOCS2	medium
ENSG00000164182	NDUFAF2	medium
ENSG00000164684	ZNF704	medium
ENSG00000164733	CTSB	medium
ENSG00000164902	PHAX	medium
ENSG00000165264	NDUFB6	medium
ENSG00000165516	KLHDC2	medium
ENSG00000165949	IFI27	medium
ENSG00000165996	HACD1	medium
ENSG00000166200	COPS2	medium
ENSG00000166275	BORCS7	medium
ENSG00000166444	DENND2B	medium
ENSG00000166710	B2M	medium
ENSG00000166780	BMERB1	medium
ENSG00000166831	RBPMS2	medium
ENSG00000167515	TRAPPC2L	medium
ENSG00000167565	SERTAD3	medium
ENSG00000168002	POLR2G	medium
ENSG00000168028	RPSA	medium
ENSG00000168066	SF1	medium
ENSG00000168300	PCMTD1	medium
ENSG00000168710	AHCYL1	medium
ENSG00000168734	PKIG	medium
ENSG00000169139	UBE2V2	medium
ENSG00000169251	NMD3	medium
ENSG00000169604	ANTXR1	medium
ENSG00000169764	UGP2	medium
ENSG00000170310	STX8	medium
ENSG00000170584	NUDCD2	medium
ENSG00000170889	RPS9	medium
ENSG00000171314	PGAM1	medium
ENSG00000171421	MRPL36	medium
ENSG00000171634	BPTF	medium
ENSG00000172037	LAMB2	medium
ENSG00000172059	KLF11	medium
ENSG00000172239	PAIP1	medium
ENSG00000172346	CSDC2	medium
ENSG00000172428	COPS9	medium
ENSG00000172500	FIBP	medium
ENSG00000173163	COMMD1	medium
ENSG00000173402	DAG1	medium
ENSG00000174738	NR1D2	medium
ENSG00000175215	CTDSP2	medium
ENSG00000175334	BANF1	medium
ENSG00000176386	CDC26	medium
ENSG00000176658	MYO1D	medium
ENSG00000176903	PNMA1	medium
ENSG00000176978	DPP7	medium
ENSG00000177600	RPLP2	medium
ENSG00000177954	RPS27	medium
ENSG00000178951	ZBTB7A	medium
ENSG00000179295	PTPN11	medium
ENSG00000180228	PRKRA	medium
ENSG00000180957	PITPNB	medium
ENSG00000181222	POLR2A	medium
ENSG00000181555	SETD2	medium
ENSG00000181704	YIPF6	medium
ENSG00000181722	ZBTB20	medium
ENSG00000182004	SNRPE	medium
ENSG00000182149	IST1	medium
ENSG00000182195	LDOC1	medium
ENSG00000182636	NDN	medium
ENSG00000182952	HMGN4	medium
ENSG00000183255	PTTG1IP	medium
ENSG00000183431	SF3A3	medium
ENSG00000183807	FAM162B	medium
ENSG00000184281	TSSC4	medium
ENSG00000185432	METTL7A	medium
ENSG00000187954	CYHR1	medium
ENSG00000188554	NBR1	medium
ENSG00000188846	RPL14	medium
ENSG00000189221	MAOA	medium
ENSG00000196655	TRAPPC4	medium
ENSG00000196712	NF1	medium
ENSG00000196792	STRN3	medium
ENSG00000196961	AP2A1	medium
ENSG00000197323	TRIM33	medium
ENSG00000197324	LRP10	medium
ENSG00000197380	DACT3	medium
ENSG00000197579	TOPORS	medium
ENSG00000197712	FAM114A1	medium
ENSG00000197958	RPL12	medium
ENSG00000198561	CTNND1	medium
ENSG00000198763	ND2	medium
ENSG00000198873	GRK5	medium
ENSG00000198900	TOP1	medium
ENSG00000203485	INF2	medium
ENSG00000203879	GDI1	medium
ENSG00000204356	NELFE	medium
ENSG00000204388	HSPA1B	medium
ENSG00000204842	ATXN2	medium
ENSG00000204843	DCTN1	medium
ENSG00000205730	ITPRIPL2	medium
ENSG00000211459	NA	medium
ENSG00000213463	SYNJ2BP	medium
ENSG00000213523	SRA1	medium
ENSG00000213741	RPS29	medium
ENSG00000213853	EMP2	medium
ENSG00000213923	CSNK1E	medium
ENSG00000213977	TAX1BP3	medium
ENSG00000214194	SMIM30	medium
ENSG00000224078	NA	medium
ENSG00000225663	MCRIP1	medium
ENSG00000233117	NA	medium
ENSG00000234545	FAM133B	medium
ENSG00000237550	RPL9P8	medium
ENSG00000246705	H2AJ	medium
ENSG00000247809	NR2F2-AS1	medium
ENSG00000250722	SELENOP	medium
ENSG00000255248	MIR100HG	medium
ENSG00000257704	INAFM1	medium
ENSG00000258289	CHURC1	medium
ENSG00000267519	NA	medium
ENSG00000269293	ZSCAN16-AS1	medium
ENSG00000273611	ZNHIT3	medium
