IdentityGene	GeneSymbol	Level
ENSG00000002587	HS3ST1	high
ENSG00000003402	CFLAR	high
ENSG00000004534	RBM6	high
ENSG00000004779	NDUFAB1	high
ENSG00000005206	SPPL2B	high
ENSG00000005483	KMT2E	high
ENSG00000006025	OSBPL7	high
ENSG00000006327	TNFRSF12A	high
ENSG00000008018	PSMB1	high
ENSG00000008294	SPAG9	high
ENSG00000008394	MGST1	high
ENSG00000009307	CSDE1	high
ENSG00000010256	UQCRC1	high
ENSG00000010278	CD9	high
ENSG00000011422	PLAUR	high
ENSG00000013588	GPRC5A	high
ENSG00000014641	MDH1	high
ENSG00000017797	RALBP1	high
ENSG00000019102	VSIG2	high
ENSG00000019582	CD74	high
ENSG00000021355	SERPINB1	high
ENSG00000029993	HMGB3	high
ENSG00000030582	GRN	high
ENSG00000033867	SLC4A7	high
ENSG00000035403	VCL	high
ENSG00000039068	CDH1	high
ENSG00000041357	PSMA4	high
ENSG00000044115	CTNNA1	high
ENSG00000046651	OFD1	high
ENSG00000047457	CP	high
ENSG00000048649	RSF1	high
ENSG00000048828	FAM120A	high
ENSG00000049759	NEDD4L	high
ENSG00000051523	CYBA	high
ENSG00000051620	HEBP2	high
ENSG00000052802	MSMO1	high
ENSG00000053747	LAMA3	high
ENSG00000054148	PHPT1	high
ENSG00000054267	ARID4B	high
ENSG00000054654	SYNE2	high
ENSG00000055609	KMT2C	high
ENSG00000057149	SERPINB3	high
ENSG00000057608	GDI2	high
ENSG00000058085	LAMC2	high
ENSG00000058262	SEC61A1	high
ENSG00000059728	MXD1	high
ENSG00000061987	MON2	high
ENSG00000062716	VMP1	high
ENSG00000064651	SLC12A2	high
ENSG00000064787	BCAS1	high
ENSG00000065243	PKN2	high
ENSG00000065361	ERBB3	high
ENSG00000065518	NDUFB4	high
ENSG00000065809	FAM107B	high
ENSG00000067064	IDI1	high
ENSG00000067167	TRAM1	high
ENSG00000067225	PKM	high
ENSG00000068912	ERLEC1	high
ENSG00000069764	PLA2G10	high
ENSG00000070081	NUCB2	high
ENSG00000071127	WDR1	high
ENSG00000072364	AFF4	high
ENSG00000072778	ACADVL	high
ENSG00000073350	LLGL2	high
ENSG00000073849	ST6GAL1	high
ENSG00000074071	MRPS34	high
ENSG00000074416	MGLL	high
ENSG00000074695	LMAN1	high
ENSG00000074842	MYDGF	high
ENSG00000075142	SRI	high
ENSG00000075426	FOSL2	high
ENSG00000075539	FRYL	high
ENSG00000076554	TPD52	high
ENSG00000077147	TM9SF3	high
ENSG00000077232	DNAJC10	high
ENSG00000077380	DYNC1I2	high
ENSG00000077549	CAPZB	high
ENSG00000078369	GNB1	high
ENSG00000079112	CDH17	high
ENSG00000079459	FDFT1	high
ENSG00000079805	DNM2	high
ENSG00000080845	DLGAP4	high
ENSG00000081803	CADPS2	high
ENSG00000084207	GSTP1	high
ENSG00000084733	RAB10	high
ENSG00000085063	CD59	high
ENSG00000085224	ATRX	high
ENSG00000086062	B4GALT1	high
ENSG00000086102	NFX1	high
ENSG00000086544	ITPKC	high
ENSG00000086548	CEACAM6	high
ENSG00000086598	TMED2	high
ENSG00000087074	PPP1R15A	high
ENSG00000088888	MAVS	high
ENSG00000089053	ANAPC5	high
ENSG00000089356	FXYD3	high
ENSG00000090266	NDUFB2	high
ENSG00000090382	LYZ	high
ENSG00000091409	ITGA6	high
ENSG00000092148	HECTD1	high
ENSG00000092820	EZR	high
ENSG00000095380	NANS	high
ENSG00000096746	HNRNPH3	high
ENSG00000099204	ABLIM1	high
ENSG00000099337	KCNK6	high
ENSG00000099341	PSMD8	high
ENSG00000099622	CIRBP	high
ENSG00000099800	TIMM13	high
ENSG00000099812	MISP	high
ENSG00000099814	CEP170B	high
ENSG00000100219	XBP1	high
ENSG00000100221	JOSD1	high
ENSG00000100239	PPP6R2	high
ENSG00000100387	RBX1	high
ENSG00000100567	PSMA3	high
ENSG00000100650	SRSF5	high
ENSG00000100811	YY1	high
ENSG00000100815	TRIP11	high
ENSG00000100941	PNN	high
ENSG00000101421	CHMP4B	high
ENSG00000101443	WFDC2	high
ENSG00000101558	VAPA	high
ENSG00000101782	RIOK3	high
ENSG00000102003	SYP	high
ENSG00000102317	RBM3	high
ENSG00000102554	KLF5	high
ENSG00000102580	DNAJC3	high
ENSG00000102786	INTS6	high
ENSG00000102854	MSLN	high
ENSG00000103035	PSMD7	high
ENSG00000103316	CRYM	high
ENSG00000103534	TMC5	high
ENSG00000103769	RAB11A	high
ENSG00000104067	TJP1	high
ENSG00000104131	EIF3J	high
ENSG00000104331	BPNT2	high
ENSG00000104388	RAB2A	high
ENSG00000104419	NDRG1	high
ENSG00000104537	ANXA13	high
ENSG00000104763	ASAH1	high
ENSG00000104870	FCGRT	high
ENSG00000105388	CEACAM5	high
ENSG00000105438	KDELR1	high
ENSG00000105518	TMEM205	high
ENSG00000105519	CAPS	high
ENSG00000105523	FAM83E	high
ENSG00000105669	COPE	high
ENSG00000105993	DNAJB6	high
ENSG00000106153	CHCHD2	high
ENSG00000106258	CYP3A5	high
ENSG00000106261	ZKSCAN1	high
ENSG00000106400	ZNHIT1	high
ENSG00000106537	TSPAN13	high
ENSG00000106541	AGR2	high
ENSG00000106617	PRKAG2	high
ENSG00000106829	TLE4	high
ENSG00000107262	BAG1	high
ENSG00000107290	SETX	high
ENSG00000107581	EIF3A	high
ENSG00000107957	SH3PXD2A	high
ENSG00000108106	UBE2S	high
ENSG00000108107	RPL28	high
ENSG00000108510	MED13	high
ENSG00000108582	CPD	high
ENSG00000108602	ALDH3A1	high
ENSG00000108639	SYNGR2	high
ENSG00000108848	LUC7L3	high
ENSG00000108953	YWHAE	high
ENSG00000109062	SLC9A3R1	high
ENSG00000109180	OCIAD1	high
ENSG00000109321	AREG	high
ENSG00000109586	GALNT7	high
ENSG00000109787	KLF3	high
ENSG00000109814	UGDH	high
ENSG00000109861	CTSC	high
ENSG00000109920	FNBP4	high
ENSG00000110092	CCND1	high
ENSG00000110195	FOLR1	high
ENSG00000110321	EIF4G2	high
ENSG00000110492	MDK	high
ENSG00000110651	CD81	high
ENSG00000110717	NDUFS8	high
ENSG00000110925	CSRNP2	high
ENSG00000110955	ATP5F1B	high
ENSG00000111057	KRT18	high
ENSG00000111229	ARPC3	high
ENSG00000111275	ALDH2	high
ENSG00000111319	SCNN1A	high
ENSG00000111328	CDK2AP1	high
ENSG00000111639	MRPL51	high
ENSG00000111843	TMEM14C	high
ENSG00000111912	NCOA7	high
ENSG00000112378	PERP	high
ENSG00000112379	ARFGEF3	high
ENSG00000112514	CUTA	high
ENSG00000112695	COX7A2	high
ENSG00000112715	VEGFA	high
ENSG00000112739	PRPF4B	high
ENSG00000112972	HMGCS1	high
ENSG00000113070	HBEGF	high
ENSG00000113282	CLINT1	high
ENSG00000113318	MSH3	high
ENSG00000113648	MACROH2A1	high
ENSG00000113712	CSNK1A1	high
ENSG00000113719	ERGIC1	high
ENSG00000113732	ATP6V0E1	high
ENSG00000113811	SELENOK	high
ENSG00000114125	RNF7	high
ENSG00000114315	HES1	high
ENSG00000114541	FRMD4B	high
ENSG00000114850	SSR3	high
ENSG00000114857	NKTR	high
ENSG00000114861	FOXP1	high
ENSG00000114902	SPCS1	high
ENSG00000115053	NCL	high
ENSG00000115091	ACTR3	high
ENSG00000115112	TFCP2L1	high
ENSG00000115306	SPTBN1	high
ENSG00000115464	USP34	high
ENSG00000115524	SF3B1	high
ENSG00000115648	MLPH	high
ENSG00000115738	ID2	high
ENSG00000115756	HPCAL1	high
ENSG00000115758	ODC1	high
ENSG00000115760	BIRC6	high
ENSG00000115944	COX7A2L	high
ENSG00000115963	RND3	high
ENSG00000116016	EPAS1	high
ENSG00000116030	SUMO1	high
ENSG00000116171	SCP2	high
ENSG00000116191	RALGPS2	high
ENSG00000116209	TMEM59	high
ENSG00000116299	ELAPOR1	high
ENSG00000116350	SRSF4	high
ENSG00000116459	ATP5PB	high
ENSG00000116539	ASH1L	high
ENSG00000116560	SFPQ	high
ENSG00000116717	GADD45A	high
ENSG00000116754	SRSF11	high
ENSG00000117139	KDM5B	high
ENSG00000117335	CD46	high
ENSG00000117448	AKR1A1	high
ENSG00000117472	TSPAN1	high
ENSG00000117523	PRRC2C	high
ENSG00000117525	F3	high
ENSG00000117614	SYF2	high
ENSG00000117616	RSRP1	high
ENSG00000117691	NENF	high
ENSG00000117983	MUC5B	high
ENSG00000117984	CTSD	high
ENSG00000118007	STAG1	high
ENSG00000118363	SPCS2	high
ENSG00000118418	HMGN3	high
ENSG00000118482	PHF3	high
ENSG00000118640	VAMP8	high
ENSG00000118705	RPN2	high
ENSG00000118816	CCNI	high
ENSG00000118849	RARRES1	high
ENSG00000119048	UBE2B	high
ENSG00000119335	SET	high
ENSG00000119655	NPC2	high
ENSG00000119787	ATL2	high
ENSG00000119888	EPCAM	high
ENSG00000120071	KANSL1	high
ENSG00000120694	HSPH1	high
ENSG00000120742	SERP1	high
ENSG00000120885	CLU	high
ENSG00000120963	ZNF706	high
ENSG00000121039	RDH10	high
ENSG00000121064	SCPEP1	high
ENSG00000121310	ECHDC2	high
ENSG00000121578	B4GALT4	high
ENSG00000121774	KHDRBS1	high
ENSG00000121858	TNFSF10	high
ENSG00000122359	ANXA11	high
ENSG00000122417	ODF2L	high
ENSG00000122545	SEPTIN7	high
ENSG00000123066	MED13L	high
ENSG00000123104	ITPR2	high
ENSG00000123505	AMD1	high
ENSG00000123636	BAZ2B	high
ENSG00000124107	SLPI	high
ENSG00000124225	PMEPA1	high
ENSG00000124429	POF1B	high
ENSG00000124570	SERPINB6	high
ENSG00000124766	SOX4	high
ENSG00000124783	SSR1	high
ENSG00000124795	DEK	high
ENSG00000124875	CXCL6	high
ENSG00000125148	MT2A	high
ENSG00000125356	NDUFA1	high
ENSG00000125398	SOX9	high
ENSG00000125534	PPDPF	high
ENSG00000125652	ALKBH7	high
ENSG00000125730	C3	high
ENSG00000125775	SDCBP2	high
ENSG00000125844	RRBP1	high
ENSG00000125944	HNRNPR	high
ENSG00000125968	ID1	high
ENSG00000125991	ERGIC3	high
ENSG00000125999	BPIFB1	high
ENSG00000126247	CAPNS1	high
ENSG00000126267	COX6B1	high
ENSG00000126432	PRDX5	high
ENSG00000126562	WNK4	high
ENSG00000126803	HSPA2	high
ENSG00000126870	DYNC2I1	high
ENSG00000127314	RAP1B	high
ENSG00000127324	TSPAN8	high
ENSG00000127528	KLF2	high
ENSG00000127824	TUBA4A	high
ENSG00000127831	VIL1	high
ENSG00000127838	PNKD	high
ENSG00000127884	ECHS1	high
ENSG00000127914	AKAP9	high
ENSG00000127922	SEM1	high
ENSG00000127954	STEAP4	high
ENSG00000128228	SDF2L1	high
ENSG00000128245	YWHAH	high
ENSG00000128272	ATF4	high
ENSG00000128422	KRT17	high
ENSG00000128487	SPECC1	high
ENSG00000128595	CALU	high
ENSG00000128609	NDUFA5	high
ENSG00000128917	DLL4	high
ENSG00000129003	VPS13C	high
ENSG00000129128	SPCS3	high
ENSG00000129250	KIF1C	high
ENSG00000129351	ILF3	high
ENSG00000129538	RNASE1	high
ENSG00000129562	DAD1	high
ENSG00000129625	REEP5	high
ENSG00000129757	CDKN1C	high
ENSG00000130164	LDLR	high
ENSG00000130255	RPL36	high
ENSG00000130313	PGLS	high
ENSG00000130396	AFDN	high
ENSG00000130402	ACTN4	high
ENSG00000130513	GDF15	high
ENSG00000130707	ASS1	high
ENSG00000130724	CHMP2A	high
ENSG00000130779	CLIP1	high
ENSG00000131149	GSE1	high
ENSG00000131236	CAP1	high
ENSG00000131495	NDUFA2	high
ENSG00000131981	LGALS3	high
ENSG00000132424	PNISR	high
ENSG00000132432	SEC61G	high
ENSG00000132485	ZRANB2	high
ENSG00000132507	EIF5A	high
ENSG00000132510	KDM6B	high
ENSG00000132698	RAB25	high
ENSG00000132963	POMP	high
ENSG00000133321	PLAAT4	high
ENSG00000134107	BHLHE40	high
ENSG00000134121	CHL1	high
ENSG00000134193	REG4	high
ENSG00000134294	SLC38A2	high
ENSG00000134339	SAA2	high
ENSG00000134755	DSC2	high
ENSG00000134827	TCN1	high
ENSG00000134873	CLDN10	high
ENSG00000134884	ARGLU1	high
ENSG00000135046	ANXA1	high
ENSG00000135048	CEMIP2	high
ENSG00000135052	GOLM1	high
ENSG00000135316	SYNCRIP	high
ENSG00000135373	EHF	high
ENSG00000135390	ATP5MC2	high
ENSG00000135480	KRT7	high
ENSG00000135506	OS9	high
ENSG00000135525	MAP7	high
ENSG00000135541	AHI1	high
ENSG00000135655	USP15	high
ENSG00000135720	DYNC1LI2	high
ENSG00000135916	ITM2C	high
ENSG00000135940	COX5B	high
ENSG00000136153	LMO7	high
ENSG00000136240	KDELR2	high
ENSG00000136542	GALNT5	high
ENSG00000136826	KLF4	high
ENSG00000136938	ANP32B	high
ENSG00000137210	TMEM14B	high
ENSG00000137309	HMGA1	high
ENSG00000137409	MTCH1	high
ENSG00000137440	FGFBP1	high
ENSG00000137501	SYTL2	high
ENSG00000137815	RTF1	high
ENSG00000138069	RAB1A	high
ENSG00000138071	ACTR2	high
ENSG00000138166	DUSP5	high
ENSG00000138385	SSB	high
ENSG00000138434	ITPRID2	high
ENSG00000138495	COX17	high
ENSG00000138640	FAM13A	high
ENSG00000138674	SEC31A	high
ENSG00000139218	SCAF11	high
ENSG00000139629	GALNT6	high
ENSG00000140365	COMMD4	high
ENSG00000140391	TSPAN3	high
ENSG00000140416	TPM1	high
ENSG00000140526	ABHD2	high
ENSG00000140740	UQCRC2	high
ENSG00000140832	MARVELD3	high
ENSG00000141002	TCF25	high
ENSG00000141027	NCOR1	high
ENSG00000141198	TOM1L1	high
ENSG00000141232	TOB1	high
ENSG00000141252	VPS53	high
ENSG00000141522	ARHGDIA	high
ENSG00000141551	CSNK1D	high
ENSG00000141552	ANAPC11	high
ENSG00000141934	PLPP2	high
ENSG00000142192	APP	high
ENSG00000142534	RPS11	high
ENSG00000142541	RPL13A	high
ENSG00000142599	RERE	high
ENSG00000142627	EPHA2	high
ENSG00000142949	PTPRF	high
ENSG00000142973	CYP4B1	high
ENSG00000143153	ATP1B1	high
ENSG00000143183	TMCO1	high
ENSG00000143198	MGST3	high
ENSG00000143416	SELENBP1	high
ENSG00000143420	ENSA	high
ENSG00000143543	JTB	high
ENSG00000143633	C1orf131	high
ENSG00000143742	SRP9	high
ENSG00000143761	ARF1	high
ENSG00000143776	CDC42BPA	high
ENSG00000143819	EPHX1	high
ENSG00000144136	SLC20A1	high
ENSG00000144224	UBXN4	high
ENSG00000144426	NBEAL1	high
ENSG00000144485	HES6	high
ENSG00000144674	GOLGA4	high
ENSG00000144802	NFKBIZ	high
ENSG00000145113	MUC4	high
ENSG00000145287	PLAC8	high
ENSG00000145384	FABP2	high
ENSG00000145494	NDUFS6	high
ENSG00000145632	PLK2	high
ENSG00000145833	DDX46	high
ENSG00000145860	RNF145	high
ENSG00000145912	NHP2	high
ENSG00000146425	DYNLT1	high
ENSG00000146674	IGFBP3	high
ENSG00000147123	NDUFB11	high
ENSG00000147155	EBP	high
ENSG00000147202	DIAPH2	high
ENSG00000147676	MAL2	high
ENSG00000147862	NFIB	high
ENSG00000148154	UGCG	high
ENSG00000148339	SLC25A25	high
ENSG00000148346	LCN2	high
ENSG00000148737	TCF7L2	high
ENSG00000148926	ADM	high
ENSG00000149021	SCGB1A1	high
ENSG00000149260	CAPN5	high
ENSG00000149418	ST14	high
ENSG00000149932	TMEM219	high
ENSG00000150593	PDCD4	high
ENSG00000150687	PRSS23	high
ENSG00000150779	TIMM8B	high
ENSG00000152234	ATP5F1A	high
ENSG00000152558	TMEM123	high
ENSG00000153048	CARHSP1	high
ENSG00000153214	TMEM87B	high
ENSG00000153234	NR4A2	high
ENSG00000153446	C16orf89	high
ENSG00000153774	CFDP1	high
ENSG00000153914	SREK1	high
ENSG00000154080	CHST9	high
ENSG00000154274	C4orf19	high
ENSG00000154305	MIA3	high
ENSG00000154447	SH3RF1	high
ENSG00000155366	RHOC	high
ENSG00000155660	PDIA4	high
ENSG00000155850	SLC26A2	high
ENSG00000155957	TMBIM4	high
ENSG00000156113	KCNMA1	high
ENSG00000156256	USP16	high
ENSG00000156411	ATP5MPL	high
ENSG00000156675	RAB11FIP1	high
ENSG00000156976	EIF4A2	high
ENSG00000157106	SMG1	high
ENSG00000157557	ETS2	high
ENSG00000157765	SLC34A2	high
ENSG00000158195	WASF2	high
ENSG00000158417	EIF5B	high
ENSG00000158716	DUSP23	high
ENSG00000158769	F11R	high
ENSG00000159199	ATP5MC1	high
ENSG00000159216	RUNX1	high
ENSG00000159216	LOC100506403	high
ENSG00000159388	BTG2	high
ENSG00000160075	SSU72	high
ENSG00000160180	TFF3	high
ENSG00000160182	TFF1	high
ENSG00000160194	NDUFV3	high
ENSG00000160439	RDH13	high
ENSG00000160752	FDPS	high
ENSG00000160862	AZGP1	high
ENSG00000160888	IER2	high
ENSG00000160932	LY6E	high
ENSG00000161011	SQSTM1	high
ENSG00000161055	SCGB3A1	high
ENSG00000161798	AQP5	high
ENSG00000162368	CMPK1	high
ENSG00000162434	JAK1	high
ENSG00000162545	CAMK2N1	high
ENSG00000162599	NFIA	high
ENSG00000162704	ARPC5	high
ENSG00000162772	ATF3	high
ENSG00000162783	IER5	high
ENSG00000162896	PIGR	high
ENSG00000162909	CAPN2	high
ENSG00000162924	REL	high
ENSG00000163191	S100A11	high
ENSG00000163220	S100A9	high
ENSG00000163435	ELF3	high
ENSG00000163515	RETNLB	high
ENSG00000163584	RPL22L1	high
ENSG00000163683	SMIM14	high
ENSG00000163694	RBM47	high
ENSG00000163739	CXCL1	high
ENSG00000163898	LIPH	high
ENSG00000163993	S100P	high
ENSG00000164096	C4orf3	high
ENSG00000164190	NIPBL	high
ENSG00000164266	SPINK1	high
ENSG00000164292	RHOBTB3	high
ENSG00000164442	CITED2	high
ENSG00000164587	RPS14	high
ENSG00000164687	FABP5	high
ENSG00000164825	DEFB1	high
ENSG00000165092	ALDH1A1	high
ENSG00000165105	RASEF	high
ENSG00000165119	HNRNPK	high
ENSG00000165215	CLDN3	high
ENSG00000165272	AQP3	high
ENSG00000165280	VCP	high
ENSG00000165795	NDRG2	high
ENSG00000165959	CLMN	high
ENSG00000166012	TAF1D	high
ENSG00000166136	NDUFB8	high
ENSG00000166145	SPINT1	high
ENSG00000166165	CKB	high
ENSG00000166347	CYB5A	high
ENSG00000166483	WEE1	high
ENSG00000166557	TMED3	high
ENSG00000166562	SEC11C	high
ENSG00000166579	NDEL1	high
ENSG00000166750	SLFN5	high
ENSG00000166920	C15orf48	high
ENSG00000167004	PDIA3	high
ENSG00000167034	NKX3-1	high
ENSG00000167088	SNRPD1	high
ENSG00000167232	ZNF91	high
ENSG00000167460	TPM4	high
ENSG00000167470	MIDN	high
ENSG00000167508	MVD	high
ENSG00000167522	ANKRD11	high
ENSG00000167553	TUBA1C	high
ENSG00000167615	LENG8	high
ENSG00000167617	CDC42EP5	high
ENSG00000167642	SPINT2	high
ENSG00000167644	C19orf33	high
ENSG00000167653	PSCA	high
ENSG00000167748	KLK1	high
ENSG00000167757	KLK11	high
ENSG00000167772	ANGPTL4	high
ENSG00000167978	SRRM2	high
ENSG00000168028	RPSA	high
ENSG00000168036	CTNNB1	high
ENSG00000168374	ARF4	high
ENSG00000168447	SCNN1B	high
ENSG00000168528	SERINC2	high
ENSG00000168894	RNF181	high
ENSG00000168906	MAT2A	high
ENSG00000169223	LMAN2	high
ENSG00000169429	CXCL8	high
ENSG00000169435	RASSF6	high
ENSG00000169564	PCBP1	high
ENSG00000169567	HINT1	high
ENSG00000169641	LUZP1	high
ENSG00000169692	AGPAT2	high
ENSG00000169714	CNBP	high
ENSG00000169764	UGP2	high
ENSG00000169905	TOR1AIP2	high
ENSG00000169908	TM4SF1	high
ENSG00000169976	SF3B5	high
ENSG00000170017	ALCAM	high
ENSG00000170144	HNRNPA3	high
ENSG00000170348	TMED10	high
ENSG00000170421	KRT8	high
ENSG00000170540	ARL6IP1	high
ENSG00000170759	KIF5B	high
ENSG00000170776	AKAP13	high
ENSG00000170860	LSM3	high
ENSG00000171105	INSR	high
ENSG00000171124	FUT3	high
ENSG00000171159	C9orf16	high
ENSG00000171222	SCAND1	high
ENSG00000171345	KRT19	high
ENSG00000171431	KRT20	high
ENSG00000171747	LGALS4	high
ENSG00000172183	ISG20	high
ENSG00000172531	PPP1CA	high
ENSG00000172590	MRPL52	high
ENSG00000173141	MRPL57	high
ENSG00000173230	GOLGB1	high
ENSG00000173334	TRIB1	high
ENSG00000173432	SAA1	high
ENSG00000173457	PPP1R14B	high
ENSG00000173660	UQCRH	high
ENSG00000173674	EIF1AX	high
ENSG00000173702	MUC13	high
ENSG00000173801	JUP	high
ENSG00000173821	RNF213	high
ENSG00000173905	GOLIM4	high
ENSG00000174236	REP15	high
ENSG00000174437	ATP2A2	high
ENSG00000174917	MICOS13	high
ENSG00000174953	DHX36	high
ENSG00000175029	CTBP2	high
ENSG00000175130	MARCKSL1	high
ENSG00000175197	DDIT3	high
ENSG00000175416	CLTB	high
ENSG00000175455	CCDC14	high
ENSG00000175756	AURKAIP1	high
ENSG00000176597	B3GNT5	high
ENSG00000176731	RBIS	high
ENSG00000176907	TCIM	high
ENSG00000177156	TALDO1	high
ENSG00000177200	CHD9	high
ENSG00000177600	RPLP2	high
ENSG00000177606	JUN	high
ENSG00000177697	CD151	high
ENSG00000178209	PLEC	high
ENSG00000178741	COX5A	high
ENSG00000178952	TUFM	high
ENSG00000178982	EIF3K	high
ENSG00000179051	RCC2	high
ENSG00000179085	DPM3	high
ENSG00000179091	CYC1	high
ENSG00000179218	CALR	high
ENSG00000179271	GADD45GIP1	high
ENSG00000179674	ARL14	high
ENSG00000179820	MYADM	high
ENSG00000179869	ABCA13	high
ENSG00000180573	H2AC6	high
ENSG00000180817	PPA1	high
ENSG00000180879	SSR4	high
ENSG00000181143	MUC16	high
ENSG00000181350	LRRC75A	high
ENSG00000181449	SOX2	high
ENSG00000181458	TMEM45A	high
ENSG00000181467	RAP2B	high
ENSG00000181649	PHLDA2	high
ENSG00000181885	CLDN7	high
ENSG00000182054	IDH2	high
ENSG00000182087	TMEM259	high
ENSG00000182196	ARL6IP4	high
ENSG00000182240	BACE2	high
ENSG00000182670	TTC3	high
ENSG00000182718	ANXA2	high
ENSG00000182774	RPS17	high
ENSG00000182827	ACBD3	high
ENSG00000182853	VMO1	high
ENSG00000182944	EWSR1	high
ENSG00000183011	NAA38	high
ENSG00000183255	PTTG1IP	high
ENSG00000183486	MX2	high
ENSG00000183648	NDUFB1	high
ENSG00000183742	MACC1	high
ENSG00000184007	PTP4A2	high
ENSG00000184254	ALDH1A3	high
ENSG00000184292	TACSTD2	high
ENSG00000184557	SOCS3	high
ENSG00000184840	TMED9	high
ENSG00000184983	NDUFA6	high
ENSG00000185022	MAFF	high
ENSG00000185043	CIB1	high
ENSG00000185499	MUC1	high
ENSG00000185624	P4HB	high
ENSG00000185651	UBE2L3	high
ENSG00000185825	BCAP31	high
ENSG00000185950	IRS2	high
ENSG00000186010	NDUFA13	high
ENSG00000186352	ANKRD37	high
ENSG00000186480	INSIG1	high
ENSG00000186834	HEXIM1	high
ENSG00000187257	RSBN1L	high
ENSG00000188175	HEPACAM2	high
ENSG00000188290	HES4	high
ENSG00000188612	SUMO2	high
ENSG00000188643	S100A16	high
ENSG00000188738	FSIP2	high
ENSG00000189060	H1-0	high
ENSG00000189067	LITAF	high
ENSG00000189143	CLDN4	high
ENSG00000189171	S100A13	high
ENSG00000189334	S100A14	high
ENSG00000189377	CXCL17	high
ENSG00000196141	SPATS2L	high
ENSG00000196154	S100A4	high
ENSG00000196199	MPHOSPH8	high
ENSG00000196352	CD55	high
ENSG00000196419	XRCC6	high
ENSG00000196504	PRPF40A	high
ENSG00000196628	TCF4	high
ENSG00000196754	S100A2	high
ENSG00000196878	LAMB3	high
ENSG00000196975	ANXA4	high
ENSG00000197102	DYNC1H1	high
ENSG00000197249	SERPINA1	high
ENSG00000197279	ZNF165	high
ENSG00000197446	CYP2F1	high
ENSG00000197448	GSTK1	high
ENSG00000197496	SLC2A10	high
ENSG00000197892	KIF13B	high
ENSG00000197912	SPG7	high
ENSG00000197912	LOC101930112	high
ENSG00000197956	S100A6	high
ENSG00000197969	VPS13A	high
ENSG00000197982	C1orf122	high
ENSG00000198034	RPS4X	high
ENSG00000198087	CD2AP	high
ENSG00000198258	UBL5	high
ENSG00000198355	PIM3	high
ENSG00000198363	ASPH	high
ENSG00000198380	GFPT1	high
ENSG00000198408	OGA	high
ENSG00000198435	NRARP	high
ENSG00000198561	CTNND1	high
ENSG00000198643	FAM3D	high
ENSG00000198695	ND6	high
ENSG00000198712	COX2	high
ENSG00000198719	DLL1	high
ENSG00000198727	CYTB	high
ENSG00000198763	ND2	high
ENSG00000198786	ND5	high
ENSG00000198788	MUC2	high
ENSG00000198804	COX1	high
ENSG00000198830	HMGN2	high
ENSG00000198840	ND3	high
ENSG00000198856	OSTC	high
ENSG00000198886	ND4	high
ENSG00000198888	ND1	high
ENSG00000198899	ATP6	high
ENSG00000198900	TOP1	high
ENSG00000198938	COX3	high
ENSG00000198959	TGM2	high
ENSG00000202198	RN7SK	high
ENSG00000204219	TCEA3	high
ENSG00000204256	BRD2	high
ENSG00000204287	HLA-DRA	high
ENSG00000204385	SLC44A4	high
ENSG00000204389	HSPA1A	high
ENSG00000204569	PPP1R10	high
ENSG00000205277	MUC12	high
ENSG00000206573	THUMPD3-AS1	high
ENSG00000210077	NA	high
ENSG00000210082	NA	high
ENSG00000210196	NA	high
ENSG00000211450	SELENOH	high
ENSG00000211459	NA	high
ENSG00000212907	ND4L	high
ENSG00000213639	PPP1CB	high
ENSG00000214026	MRPL23	high
ENSG00000214026	LOC107987373	high
ENSG00000214530	STARD10	high
ENSG00000214756	CSKMT	high
ENSG00000221978	CCNL2	high
ENSG00000225921	NOL7	high
ENSG00000225972	MTND1P23	high
ENSG00000228253	ATP8	high
ENSG00000229833	PET100	high
ENSG00000230202	NA	high
ENSG00000230989	HSBP1	high
ENSG00000231389	HLA-DPA1	high
ENSG00000231925	TAPBP	high
ENSG00000232388	SMIM26	high
ENSG00000233041	PHGR1	high
ENSG00000233493	TMEM238	high
ENSG00000234745	HLA-B	high
ENSG00000239305	RNF103	high
ENSG00000241468	ATP5MF	high
ENSG00000241837	ATP5PO	high
ENSG00000242247	ARFGAP3	high
ENSG00000242372	EIF6	high
ENSG00000242485	MRPL20	high
ENSG00000243955	GSTA1	high
ENSG00000244754	N4BP2L2	high
ENSG00000244879	NA	high
ENSG00000245532	NEAT1	high
ENSG00000250479	CHCHD10	high
ENSG00000255302	EID1	high
ENSG00000256612	CYP2B7P	high
ENSG00000257764	NA	high
ENSG00000261040	WFDC21P	high
ENSG00000261335	LOC105274304	high
ENSG00000263934	NA	high
ENSG00000266472	MRPS21	high
ENSG00000267519	NA	high
ENSG00000267795	SMIM22	high
ENSG00000268104	SLC6A14	high
ENSG00000269821	KCNQ1OT1	high
ENSG00000272009	NA	high
ENSG00000272398	CD24	high
ENSG00000272888	NA	high
ENSG00000273802	H2BC8	high
ENSG00000274012	RN7SL2	high
ENSG00000275183	LENG9	high
ENSG00000275395	FCGBP	high
ENSG00000276168	RN7SL1	high
ENSG00000278311	GGNBP2	high
ENSG00000280138	NA	high
ENSG00000000971	CFH	medium
ENSG00000005007	UPF1	medium
ENSG00000006459	KDM7A	medium
ENSG00000006831	ADIPOR2	medium
ENSG00000007062	PROM1	medium
ENSG00000007392	LUC7L	medium
ENSG00000008128	CDK11A	medium
ENSG00000010244	ZNF207	medium
ENSG00000011304	PTBP1	medium
ENSG00000012171	SEMA3B	medium
ENSG00000012223	LTF	medium
ENSG00000013441	CLK1	medium
ENSG00000028203	VEZT	medium
ENSG00000029363	BCLAF1	medium
ENSG00000030419	IKZF2	medium
ENSG00000035141	FAM136A	medium
ENSG00000037241	RPL26L1	medium
ENSG00000039650	PNKP	medium
ENSG00000042753	AP2S1	medium
ENSG00000047188	YTHDC2	medium
ENSG00000047346	FAM214A	medium
ENSG00000048405	ZNF800	medium
ENSG00000049239	H6PD	medium
ENSG00000049618	ARID1B	medium
ENSG00000050405	LIMA1	medium
ENSG00000053254	FOXN3	medium
ENSG00000061936	SFSWAP	medium
ENSG00000062194	GPBP1	medium
ENSG00000063245	EPN1	medium
ENSG00000063322	MED29	medium
ENSG00000064607	SUGP2	medium
ENSG00000065000	AP3D1	medium
ENSG00000065613	SLK	medium
ENSG00000066468	FGFR2	medium
ENSG00000067208	EVI5	medium
ENSG00000070159	PTPN3	medium
ENSG00000070366	SMG6	medium
ENSG00000070444	MNT	medium
ENSG00000072134	EPN2	medium
ENSG00000072849	DERL2	medium
ENSG00000073605	GSDMB	medium
ENSG00000073792	IGF2BP2	medium
ENSG00000074276	CDHR2	medium
ENSG00000074356	NCBP3	medium
ENSG00000074964	ARHGEF10L	medium
ENSG00000076604	TRAF4	medium
ENSG00000077150	NFKB2	medium
ENSG00000078177	N4BP2	medium
ENSG00000080608	PUM3	medium
ENSG00000080802	CNOT4	medium
ENSG00000080815	PSEN1	medium
ENSG00000083544	TDRD3	medium
ENSG00000083896	YTHDC1	medium
ENSG00000084636	COL16A1	medium
ENSG00000085733	CTTN	medium
ENSG00000087884	AAMDC	medium
ENSG00000089876	DHX32	medium
ENSG00000090013	BLVRB	medium
ENSG00000090020	SLC9A1	medium
ENSG00000090061	CCNK	medium
ENSG00000090316	MAEA	medium
ENSG00000090621	PABPC4	medium
ENSG00000090989	EXOC1	medium
ENSG00000092010	PSME1	medium
ENSG00000092068	SLC7A8	medium
ENSG00000092841	MYL6	medium
ENSG00000092978	GPATCH2	medium
ENSG00000093000	NUP50	medium
ENSG00000093010	COMT	medium
ENSG00000095139	ARCN1	medium
ENSG00000096080	MRPS18A	medium
ENSG00000096401	CDC5L	medium
ENSG00000099282	TSPAN15	medium
ENSG00000099338	CATSPERG	medium
ENSG00000099797	TECR	medium
ENSG00000099834	CDHR5	medium
ENSG00000099860	GADD45B	medium
ENSG00000099917	MED15	medium
ENSG00000100075	SLC25A1	medium
ENSG00000100345	MYH9	medium
ENSG00000100417	PMM1	medium
ENSG00000100425	BRD1	medium
ENSG00000100522	GNPNAT1	medium
ENSG00000100577	GSTZ1	medium
ENSG00000100911	PSME2	medium
ENSG00000101040	ZMYND8	medium
ENSG00000101076	HNF4A	medium
ENSG00000101191	DIDO1	medium
ENSG00000101654	RNMT	medium
ENSG00000101752	MIB1	medium
ENSG00000102144	PGK1	medium
ENSG00000102158	MAGT1	medium
ENSG00000102362	SYTL4	medium
ENSG00000102882	MAPK3	medium
ENSG00000103018	CYB5B	medium
ENSG00000103254	ANTKMT	medium
ENSG00000103429	BFAR	medium
ENSG00000103460	TOX3	medium
ENSG00000103550	KNOP1	medium
ENSG00000103811	CTSH	medium
ENSG00000104093	DMXL2	medium
ENSG00000104133	SPG11	medium
ENSG00000104522	GFUS	medium
ENSG00000104613	INTS10	medium
ENSG00000104852	SNRNP70	medium
ENSG00000104979	C19orf53	medium
ENSG00000105258	POLR2I	medium
ENSG00000105364	MRPL4	medium
ENSG00000105372	RPS19	medium
ENSG00000105443	CYTH2	medium
ENSG00000105699	LSR	medium
ENSG00000105855	ITGB8	medium
ENSG00000105953	OGDH	medium
ENSG00000106052	TAX1BP1	medium
ENSG00000106299	WASL	medium
ENSG00000107175	CREB3	medium
ENSG00000107745	MICU1	medium
ENSG00000108039	XPNPEP1	medium
ENSG00000108256	NUFIP2	medium
ENSG00000108551	RASD1	medium
ENSG00000108561	C1QBP	medium
ENSG00000108587	GOSR1	medium
ENSG00000108846	ABCC3	medium
ENSG00000109171	SLAIN2	medium
ENSG00000109390	NDUFC1	medium
ENSG00000110011	DNAJC4	medium
ENSG00000110048	OSBP	medium
ENSG00000110090	CPT1A	medium
ENSG00000110200	ANAPC15	medium
ENSG00000111011	RSRC2	medium
ENSG00000111237	VPS29	medium
ENSG00000111321	LTBR	medium
ENSG00000111640	GAPDH	medium
ENSG00000111707	SUDS3	medium
ENSG00000111802	TDP2	medium
ENSG00000112096	SOD2	medium
ENSG00000112144	CILK1	medium
ENSG00000112249	ASCC3	medium
ENSG00000112305	SMAP1	medium
ENSG00000112773	TENT5A	medium
ENSG00000113161	HMGCR	medium
ENSG00000113384	GOLPH3	medium
ENSG00000114127	XRN1	medium
ENSG00000114796	KLHL24	medium
ENSG00000114933	INO80D	medium
ENSG00000115109	EPB41L5	medium
ENSG00000115128	SF3B6	medium
ENSG00000115129	TP53I3	medium
ENSG00000115339	GALNT3	medium
ENSG00000115364	MRPL19	medium
ENSG00000115457	IGFBP2	medium
ENSG00000115520	COQ10B	medium
ENSG00000115677	HDLBP	medium
ENSG00000115808	STRN	medium
ENSG00000115875	SRSF7	medium
ENSG00000116176	TPSG1	medium
ENSG00000116478	HDAC1	medium
ENSG00000116580	GON4L	medium
ENSG00000116679	IVNS1ABP	medium
ENSG00000117318	ID3	medium
ENSG00000117362	APH1A	medium
ENSG00000117528	ABCD3	medium
ENSG00000118515	SGK1	medium
ENSG00000119013	NDUFB3	medium
ENSG00000119231	SENP5	medium
ENSG00000119705	SLIRP	medium
ENSG00000119844	AFTPH	medium
ENSG00000120675	DNAJC15	medium
ENSG00000120889	TNFRSF10B	medium
ENSG00000120948	TARDBP	medium
ENSG00000121057	AKAP1	medium
ENSG00000121067	SPOP	medium
ENSG00000122958	VPS26A	medium
ENSG00000123131	PRDX4	medium
ENSG00000123159	GIPC1	medium
ENSG00000123989	CHPF	medium
ENSG00000123992	DNPEP	medium
ENSG00000124198	ARFGEF2	medium
ENSG00000124253	PCK1	medium
ENSG00000124588	NQO2	medium
ENSG00000124664	SPDEF	medium
ENSG00000124782	RREB1	medium
ENSG00000125731	SH2D3A	medium
ENSG00000125826	RBCK1	medium
ENSG00000125877	ITPA	medium
ENSG00000125977	EIF2S2	medium
ENSG00000126214	KLC1	medium
ENSG00000126217	MCF2L	medium
ENSG00000126456	IRF3	medium
ENSG00000126522	ASL	medium
ENSG00000126822	PLEKHG3	medium
ENSG00000126945	HNRNPH2	medium
ENSG00000127054	INTS11	medium
ENSG00000127334	DYRK2	medium
ENSG00000127481	UBR4	medium
ENSG00000127616	SMARCA4	medium
ENSG00000128274	A4GALT	medium
ENSG00000128298	BAIAP2L2	medium
ENSG00000128463	EMC4	medium
ENSG00000128524	ATP6V1F	medium
ENSG00000128626	MRPS12	medium
ENSG00000129235	TXNDC17	medium
ENSG00000129518	EAPP	medium
ENSG00000129534	MIS18BP1	medium
ENSG00000130024	PHF10	medium
ENSG00000130038	CRACR2A	medium
ENSG00000130202	NECTIN2	medium
ENSG00000130589	HELZ2	medium
ENSG00000130762	ARHGEF16	medium
ENSG00000131469	RPL27	medium
ENSG00000131473	ACLY	medium
ENSG00000131626	PPFIA1	medium
ENSG00000132002	DNAJB1	medium
ENSG00000132024	CC2D1A	medium
ENSG00000132680	KHDC4	medium
ENSG00000132912	DCTN4	medium
ENSG00000133636	NTS	medium
ENSG00000133812	SBF2	medium
ENSG00000134265	NAPG	medium
ENSG00000134283	PPHLN1	medium
ENSG00000134308	YWHAQ	medium
ENSG00000134324	LPIN1	medium
ENSG00000134709	HOOK1	medium
ENSG00000134900	TPP2	medium
ENSG00000134910	STT3A	medium
ENSG00000135124	P2RX4	medium
ENSG00000135441	BLOC1S1	medium
ENSG00000135775	COG2	medium
ENSG00000135829	DHX9	medium
ENSG00000135930	EIF4E2	medium
ENSG00000135968	GCC2	medium
ENSG00000136237	RAPGEF5	medium
ENSG00000136450	SRSF1	medium
ENSG00000136522	MRPL47	medium
ENSG00000136536	MARCHF7	medium
ENSG00000136731	UGGT1	medium
ENSG00000136868	SLC31A1	medium
ENSG00000136874	STX17	medium
ENSG00000136986	DERL1	medium
ENSG00000137073	UBAP2	medium
ENSG00000137267	TUBB2A	medium
ENSG00000137331	IER3	medium
ENSG00000137642	SORL1	medium
ENSG00000137767	SQOR	medium
ENSG00000138398	PPIG	medium
ENSG00000138668	HNRNPD	medium
ENSG00000138709	LARP1B	medium
ENSG00000138777	PPA2	medium
ENSG00000139083	ETV6	medium
ENSG00000139146	SINHCAF	medium
ENSG00000139180	NDUFA9	medium
ENSG00000139343	SNRPF	medium
ENSG00000139372	TDG	medium
ENSG00000139428	MMAB	medium
ENSG00000139697	SBNO1	medium
ENSG00000139990	DCAF5	medium
ENSG00000140297	GCNT3	medium
ENSG00000140497	SCAMP2	medium
ENSG00000140575	IQGAP1	medium
ENSG00000140612	SEC11A	medium
ENSG00000140632	GLYR1	medium
ENSG00000140943	MBTPS1	medium
ENSG00000140983	RHOT2	medium
ENSG00000141503	MINK1	medium
ENSG00000141736	ERBB2	medium
ENSG00000141959	PFKL	medium
ENSG00000142208	AKT1	medium
ENSG00000142484	TM4SF5	medium
ENSG00000142687	KIAA0319L	medium
ENSG00000143013	LMO4	medium
ENSG00000143158	MPC2	medium
ENSG00000143217	NECTIN4	medium
ENSG00000143442	POGZ	medium
ENSG00000143549	TPM3	medium
ENSG00000144635	DYNC1LI1	medium
ENSG00000144749	LRIG1	medium
ENSG00000144867	SRPRB	medium
ENSG00000145730	PAM	medium
ENSG00000145780	FEM1C	medium
ENSG00000145817	YIPF5	medium
ENSG00000147459	DOCK5	medium
ENSG00000147654	EBAG9	medium
ENSG00000147813	NAPRT	medium
ENSG00000148180	GSN	medium
ENSG00000148341	SH3GLB2	medium
ENSG00000148498	PARD3	medium
ENSG00000148690	FRA10AC1	medium
ENSG00000149273	RPS3	medium
ENSG00000149761	NUDT22	medium
ENSG00000149823	VPS51	medium
ENSG00000150527	MIA2	medium
ENSG00000151135	TMEM263	medium
ENSG00000151292	CSNK1G3	medium
ENSG00000151461	UPF2	medium
ENSG00000151623	NR3C2	medium
ENSG00000151914	DST	medium
ENSG00000152894	PTPRK	medium
ENSG00000153037	SRP19	medium
ENSG00000153879	CEBPG	medium
ENSG00000153944	MSI2	medium
ENSG00000154144	TBRG1	medium
ENSG00000156413	FUT6	medium
ENSG00000156966	B3GNT7	medium
ENSG00000157181	ODR4	medium
ENSG00000157637	SLC38A10	medium
ENSG00000157954	WIPI2	medium
ENSG00000157992	KRTCAP3	medium
ENSG00000158528	PPP1R9A	medium
ENSG00000158545	ZC3H18	medium
ENSG00000158710	TAGLN2	medium
ENSG00000159314	ARHGAP27	medium
ENSG00000159842	ABR	medium
ENSG00000160058	BSDC1	medium
ENSG00000160783	PMF1	medium
ENSG00000160953	PWWP3A	medium
ENSG00000161267	BDH1	medium
ENSG00000161526	SAP30BP	medium
ENSG00000161547	SRSF2	medium
ENSG00000161970	RPL26	medium
ENSG00000162032	SPSB3	medium
ENSG00000162069	BICDL2	medium
ENSG00000162236	STX5	medium
ENSG00000162244	RPL29	medium
ENSG00000162390	ACOT11	medium
ENSG00000162604	TM2D1	medium
ENSG00000162664	ZNF326	medium
ENSG00000162695	SLC30A7	medium
ENSG00000162885	B3GALNT2	medium
ENSG00000162949	CAPN13	medium
ENSG00000163131	CTSS	medium
ENSG00000163362	INAVA	medium
ENSG00000163382	NAXE	medium
ENSG00000163812	ZDHHC3	medium
ENSG00000163902	RPN1	medium
ENSG00000163945	UVSSA	medium
ENSG00000164022	AIMP1	medium
ENSG00000164300	SERINC5	medium
ENSG00000164506	STXBP5	medium
ENSG00000164647	STEAP1	medium
ENSG00000164684	ZNF704	medium
ENSG00000164733	CTSB	medium
ENSG00000165238	WNK2	medium
ENSG00000165264	NDUFB6	medium
ENSG00000165322	ARHGAP12	medium
ENSG00000165392	WRN	medium
ENSG00000165516	KLHDC2	medium
ENSG00000165527	ARF6	medium
ENSG00000165806	CASP7	medium
ENSG00000165949	IFI27	medium
ENSG00000166170	BAG5	medium
ENSG00000166275	BORCS7	medium
ENSG00000166348	USP54	medium
ENSG00000166471	TMEM41B	medium
ENSG00000166710	B2M	medium
ENSG00000166747	AP1G1	medium
ENSG00000167110	GOLGA2	medium
ENSG00000167202	TBC1D2B	medium
ENSG00000167306	MYO5B	medium
ENSG00000167515	TRAPPC2L	medium
ENSG00000167741	GGT6	medium
ENSG00000167962	ZNF598	medium
ENSG00000167964	RAB26	medium
ENSG00000168002	POLR2G	medium
ENSG00000168066	SF1	medium
ENSG00000168275	COA6	medium
ENSG00000168710	AHCYL1	medium
ENSG00000168952	STXBP6	medium
ENSG00000169139	UBE2V2	medium
ENSG00000169230	PRELID1	medium
ENSG00000169715	MT1E	medium
ENSG00000169718	DUS1L	medium
ENSG00000170545	SMAGP	medium
ENSG00000170791	CHCHD7	medium
ENSG00000170889	RPS9	medium
ENSG00000171302	CANT1	medium
ENSG00000171475	WIPF2	medium
ENSG00000171634	BPTF	medium
ENSG00000171914	TLN2	medium
ENSG00000172053	QARS1	medium
ENSG00000172201	ID4	medium
ENSG00000172239	PAIP1	medium
ENSG00000172262	ZNF131	medium
ENSG00000172428	COPS9	medium
ENSG00000172500	FIBP	medium
ENSG00000172663	TMEM134	medium
ENSG00000172915	NBEA	medium
ENSG00000172939	OXSR1	medium
ENSG00000173039	RELA	medium
ENSG00000173153	ESRRA	medium
ENSG00000173327	MAP3K11	medium
ENSG00000173848	NET1	medium
ENSG00000174938	SEZ6L2	medium
ENSG00000175265	GOLGA8A	medium
ENSG00000175334	BANF1	medium
ENSG00000175348	TMEM9B	medium
ENSG00000175470	PPP2R2D	medium
ENSG00000175793	SFN	medium
ENSG00000175893	ZDHHC21	medium
ENSG00000176153	GPX2	medium
ENSG00000176261	ZBTB8OS	medium
ENSG00000176658	MYO1D	medium
ENSG00000176920	FUT2	medium
ENSG00000177106	EPS8L2	medium
ENSG00000177685	CRACR2B	medium
ENSG00000177853	ZNF518A	medium
ENSG00000177954	RPS27	medium
ENSG00000178078	STAP2	medium
ENSG00000178951	ZBTB7A	medium
ENSG00000179588	ZFPM1	medium
ENSG00000179889	PDXDC1	medium
ENSG00000180071	ANKRD18A	medium
ENSG00000180992	MRPL14	medium
ENSG00000181222	POLR2A	medium
ENSG00000181555	SETD2	medium
ENSG00000181704	YIPF6	medium
ENSG00000181789	COPG1	medium
ENSG00000182004	SNRPE	medium
ENSG00000182107	TMEM30B	medium
ENSG00000182149	IST1	medium
ENSG00000182197	EXT1	medium
ENSG00000182473	EXOC7	medium
ENSG00000183018	SPNS2	medium
ENSG00000183049	CAMK1D	medium
ENSG00000183576	SETD3	medium
ENSG00000183955	KMT5A	medium
ENSG00000184012	TMPRSS2	medium
ENSG00000184068	SREBF2-AS1	medium
ENSG00000184709	LRRC26	medium
ENSG00000185101	ANO9	medium
ENSG00000185104	FAF1	medium
ENSG00000185359	HGS	medium
ENSG00000186815	TPCN1	medium
ENSG00000188554	NBR1	medium
ENSG00000188647	PTAR1	medium
ENSG00000188811	NHLRC3	medium
ENSG00000188846	RPL14	medium
ENSG00000188959	C9orf152	medium
ENSG00000196187	TMEM63A	medium
ENSG00000196312	MFSD14C	medium
ENSG00000196712	NF1	medium
ENSG00000196792	STRN3	medium
ENSG00000197070	ARRDC1	medium
ENSG00000197323	TRIM33	medium
ENSG00000197324	LRP10	medium
ENSG00000197555	SIPA1L1	medium
ENSG00000197586	ENTPD6	medium
ENSG00000197712	FAM114A1	medium
ENSG00000197958	RPL12	medium
ENSG00000198183	BPIFA1	medium
ENSG00000198589	LRBA	medium
ENSG00000198648	STK39	medium
ENSG00000198707	CEP290	medium
ENSG00000203485	INF2	medium
ENSG00000204220	PFDN6	medium
ENSG00000204388	HSPA1B	medium
ENSG00000204463	BAG6	medium
ENSG00000204580	DDR1	medium
ENSG00000204619	PPP1R11	medium
ENSG00000204842	ATXN2	medium
ENSG00000204922	UQCC3	medium
ENSG00000204991	SPIRE2	medium
ENSG00000205730	ITPRIPL2	medium
ENSG00000213463	SYNJ2BP	medium
ENSG00000213523	SRA1	medium
ENSG00000213625	LEPROT	medium
ENSG00000213741	RPS29	medium
ENSG00000213853	EMP2	medium
ENSG00000213918	DNASE1	medium
ENSG00000213923	CSNK1E	medium
ENSG00000217128	FNIP1	medium
ENSG00000229719	NA	medium
ENSG00000230551	NA	medium
ENSG00000230937	MIR205HG	medium
ENSG00000233452	STXBP5-AS1	medium
ENSG00000234545	FAM133B	medium
ENSG00000236699	ARHGEF38	medium
ENSG00000238045	NA	medium
ENSG00000243147	MRPL33	medium
ENSG00000244187	TMEM141	medium
ENSG00000246705	H2AJ	medium
ENSG00000248333	CDK11B	medium
ENSG00000248771	SMIM31	medium
ENSG00000250317	SMIM20	medium
ENSG00000250722	SELENOP	medium
ENSG00000256338	RPL41P2	medium
ENSG00000257588	LOC101927318	medium
ENSG00000261183	SPINT1-AS1	medium
ENSG00000263001	GTF2I	medium
ENSG00000263639	MSMB	medium
ENSG00000266402	SNHG25	medium
ENSG00000272141	NA	medium
ENSG00000272333	KMT2B	medium
ENSG00000278053	DDX52	medium
