IdentityGene	GeneSymbol	Level
ENSG00000005483	KMT2E	high
ENSG00000044574	HSPA5	high
ENSG00000054118	THRAP3	high
ENSG00000067066	SP100	high
ENSG00000069275	NUCKS1	high
ENSG00000072818	ACAP1	high
ENSG00000077147	TM9SF3	high
ENSG00000080824	HSP90AA1	high
ENSG00000081154	PCNP	high
ENSG00000084207	GSTP1	high
ENSG00000086061	DNAJA1	high
ENSG00000087074	PPP1R15A	high
ENSG00000087302	RTRAF	high
ENSG00000088986	DYNLL1	high
ENSG00000089289	IGBP1	high
ENSG00000090104	RGS1	high
ENSG00000090273	NUDC	high
ENSG00000091527	CDV3	high
ENSG00000092199	HNRNPC	high
ENSG00000095794	CREM	high
ENSG00000096384	HSP90AB1	high
ENSG00000099860	GADD45B	high
ENSG00000100201	DDX17	high
ENSG00000100450	GZMH	high
ENSG00000100591	AHSA1	high
ENSG00000100664	EIF5	high
ENSG00000101882	NKAP	high
ENSG00000102760	RGCC	high
ENSG00000104388	RAB2A	high
ENSG00000104894	CD37	high
ENSG00000106211	HSPB1	high
ENSG00000107223	EDF1	high
ENSG00000108055	SMC3	high
ENSG00000109180	OCIAD1	high
ENSG00000109321	AREG	high
ENSG00000109332	UBE2D3	high
ENSG00000109971	HSPA8	high
ENSG00000110651	CD81	high
ENSG00000110852	CLEC2B	high
ENSG00000110958	PTGES3	high
ENSG00000111276	CDKN1B	high
ENSG00000111537	IFNG	high
ENSG00000111678	C12orf57	high
ENSG00000112297	CRYBG1	high
ENSG00000113558	SKP1	high
ENSG00000113811	SELENOK	high
ENSG00000115541	HSPE1	high
ENSG00000115875	SRSF7	high
ENSG00000116161	CACYBP	high
ENSG00000116288	PARK7	high
ENSG00000116741	RGS2	high
ENSG00000116752	BCAS2	high
ENSG00000117091	CD48	high
ENSG00000117450	PRDX1	high
ENSG00000117616	RSRP1	high
ENSG00000118816	CCNI	high
ENSG00000119335	SET	high
ENSG00000119801	YPEL5	high
ENSG00000120071	KANSL1	high
ENSG00000120129	DUSP1	high
ENSG00000120694	HSPH1	high
ENSG00000120738	EGR1	high
ENSG00000120875	DUSP4	high
ENSG00000120885	CLU	high
ENSG00000122218	COPA	high
ENSG00000122417	ODF2L	high
ENSG00000122566	HNRNPA2B1	high
ENSG00000123144	TRIR	high
ENSG00000123358	NR4A1	high
ENSG00000124795	DEK	high
ENSG00000125347	IRF1	high
ENSG00000125657	TNFSF9	high
ENSG00000125735	TNFSF14	high
ENSG00000125740	FOSB	high
ENSG00000125743	SNRPD2	high
ENSG00000126264	HCST	high
ENSG00000126267	COX6B1	high
ENSG00000127483	HP1BP3	high
ENSG00000127528	KLF2	high
ENSG00000127540	UQCR11	high
ENSG00000127824	TUBA4A	high
ENSG00000127914	AKAP9	high
ENSG00000128739	SNRPN	high
ENSG00000129292	PHF20L1	high
ENSG00000130811	EIF3G	high
ENSG00000130844	ZNF331	high
ENSG00000130921	C12orf65	high
ENSG00000131143	COX4I1	high
ENSG00000132002	DNAJB1	high
ENSG00000133321	PLAAT4	high
ENSG00000133574	GIMAP4	high
ENSG00000133706	LARS1	high
ENSG00000134202	GSTM3	high
ENSG00000134480	CCNH	high
ENSG00000134516	DOCK2	high
ENSG00000134884	ARGLU1	high
ENSG00000135046	ANXA1	high
ENSG00000135048	CEMIP2	high
ENSG00000135968	GCC2	high
ENSG00000136167	LCP1	high
ENSG00000136527	TRA2B	high
ENSG00000136888	ATP6V1G1	high
ENSG00000137210	TMEM14B	high
ENSG00000137331	IER3	high
ENSG00000137714	FDX1	high
ENSG00000138757	G3BP2	high
ENSG00000139278	GLIPR1	high
ENSG00000139644	TMBIM6	high
ENSG00000140030	GPR65	high
ENSG00000140403	DNAJA4	high
ENSG00000141232	TOB1	high
ENSG00000141682	PMAIP1	high
ENSG00000142168	SOD1	high
ENSG00000143575	HAX1	high
ENSG00000143878	RHOB	high
ENSG00000144381	HSPD1	high
ENSG00000144746	ARL6IP5	high
ENSG00000145220	LYAR	high
ENSG00000145494	NDUFS6	high
ENSG00000145675	PIK3R1	high
ENSG00000147065	MSN	high
ENSG00000147140	NONO	high
ENSG00000147443	DOK2	high
ENSG00000147684	NDUFB9	high
ENSG00000150991	UBC	high
ENSG00000151929	BAG3	high
ENSG00000153113	CAST	high
ENSG00000158050	DUSP2	high
ENSG00000159388	BTG2	high
ENSG00000160888	IER2	high
ENSG00000162772	ATF3	high
ENSG00000162783	IER5	high
ENSG00000163479	SSR2	high
ENSG00000163950	SLBP	high
ENSG00000164169	PRMT9	high
ENSG00000164442	CITED2	high
ENSG00000164691	TAGAP	high
ENSG00000164919	COX6C	high
ENSG00000165678	GHITM	high
ENSG00000166295	ANAPC16	high
ENSG00000166848	TERF2IP	high
ENSG00000166848	LOC105371348	high
ENSG00000167552	TUBA1A	high
ENSG00000167978	SRRM2	high
ENSG00000168439	STIP1	high
ENSG00000168653	NDUFS5	high
ENSG00000168685	IL7R	high
ENSG00000168906	MAT2A	high
ENSG00000169567	HINT1	high
ENSG00000169764	UGP2	high
ENSG00000170571	EMB	high
ENSG00000171223	JUNB	high
ENSG00000172115	CYCS	high
ENSG00000173110	HSPA6	high
ENSG00000173559	NABP1	high
ENSG00000173660	UQCRH	high
ENSG00000173726	TOMM20	high
ENSG00000174718	RESF1	high
ENSG00000174946	GPR171	high
ENSG00000175390	EIF3F	high
ENSG00000176731	RBIS	high
ENSG00000177606	JUN	high
ENSG00000178381	ZFAND2A	high
ENSG00000179010	MRFAP1	high
ENSG00000179144	GIMAP7	high
ENSG00000179820	MYADM	high
ENSG00000182154	MRPL41	high
ENSG00000184203	PPP1R2	high
ENSG00000184205	TSPYL2	high
ENSG00000184584	STING1	high
ENSG00000184897	H1-10	high
ENSG00000185088	RPS27L	high
ENSG00000185650	ZFP36L1	high
ENSG00000185787	MORF4L1	high
ENSG00000185811	IKZF1	high
ENSG00000187257	RSBN1L	high
ENSG00000188042	ARL4C	high
ENSG00000189043	NDUFA4	high
ENSG00000189241	TSPYL1	high
ENSG00000196199	MPHOSPH8	high
ENSG00000198258	UBL5	high
ENSG00000198830	HMGN2	high
ENSG00000204386	NEU1	high
ENSG00000204388	HSPA1B	high
ENSG00000204389	HSPA1A	high
ENSG00000205581	HMGN1	high
ENSG00000205937	RNPS1	high
ENSG00000206337	HCP5	high
ENSG00000225921	NOL7	high
ENSG00000228474	OST4	high
ENSG00000231721	LINC-PINT	high
ENSG00000232112	TMA7	high
ENSG00000232388	SMIM26	high
ENSG00000256039	NA	high
ENSG00000265241	RBM8A	high
ENSG00000266472	MRPS21	high
ENSG00000267519	NA	high
ENSG00000269893	SNHG8	high
ENSG00000004478	FKBP4	medium
ENSG00000006015	REX1BD	medium
ENSG00000007944	MYLIP	medium
ENSG00000013441	CLK1	medium
ENSG00000032219	ARID4A	medium
ENSG00000038219	BOD1L1	medium
ENSG00000046651	OFD1	medium
ENSG00000058272	PPP1R12A	medium
ENSG00000059728	MXD1	medium
ENSG00000059804	SLC2A3	medium
ENSG00000067900	ROCK1	medium
ENSG00000068697	LAPTM4A	medium
ENSG00000078589	P2RY10	medium
ENSG00000085662	AKR1B1	medium
ENSG00000089248	ERP29	medium
ENSG00000089327	FXYD5	medium
ENSG00000100316	RPL3	medium
ENSG00000100380	ST13	medium
ENSG00000100603	SNW1	medium
ENSG00000104131	EIF3J	medium
ENSG00000105372	RPS19	medium
ENSG00000107742	SPOCK2	medium
ENSG00000108256	NUFIP2	medium
ENSG00000109475	RPL34	medium
ENSG00000109929	SC5D	medium
ENSG00000111670	GNPTAB	medium
ENSG00000111832	RWDD1	medium
ENSG00000112110	MRPL18	medium
ENSG00000114850	SSR3	medium
ENSG00000115128	SF3B6	medium
ENSG00000115419	GLS	medium
ENSG00000115944	COX7A2L	medium
ENSG00000116209	TMEM59	medium
ENSG00000117602	RCAN3	medium
ENSG00000119048	UBE2B	medium
ENSG00000119541	VPS4B	medium
ENSG00000119632	IFI27L2	medium
ENSG00000121966	CXCR4	medium
ENSG00000122862	SRGN	medium
ENSG00000123416	TUBA1B	medium
ENSG00000124659	TBCC	medium
ENSG00000125384	PTGER2	medium
ENSG00000125835	SNRPB	medium
ENSG00000126698	DNAJC8	medium
ENSG00000133142	TCEAL4	medium
ENSG00000133639	BTG1	medium
ENSG00000134996	OSTF1	medium
ENSG00000135272	MDFIC	medium
ENSG00000136938	ANP32B	medium
ENSG00000138398	PPIG	medium
ENSG00000139343	SNRPF	medium
ENSG00000140988	RPS2	medium
ENSG00000143158	MPC2	medium
ENSG00000143443	C1orf56	medium
ENSG00000145247	OCIAD2	medium
ENSG00000145592	RPL37	medium
ENSG00000146285	SCML4	medium
ENSG00000147403	RPL10	medium
ENSG00000147669	POLR2K	medium
ENSG00000147677	EIF3H	medium
ENSG00000149257	SERPINH1	medium
ENSG00000149273	RPS3	medium
ENSG00000152558	TMEM123	medium
ENSG00000155307	SAMSN1	medium
ENSG00000155307	LOC388813	medium
ENSG00000160570	DEDD2	medium
ENSG00000160593	JAML	medium
ENSG00000160932	LY6E	medium
ENSG00000163682	RPL9	medium
ENSG00000163714	U2SURP	medium
ENSG00000165416	SUGT1	medium
ENSG00000167526	RPL13	medium
ENSG00000169926	KLF13	medium
ENSG00000170791	CHCHD7	medium
ENSG00000170889	RPS9	medium
ENSG00000171490	RSL1D1	medium
ENSG00000172809	RPL38	medium
ENSG00000175197	DDIT3	medium
ENSG00000180573	H2AC6	medium
ENSG00000180817	PPA1	medium
ENSG00000182670	TTC3	medium
ENSG00000182899	RPL35A	medium
ENSG00000184076	UQCR10	medium
ENSG00000185129	PURA	medium
ENSG00000185905	C16orf54	medium
ENSG00000188229	TUBB4B	medium
ENSG00000188994	ZNF292	medium
ENSG00000198168	SVIP	medium
ENSG00000198625	MDM4	medium
ENSG00000198721	ECI2	medium
ENSG00000204256	BRD2	medium
ENSG00000206503	HLA-A	medium
ENSG00000211689	TRGC1	medium
ENSG00000211689	TARP	medium
ENSG00000213949	ITGA1	medium
ENSG00000215845	TSTD1	medium
ENSG00000220205	VAMP2	medium
ENSG00000222041	CYTOR	medium
ENSG00000229117	RPL41	medium
ENSG00000248124	NA	medium
ENSG00000253738	OTUD6B-AS1	medium
ENSG00000265972	TXNIP	medium
ENSG00000268027	NA	medium
ENSG00000271503	CCL5	medium
ENSG00000272398	CD24	medium
