IdentityGene	GeneSymbol	Level
ENSG00000005059	MCUB	high
ENSG00000008988	RPS20	high
ENSG00000028137	TNFRSF1B	high
ENSG00000030419	IKZF2	high
ENSG00000057657	PRDM1	high
ENSG00000059804	SLC2A3	high
ENSG00000063046	EIF4B	high
ENSG00000067082	KLF6	high
ENSG00000067167	TRAM1	high
ENSG00000067560	RHOA	high
ENSG00000071082	RPL31	high
ENSG00000072818	ACAP1	high
ENSG00000075415	SLC25A3	high
ENSG00000076662	ICAM3	high
ENSG00000078596	ITM2A	high
ENSG00000086061	DNAJA1	high
ENSG00000089157	RPLP0	high
ENSG00000089248	ERP29	high
ENSG00000089280	FUS	high
ENSG00000092199	HNRNPC	high
ENSG00000099622	CIRBP	high
ENSG00000099624	ATP5F1D	high
ENSG00000100100	PIK3IP1	high
ENSG00000100201	DDX17	high
ENSG00000100316	RPL3	high
ENSG00000100380	ST13	high
ENSG00000100650	SRSF5	high
ENSG00000100664	EIF5	high
ENSG00000100906	NFKBIA	high
ENSG00000100941	PNN	high
ENSG00000101596	SMCHD1	high
ENSG00000102317	RBM3	high
ENSG00000102760	RGCC	high
ENSG00000104408	EIF3E	high
ENSG00000104660	LEPROTL1	high
ENSG00000104824	HNRNPL	high
ENSG00000105202	FBL	high
ENSG00000110700	RPS13	high
ENSG00000110848	CD69	high
ENSG00000110958	PTGES3	high
ENSG00000111716	LDHB	high
ENSG00000111897	SERINC1	high
ENSG00000112306	RPS12	high
ENSG00000112576	CCND3	high
ENSG00000114942	EEF1B2	high
ENSG00000115816	CEBPZ	high
ENSG00000116741	RGS2	high
ENSG00000117091	CD48	high
ENSG00000117602	RCAN3	high
ENSG00000118680	MYL12B	high
ENSG00000119801	YPEL5	high
ENSG00000120129	DUSP1	high
ENSG00000120690	ELF1	high
ENSG00000123349	PFDN5	high
ENSG00000125354	SEPTIN6	high
ENSG00000125652	ALKBH7	high
ENSG00000125691	RPL23	high
ENSG00000125740	FOSB	high
ENSG00000126267	COX6B1	high
ENSG00000126756	UXT	high
ENSG00000127152	BCL11B	high
ENSG00000127528	KLF2	high
ENSG00000127540	UQCR11	high
ENSG00000130592	LSP1	high
ENSG00000130844	ZNF331	high
ENSG00000131507	NDFIP1	high
ENSG00000132002	DNAJB1	high
ENSG00000132432	SEC61G	high
ENSG00000134352	IL6ST	high
ENSG00000135486	HNRNPA1	high
ENSG00000135655	USP15	high
ENSG00000135940	COX5B	high
ENSG00000136167	LCP1	high
ENSG00000137154	RPS6	high
ENSG00000138071	ACTR2	high
ENSG00000138795	LEF1	high
ENSG00000142534	RPS11	high
ENSG00000142541	RPL13A	high
ENSG00000143742	SRP9	high
ENSG00000143947	RPS27A	high
ENSG00000145425	RPS3A	high
ENSG00000145675	PIK3R1	high
ENSG00000147065	MSN	high
ENSG00000147604	RPL7	high
ENSG00000149212	SESN3	high
ENSG00000149273	RPS3	high
ENSG00000153234	NR4A2	high
ENSG00000156482	RPL30	high
ENSG00000157514	TSC22D3	high
ENSG00000158050	DUSP2	high
ENSG00000158710	TAGLN2	high
ENSG00000159388	BTG2	high
ENSG00000162191	UBXN1	high
ENSG00000162368	CMPK1	high
ENSG00000162511	LAPTM5	high
ENSG00000162894	FCMR	high
ENSG00000164442	CITED2	high
ENSG00000166441	RPL27A	high
ENSG00000166501	PRKCB	high
ENSG00000167286	CD3D	high
ENSG00000167468	GPX4	high
ENSG00000167552	TUBA1A	high
ENSG00000169564	PCBP1	high
ENSG00000169714	CNBP	high
ENSG00000170315	UBB	high
ENSG00000170345	FOS	high
ENSG00000170906	NDUFA3	high
ENSG00000171858	RPS21	high
ENSG00000172115	CYCS	high
ENSG00000172809	RPL38	high
ENSG00000173660	UQCRH	high
ENSG00000173726	TOMM20	high
ENSG00000174444	RPL4	high
ENSG00000174718	RESF1	high
ENSG00000177606	JUN	high
ENSG00000177733	HNRNPA0	high
ENSG00000180353	HCLS1	high
ENSG00000180879	SSR4	high
ENSG00000181163	NPM1	high
ENSG00000182774	RPS17	high
ENSG00000184897	H1-10	high
ENSG00000185115	NSMCE3	high
ENSG00000185811	IKZF1	high
ENSG00000185885	IFITM1	high
ENSG00000188404	SELL	high
ENSG00000189043	NDUFA4	high
ENSG00000196405	EVL	high
ENSG00000198242	RPL23A	high
ENSG00000198258	UBL5	high
ENSG00000198830	HMGN2	high
ENSG00000198851	CD3E	high
ENSG00000204388	HSPA1B	high
ENSG00000211592	IGKC	high
ENSG00000211677	IGLC2	high
ENSG00000211751	TRBC1	high
ENSG00000212907	ND4L	high
ENSG00000213402	PTPRCAP	high
ENSG00000213719	CLIC1	high
ENSG00000213741	RPS29	high
ENSG00000215301	DDX3X	high
ENSG00000224032	NA	high
ENSG00000225921	NOL7	high
ENSG00000228253	ATP8	high
ENSG00000231500	RPS18	high
ENSG00000234741	GAS5	high
ENSG00000241343	RPL36A	high
ENSG00000244754	N4BP2L2	high
ENSG00000244879	NA	high
ENSG00000247774	PCED1B-AS1	high
ENSG00000258289	CHURC1	high
ENSG00000269893	SNHG8	high
ENSG00000283041	LOC729998	high
ENSG00000008324	SS18L2	medium
ENSG00000083896	YTHDC1	medium
ENSG00000120802	TMPO	medium
ENSG00000122026	RPL21	medium
ENSG00000122862	SRGN	medium
ENSG00000132475	H3-3B	medium
ENSG00000139343	SNRPF	medium
ENSG00000144713	RPL32	medium
ENSG00000149806	FAU	medium
ENSG00000155903	RASA2	medium
ENSG00000158195	WASF2	medium
ENSG00000163682	RPL9	medium
ENSG00000167996	FTH1	medium
ENSG00000170515	PA2G4	medium
ENSG00000177954	RPS27	medium
ENSG00000184009	ACTG1	medium
ENSG00000186468	RPS23	medium
ENSG00000198034	RPS4X	medium
ENSG00000198727	CYTB	medium
ENSG00000198804	COX1	medium
ENSG00000198899	ATP6	medium
ENSG00000198918	RPL39	medium
ENSG00000204628	RACK1	medium
ENSG00000221983	UBA52	medium
ENSG00000233016	SNHG7	medium
