IdentityGene	GeneSymbol	Level
ENSG00000004799	PDK4	high
ENSG00000008018	PSMB1	high
ENSG00000008952	SEC62	high
ENSG00000010327	STAB1	high
ENSG00000018280	SLC11A1	high
ENSG00000019169	MARCO	high
ENSG00000019582	CD74	high
ENSG00000023191	RNH1	high
ENSG00000025708	TYMP	high
ENSG00000026297	RNASET2	high
ENSG00000027697	IFNGR1	high
ENSG00000028277	POU2F2	high
ENSG00000035862	TIMP2	high
ENSG00000038945	MSR1	high
ENSG00000042493	CAPG	high
ENSG00000051108	HERPUD1	high
ENSG00000057608	GDI2	high
ENSG00000062716	VMP1	high
ENSG00000066294	CD84	high
ENSG00000068697	LAPTM4A	high
ENSG00000075785	RAB7A	high
ENSG00000078369	GNB1	high
ENSG00000081189	MEF2C	high
ENSG00000082996	RNF13	high
ENSG00000084234	APLP2	high
ENSG00000085265	FCN1	high
ENSG00000087191	PSMC5	high
ENSG00000088832	FKBP1A	high
ENSG00000089280	FUS	high
ENSG00000089693	MLF2	high
ENSG00000090104	RGS1	high
ENSG00000092199	HNRNPC	high
ENSG00000100519	PSMC6	high
ENSG00000104870	FCGRT	high
ENSG00000105223	PLD3	high
ENSG00000105373	NOP53	high
ENSG00000106052	TAX1BP1	high
ENSG00000106803	SEC61B	high
ENSG00000109321	AREG	high
ENSG00000110079	MS4A4A	high
ENSG00000110651	CD81	high
ENSG00000110852	CLEC2B	high
ENSG00000111666	CHPT1	high
ENSG00000112308	C6orf62	high
ENSG00000115738	ID2	high
ENSG00000117091	CD48	high
ENSG00000117450	PRDX1	high
ENSG00000120708	TGFBI	high
ENSG00000124151	NCOA3	high
ENSG00000124831	LRRFIP1	high
ENSG00000125148	MT2A	high
ENSG00000126264	HCST	high
ENSG00000127022	CANX	high
ENSG00000127314	RAP1B	high
ENSG00000128245	YWHAH	high
ENSG00000128699	ORMDL1	high
ENSG00000129538	RNASE1	high
ENSG00000130203	APOE	high
ENSG00000130208	APOC1	high
ENSG00000130313	PGLS	high
ENSG00000131724	IL13RA1	high
ENSG00000132424	PNISR	high
ENSG00000132965	ALOX5AP	high
ENSG00000134825	TMEM258	high
ENSG00000134884	ARGLU1	high
ENSG00000136235	GPNMB	high
ENSG00000136888	ATP6V1G1	high
ENSG00000137491	SLCO2B1	high
ENSG00000139679	LPAR6	high
ENSG00000140612	SEC11A	high
ENSG00000141522	ARHGDIA	high
ENSG00000142227	EMP3	high
ENSG00000143119	CD53	high
ENSG00000143162	CREG1	high
ENSG00000143226	FCGR2A	high
ENSG00000144426	NBEAL1	high
ENSG00000146376	ARHGAP18	high
ENSG00000146386	ABRACL	high
ENSG00000148180	GSN	high
ENSG00000148908	RGS10	high
ENSG00000150782	IL18	high
ENSG00000151726	ACSL1	high
ENSG00000152082	MZT2B	high
ENSG00000153071	DAB2	high
ENSG00000153071	LOC112267931	high
ENSG00000153815	CMIP	high
ENSG00000155659	VSIG4	high
ENSG00000158864	NDUFS2	high
ENSG00000159189	C1QC	high
ENSG00000160014	CALM3	high
ENSG00000160255	ITGB2	high
ENSG00000163565	IFI16	high
ENSG00000164105	SAP30	high
ENSG00000164687	FABP5	high
ENSG00000166295	ANAPC16	high
ENSG00000166340	TPP1	high
ENSG00000166794	PPIB	high
ENSG00000166927	MS4A7	high
ENSG00000167468	GPX4	high
ENSG00000167642	SPINT2	high
ENSG00000168209	DDIT4	high
ENSG00000169045	HNRNPH1	high
ENSG00000169439	SDC2	high
ENSG00000169442	CD52	high
ENSG00000169976	SF3B5	high
ENSG00000170017	ALCAM	high
ENSG00000171659	GPR34	high
ENSG00000171860	C3AR1	high
ENSG00000172243	CLEC7A	high
ENSG00000172922	RNASEH2C	high
ENSG00000173369	C1QB	high
ENSG00000173372	C1QA	high
ENSG00000175445	LPL	high
ENSG00000178573	MAF	high
ENSG00000178695	KCTD12	high
ENSG00000180879	SSR4	high
ENSG00000181467	RAP2B	high
ENSG00000182117	NOP10	high
ENSG00000184557	SOCS3	high
ENSG00000184840	TMED9	high
ENSG00000185088	RPS27L	high
ENSG00000186395	KRT10	high
ENSG00000187051	RPS19BP1	high
ENSG00000187109	NAP1L1	high
ENSG00000187116	LILRA5	high
ENSG00000187474	FPR3	high
ENSG00000189067	LITAF	high
ENSG00000197249	SERPINA1	high
ENSG00000197629	MPEG1	high
ENSG00000197766	CFD	high
ENSG00000198951	NAGA	high
ENSG00000203747	FCGR3A	high
ENSG00000204054	NA	high
ENSG00000204136	GGTA1	high
ENSG00000204257	HLA-DMA	high
ENSG00000204389	HSPA1A	high
ENSG00000204592	HLA-E	high
ENSG00000205937	RNPS1	high
ENSG00000223865	HLA-DPB1	high
ENSG00000224397	PELATON	high
ENSG00000229807	XIST	high
ENSG00000231389	HLA-DPA1	high
ENSG00000234741	GAS5	high
ENSG00000241468	ATP5MF	high
ENSG00000241837	ATP5PO	high
ENSG00000242574	HLA-DMB	high
ENSG00000246705	H2AJ	high
ENSG00000247596	TWF2	high
ENSG00000250722	SELENOP	high
ENSG00000254087	LYN	high
ENSG00000254999	BRK1	high
ENSG00000260314	MRC1	high
ENSG00000261371	PECAM1	high
ENSG00000277443	MARCKS	high
ENSG00000277791	PSMB3	high
ENSG00000003056	M6PR	medium
ENSG00000010610	CD4	medium
ENSG00000011600	TYROBP	medium
ENSG00000070756	PABPC1	medium
ENSG00000099785	MARCHF2	medium
ENSG00000100097	LGALS1	medium
ENSG00000100600	LGMN	medium
ENSG00000104904	OAZ1	medium
ENSG00000104979	C19orf53	medium
ENSG00000108953	YWHAE	medium
ENSG00000111252	SH2B3	medium
ENSG00000123349	PFDN5	medium
ENSG00000125743	SNRPD2	medium
ENSG00000130255	RPL36	medium
ENSG00000133835	HSD17B4	medium
ENSG00000135363	LMO2	medium
ENSG00000138085	ATRAID	medium
ENSG00000138756	BMP2K	medium
ENSG00000140740	UQCRC2	medium
ENSG00000140988	RPS2	medium
ENSG00000143153	ATP1B1	medium
ENSG00000150540	HNMT	medium
ENSG00000154589	LY96	medium
ENSG00000158869	FCER1G	medium
ENSG00000163131	CTSS	medium
ENSG00000167613	LAIR1	medium
ENSG00000168484	SFTPC	medium
ENSG00000171858	RPS21	medium
ENSG00000175550	DRAP1	medium
ENSG00000177575	CD163	medium
ENSG00000189159	JPT1	medium
ENSG00000196154	S100A4	medium
ENSG00000196230	TUBB	medium
ENSG00000197747	S100A10	medium
ENSG00000197958	RPL12	medium
ENSG00000198886	ND4	medium
ENSG00000204482	LST1	medium
ENSG00000204628	RACK1	medium
ENSG00000206503	HLA-A	medium
ENSG00000214253	FIS1	medium
ENSG00000221869	CEBPD	medium
ENSG00000233927	RPS28	medium
ENSG00000240065	PSMB9	medium
ENSG00000245532	NEAT1	medium
ENSG00000251562	MALAT1	medium
