IdentityGene	GeneSymbol	Level
ENSG00000003436	TFPI	high
ENSG00000005022	SLC25A5	high
ENSG00000008018	PSMB1	high
ENSG00000008282	SYPL1	high
ENSG00000013583	HEBP1	high
ENSG00000014641	MDH1	high
ENSG00000017427	IGF1	high
ENSG00000023191	RNH1	high
ENSG00000023734	STRAP	high
ENSG00000034713	GABARAPL2	high
ENSG00000035862	TIMP2	high
ENSG00000049860	HEXB	high
ENSG00000050165	DKK3	high
ENSG00000051128	HOMER3	high
ENSG00000051523	CYBA	high
ENSG00000054267	ARID4B	high
ENSG00000060138	YBX3	high
ENSG00000062716	VMP1	high
ENSG00000063177	RPL18	high
ENSG00000065154	OAT	high
ENSG00000065809	FAM107B	high
ENSG00000065978	YBX1	high
ENSG00000067113	PLPP1	high
ENSG00000067560	RHOA	high
ENSG00000067704	IARS2	high
ENSG00000067829	IDH3G	high
ENSG00000069667	RORA	high
ENSG00000074071	MRPS34	high
ENSG00000074319	TSG101	high
ENSG00000075213	SEMA3A	high
ENSG00000075790	BCAP29	high
ENSG00000075790	DUS4L-BCAP29	high
ENSG00000076043	REXO2	high
ENSG00000077549	CAPZB	high
ENSG00000080822	CLDND1	high
ENSG00000082153	BZW1	high
ENSG00000082996	RNF13	high
ENSG00000084234	APLP2	high
ENSG00000085871	MGST2	high
ENSG00000086065	CHMP5	high
ENSG00000087460	GNAS	high
ENSG00000088986	DYNLL1	high
ENSG00000089220	PEBP1	high
ENSG00000089280	FUS	high
ENSG00000090060	PAPOLA	high
ENSG00000091879	ANGPT2	high
ENSG00000092203	TOX4	high
ENSG00000096746	HNRNPH3	high
ENSG00000099246	RAB18	high
ENSG00000099385	BCL7C	high
ENSG00000099624	ATP5F1D	high
ENSG00000099860	GADD45B	high
ENSG00000100138	SNU13	high
ENSG00000100219	XBP1	high
ENSG00000100243	CYB5R3	high
ENSG00000100380	ST13	high
ENSG00000100612	DHRS7	high
ENSG00000100650	SRSF5	high
ENSG00000100664	EIF5	high
ENSG00000100711	ZFYVE21	high
ENSG00000100941	PNN	high
ENSG00000101160	CTSZ	high
ENSG00000101558	VAPA	high
ENSG00000103024	NME3	high
ENSG00000103502	CDIPT	high
ENSG00000103544	VPS35L	high
ENSG00000103769	RAB11A	high
ENSG00000103811	CTSH	high
ENSG00000103978	TMEM87A	high
ENSG00000104205	SGK3	high
ENSG00000104408	EIF3E	high
ENSG00000104432	IL7	high
ENSG00000104522	GFUS	high
ENSG00000104695	PPP2CB	high
ENSG00000104823	ECH1	high
ENSG00000104870	FCGRT	high
ENSG00000105254	TBCB	high
ENSG00000105329	TGFB1	high
ENSG00000105379	ETFB	high
ENSG00000105404	RABAC1	high
ENSG00000105443	CYTH2	high
ENSG00000106153	CHCHD2	high
ENSG00000106245	BUD31	high
ENSG00000107798	LIPA	high
ENSG00000108106	UBE2S	high
ENSG00000108298	RPL19	high
ENSG00000108561	C1QBP	high
ENSG00000108691	CCL2	high
ENSG00000108826	MRPL27	high
ENSG00000108946	PRKAR1A	high
ENSG00000109501	WFS1	high
ENSG00000109736	MFSD10	high
ENSG00000110841	PPFIBP1	high
ENSG00000110852	CLEC2B	high
ENSG00000110955	ATP5F1B	high
ENSG00000110958	PTGES3	high
ENSG00000111011	RSRC2	high
ENSG00000111145	ELK3	high
ENSG00000111229	ARPC3	high
ENSG00000111275	ALDH2	high
ENSG00000111678	C12orf57	high
ENSG00000111832	RWDD1	high
ENSG00000111843	TMEM14C	high
ENSG00000112769	LAMA4	high
ENSG00000113083	LOX	high
ENSG00000113732	ATP6V0E1	high
ENSG00000114446	IFT57	high
ENSG00000114698	PLSCR4	high
ENSG00000114861	FOXP1	high
ENSG00000114956	DGUOK	high
ENSG00000115286	NDUFS7	high
ENSG00000115756	HPCAL1	high
ENSG00000115758	ODC1	high
ENSG00000115875	SRSF7	high
ENSG00000116030	SUMO1	high
ENSG00000116209	TMEM59	high
ENSG00000116586	LAMTOR2	high
ENSG00000117362	APH1A	high
ENSG00000117519	CNN3	high
ENSG00000117592	PRDX6	high
ENSG00000117707	PROX1	high
ENSG00000117984	CTSD	high
ENSG00000119650	IFT43	high
ENSG00000120306	CYSTM1	high
ENSG00000120533	ENY2	high
ENSG00000120690	ELF1	high
ENSG00000121067	SPOP	high
ENSG00000121749	TBC1D15	high
ENSG00000122378	PRXL2A	high
ENSG00000122644	ARL4A	high
ENSG00000122705	CLTA	high
ENSG00000123144	TRIR	high
ENSG00000123240	OPTN	high
ENSG00000123349	PFDN5	high
ENSG00000124172	ATP5F1E	high
ENSG00000124614	RPS10	high
ENSG00000124767	GLO1	high
ENSG00000124785	NRN1	high
ENSG00000124795	DEK	high
ENSG00000125266	EFNB2	high
ENSG00000125347	IRF1	high
ENSG00000125656	CLPP	high
ENSG00000125740	FOSB	high
ENSG00000125743	SNRPD2	high
ENSG00000125835	SNRPB	high
ENSG00000125971	DYNLRB1	high
ENSG00000126267	COX6B1	high
ENSG00000126785	RHOJ	high
ENSG00000127022	CANX	high
ENSG00000127314	RAP1B	high
ENSG00000127511	SIN3B	high
ENSG00000127528	KLF2	high
ENSG00000127838	PNKD	high
ENSG00000127914	AKAP9	high
ENSG00000127920	GNG11	high
ENSG00000127922	SEM1	high
ENSG00000128463	EMC4	high
ENSG00000128534	LSM8	high
ENSG00000128739	SNRPN	high
ENSG00000128951	DUT	high
ENSG00000128989	ARPP19	high
ENSG00000129559	NEDD8	high
ENSG00000129562	DAD1	high
ENSG00000130158	DOCK6	high
ENSG00000130414	NDUFA10	high
ENSG00000130429	ARPC1B	high
ENSG00000130522	JUND	high
ENSG00000130724	CHMP2A	high
ENSG00000130725	UBE2M	high
ENSG00000130755	GMFG	high
ENSG00000130811	EIF3G	high
ENSG00000131016	AKAP12	high
ENSG00000131143	COX4I1	high
ENSG00000131174	COX7B	high
ENSG00000132334	PTPRE	high
ENSG00000132475	H3-3B	high
ENSG00000132661	NXT1	high
ENSG00000133574	GIMAP4	high
ENSG00000133636	NTS	high
ENSG00000133800	LYVE1	high
ENSG00000133872	SARAF	high
ENSG00000134072	CAMK1	high
ENSG00000134248	LAMTOR5	high
ENSG00000134308	YWHAQ	high
ENSG00000134825	TMEM258	high
ENSG00000135363	LMO2	high
ENSG00000135404	CD63	high
ENSG00000135486	HNRNPA1	high
ENSG00000135720	DYNC1LI2	high
ENSG00000136160	EDNRB	high
ENSG00000136238	RAC1	high
ENSG00000136261	BZW2	high
ENSG00000136826	KLF4	high
ENSG00000136888	ATP6V1G1	high
ENSG00000136997	MYC	high
ENSG00000137077	CCL21	high
ENSG00000137100	DCTN3	high
ENSG00000137331	IER3	high
ENSG00000137409	MTCH1	high
ENSG00000137726	FXYD6	high
ENSG00000137962	ARHGAP29	high
ENSG00000138382	METTL5	high
ENSG00000138398	PPIG	high
ENSG00000138768	USO1	high
ENSG00000139168	ZCRB1	high
ENSG00000139289	PHLDA1	high
ENSG00000139318	DUSP6	high
ENSG00000139644	TMBIM6	high
ENSG00000140022	STON2	high
ENSG00000140307	GTF2A2	high
ENSG00000140612	SEC11A	high
ENSG00000140990	NDUFB10	high
ENSG00000141504	SAT2	high
ENSG00000141505	ASGR1	high
ENSG00000141543	EIF4A3	high
ENSG00000142168	SOD1	high
ENSG00000142694	EVA1B	high
ENSG00000143222	UFC1	high
ENSG00000143545	RAB13	high
ENSG00000143819	EPHX1	high
ENSG00000144426	NBEAL1	high
ENSG00000144677	CTDSPL	high
ENSG00000145012	LPP	high
ENSG00000145741	BTF3	high
ENSG00000146021	KLHL3	high
ENSG00000147403	RPL10	high
ENSG00000147649	MTDH	high
ENSG00000147677	EIF3H	high
ENSG00000147862	NFIB	high
ENSG00000148303	RPL7A	high
ENSG00000148671	ADIRF	high
ENSG00000148700	ADD3	high
ENSG00000148834	GSTO1	high
ENSG00000149131	SERPING1	high
ENSG00000150054	MPP7	high
ENSG00000150347	ARID5B	high
ENSG00000150459	SAP18	high
ENSG00000150687	PRSS23	high
ENSG00000150753	CCT5	high
ENSG00000150787	PTS	high
ENSG00000152082	MZT2B	high
ENSG00000152558	TMEM123	high
ENSG00000152804	HHEX	high
ENSG00000154330	PGM5	high
ENSG00000154589	LY96	high
ENSG00000155366	RHOC	high
ENSG00000155368	DBI	high
ENSG00000155957	TMBIM4	high
ENSG00000156411	ATP5MPL	high
ENSG00000156482	RPL30	high
ENSG00000156508	EEF1A1	high
ENSG00000156976	EIF4A2	high
ENSG00000157216	SSBP3	high
ENSG00000157510	AFAP1L1	high
ENSG00000159388	BTG2	high
ENSG00000160180	TFF3	high
ENSG00000160213	CSTB	high
ENSG00000160679	CHTOP	high
ENSG00000160948	VPS28	high
ENSG00000161016	RPL8	high
ENSG00000161203	AP2M1	high
ENSG00000161547	SRSF2	high
ENSG00000162191	UBXN1	high
ENSG00000162244	RPL29	high
ENSG00000162493	PDPN	high
ENSG00000162511	LAPTM5	high
ENSG00000162783	IER5	high
ENSG00000163463	KRTCAP2	high
ENSG00000163468	CCT3	high
ENSG00000163512	AZI2	high
ENSG00000163541	SUCLG1	high
ENSG00000163660	CCNL1	high
ENSG00000163762	TM4SF18	high
ENSG00000163956	LRPAP1	high
ENSG00000164105	SAP30	high
ENSG00000164346	NSA2	high
ENSG00000164442	CITED2	high
ENSG00000164687	FABP5	high
ENSG00000164713	BRI3	high
ENSG00000164924	YWHAZ	high
ENSG00000165775	FUNDC2	high
ENSG00000165929	TC2N	high
ENSG00000166136	NDUFB8	high
ENSG00000166228	PCBD1	high
ENSG00000166257	SCN3B	high
ENSG00000166295	ANAPC16	high
ENSG00000166482	MFAP4	high
ENSG00000166557	TMED3	high
ENSG00000166710	B2M	high
ENSG00000166741	NNMT	high
ENSG00000166794	PPIB	high
ENSG00000166946	CCNDBP1	high
ENSG00000167460	TPM4	high
ENSG00000167468	GPX4	high
ENSG00000167515	TRAPPC2L	high
ENSG00000167792	NDUFV1	high
ENSG00000167978	SRRM2	high
ENSG00000167994	RAB3IL1	high
ENSG00000167996	FTH1	high
ENSG00000168002	POLR2G	high
ENSG00000168028	RPSA	high
ENSG00000168291	PDHB	high
ENSG00000168385	SEPTIN2	high
ENSG00000168447	SCNN1B	high
ENSG00000168497	CAVIN2	high
ENSG00000168522	FNTA	high
ENSG00000168610	STAT3	high
ENSG00000168653	NDUFS5	high
ENSG00000168807	SNTB2	high
ENSG00000168894	RNF181	high
ENSG00000168952	STXBP6	high
ENSG00000169230	PRELID1	high
ENSG00000169756	LIMS1	high
ENSG00000170144	HNRNPA3	high
ENSG00000170323	FABP4	high
ENSG00000170345	FOS	high
ENSG00000170889	RPS9	high
ENSG00000171204	TMEM126B	high
ENSG00000171223	JUNB	high
ENSG00000172500	FIBP	high
ENSG00000173660	UQCRH	high
ENSG00000173674	EIF1AX	high
ENSG00000173812	EIF1	high
ENSG00000173915	ATP5MD	high
ENSG00000174917	MICOS13	high
ENSG00000175130	MARCKSL1	high
ENSG00000175155	YPEL2	high
ENSG00000175390	EIF3F	high
ENSG00000175550	DRAP1	high
ENSG00000175745	NR2F1	high
ENSG00000176046	NUPR1	high
ENSG00000176101	SSNA1	high
ENSG00000176209	SMIM19	high
ENSG00000177469	CAVIN1	high
ENSG00000177674	AGTRAP	high
ENSG00000177868	SVBP	high
ENSG00000178057	NDUFAF3	high
ENSG00000178695	KCTD12	high
ENSG00000178878	APOLD1	high
ENSG00000178980	SELENOW	high
ENSG00000178982	EIF3K	high
ENSG00000179144	GIMAP7	high
ENSG00000179632	MAF1	high
ENSG00000179820	MYADM	high
ENSG00000179958	DCTPP1	high
ENSG00000182087	TMEM259	high
ENSG00000182118	FAM89A	high
ENSG00000182253	SYNM	high
ENSG00000182463	TSHZ2	high
ENSG00000182885	ADGRG3	high
ENSG00000183578	TNFAIP8L3	high
ENSG00000183726	TMEM50A	high
ENSG00000184113	CLDN5	high
ENSG00000184203	PPP1R2	high
ENSG00000184349	EFNA5	high
ENSG00000184752	NDUFA12	high
ENSG00000185022	MAFF	high
ENSG00000185088	RPS27L	high
ENSG00000185187	SIGIRR	high
ENSG00000185825	BCAP31	high
ENSG00000186395	KRT10	high
ENSG00000186994	KANK3	high
ENSG00000188229	TUBB4B	high
ENSG00000188243	COMMD6	high
ENSG00000188290	HES4	high
ENSG00000188483	IER5L	high
ENSG00000188783	PRELP	high
ENSG00000189056	RELN	high
ENSG00000189058	APOD	high
ENSG00000196531	NACA	high
ENSG00000196655	TRAPPC4	high
ENSG00000196776	CD47	high
ENSG00000196975	ANXA4	high
ENSG00000197019	SERTAD1	high
ENSG00000197111	PCBP2	high
ENSG00000197261	C6orf141	high
ENSG00000197746	PSAP	high
ENSG00000197747	S100A10	high
ENSG00000198034	RPS4X	high
ENSG00000198355	PIM3	high
ENSG00000198832	SELENOM	high
ENSG00000198835	GJC2	high
ENSG00000198843	SELENOT	high
ENSG00000198888	ND1	high
ENSG00000204381	LAYN	high
ENSG00000204389	HSPA1A	high
ENSG00000204592	HLA-E	high
ENSG00000204628	RACK1	high
ENSG00000205403	CFI	high
ENSG00000205502	C2CD4B	high
ENSG00000206503	HLA-A	high
ENSG00000211450	SELENOH	high
ENSG00000213203	GIMAP1	high
ENSG00000213465	ARL2	high
ENSG00000213619	NDUFS3	high
ENSG00000213625	LEPROT	high
ENSG00000213719	CLIC1	high
ENSG00000214063	TSPAN4	high
ENSG00000214456	PLIN5	high
ENSG00000215301	DDX3X	high
ENSG00000222041	CYTOR	high
ENSG00000225921	NOL7	high
ENSG00000228474	OST4	high
ENSG00000231721	LINC-PINT	high
ENSG00000232112	TMA7	high
ENSG00000233016	SNHG7	high
ENSG00000234741	GAS5	high
ENSG00000235505	CASP4LP	high
ENSG00000237550	RPL9P8	high
ENSG00000239697	TNFSF12	high
ENSG00000241553	ARPC4	high
ENSG00000241685	ARPC1A	high
ENSG00000241837	ATP5PO	high
ENSG00000248527	MTATP6P1	high
ENSG00000249751	ECSCR	high
ENSG00000263155	MYZAP	high
ENSG00000269893	SNHG8	high
ENSG00000005020	SKAP2	medium
ENSG00000006015	REX1BD	medium
ENSG00000007944	MYLIP	medium
ENSG00000023318	ERP44	medium
ENSG00000083845	RPS5	medium
ENSG00000087086	FTL	medium
ENSG00000087884	AAMDC	medium
ENSG00000088205	DDX18	medium
ENSG00000090238	YPEL3	medium
ENSG00000092841	MYL6	medium
ENSG00000100129	EIF3L	medium
ENSG00000100567	PSMA3	medium
ENSG00000101460	MAP1LC3A	medium
ENSG00000102967	DHODH	medium
ENSG00000103152	MPG	medium
ENSG00000104714	ERICH1	medium
ENSG00000105755	ETHE1	medium
ENSG00000105856	HBP1	medium
ENSG00000108424	KPNB1	medium
ENSG00000109220	CHIC2	medium
ENSG00000113163	CERT1	medium
ENSG00000114416	FXR1	medium
ENSG00000115355	CCDC88A	medium
ENSG00000116350	SRSF4	medium
ENSG00000116539	ASH1L	medium
ENSG00000120992	LYPLA1	medium
ENSG00000121900	TMEM54	medium
ENSG00000122873	CISD1	medium
ENSG00000124214	STAU1	medium
ENSG00000126934	MAP2K2	medium
ENSG00000129521	EGLN3	medium
ENSG00000130741	EIF2S3	medium
ENSG00000131495	NDUFA2	medium
ENSG00000133398	MED10	medium
ENSG00000134419	RPS15A	medium
ENSG00000135441	BLOC1S1	medium
ENSG00000135968	GCC2	medium
ENSG00000136942	RPL35	medium
ENSG00000140264	SERF2	medium
ENSG00000142534	RPS11	medium
ENSG00000143499	SMYD2	medium
ENSG00000143575	HAX1	medium
ENSG00000143947	RPS27A	medium
ENSG00000145050	MANF	medium
ENSG00000145495	MARCHF6	medium
ENSG00000145592	RPL37	medium
ENSG00000146457	WTAP	medium
ENSG00000147123	NDUFB11	medium
ENSG00000155962	CLIC2	medium
ENSG00000159884	CCDC107	medium
ENSG00000160271	RALGDS	medium
ENSG00000163297	ANTXR2	medium
ENSG00000163682	RPL9	medium
ENSG00000164548	TRA2A	medium
ENSG00000165476	REEP3	medium
ENSG00000166033	HTRA1	medium
ENSG00000166275	BORCS7	medium
ENSG00000166326	TRIM44	medium
ENSG00000166595	CIAO2B	medium
ENSG00000168003	SLC3A2	medium
ENSG00000168394	TAP1	medium
ENSG00000168994	PXDC1	medium
ENSG00000169908	TM4SF1	medium
ENSG00000171863	RPS7	medium
ENSG00000172809	RPL38	medium
ENSG00000172922	RNASEH2C	medium
ENSG00000177363	LRRN4CL	medium
ENSG00000177426	TGIF1	medium
ENSG00000182004	SNRPE	medium
ENSG00000182718	ANXA2	medium
ENSG00000184009	ACTG1	medium
ENSG00000184640	SEPTIN9	medium
ENSG00000186298	PPP1CC	medium
ENSG00000186468	RPS23	medium
ENSG00000196428	TSC22D2	medium
ENSG00000196937	FAM3C	medium
ENSG00000198171	DDRGK1	medium
ENSG00000198242	RPL23A	medium
ENSG00000198763	ND2	medium
ENSG00000205189	ZBTB10	medium
ENSG00000220205	VAMP2	medium
ENSG00000221869	CEBPD	medium
ENSG00000224032	NA	medium
ENSG00000234745	HLA-B	medium
ENSG00000250479	CHCHD10	medium
ENSG00000256537	SMIM10L1	medium
