IdentityGene	GeneSymbol	Level
ENSG00000003436	TFPI	high
ENSG00000004455	AK2	high
ENSG00000004799	PDK4	high
ENSG00000008294	SPAG9	high
ENSG00000008517	IL32	high
ENSG00000010278	CD9	high
ENSG00000013306	SLC25A39	high
ENSG00000019582	CD74	high
ENSG00000022267	FHL1	high
ENSG00000022840	RNF10	high
ENSG00000030582	GRN	high
ENSG00000036473	OTC	high
ENSG00000042493	CAPG	high
ENSG00000044574	HSPA5	high
ENSG00000049860	HEXB	high
ENSG00000050165	DKK3	high
ENSG00000058262	SEC61A1	high
ENSG00000064692	SNCAIP	high
ENSG00000064989	CALCRL	high
ENSG00000066056	TIE1	high
ENSG00000067066	SP100	high
ENSG00000067113	PLPP1	high
ENSG00000067167	TRAM1	high
ENSG00000067560	RHOA	high
ENSG00000069329	VPS35	high
ENSG00000070831	CDC42	high
ENSG00000072110	ACTN1	high
ENSG00000072163	LIMS2	high
ENSG00000074842	MYDGF	high
ENSG00000075790	BCAP29	high
ENSG00000075790	DUS4L-BCAP29	high
ENSG00000078401	EDN1	high
ENSG00000081041	CXCL2	high
ENSG00000082996	RNF13	high
ENSG00000084234	APLP2	high
ENSG00000084733	RAB10	high
ENSG00000088387	DOCK9	high
ENSG00000089157	RPLP0	high
ENSG00000089737	DDX24	high
ENSG00000091527	CDV3	high
ENSG00000092010	PSME1	high
ENSG00000099204	ABLIM1	high
ENSG00000099817	POLR2E	high
ENSG00000099860	GADD45B	high
ENSG00000099864	PALM	high
ENSG00000099875	MKNK2	high
ENSG00000100138	SNU13	high
ENSG00000100201	DDX17	high
ENSG00000100219	XBP1	high
ENSG00000100225	FBXO7	high
ENSG00000100243	CYB5R3	high
ENSG00000100266	PACSIN2	high
ENSG00000100300	TSPO	high
ENSG00000100345	MYH9	high
ENSG00000100528	CNIH1	high
ENSG00000100568	VTI1B	high
ENSG00000100612	DHRS7	high
ENSG00000100650	SRSF5	high
ENSG00000100711	ZFYVE21	high
ENSG00000100979	PLTP	high
ENSG00000101160	CTSZ	high
ENSG00000101782	RIOK3	high
ENSG00000101955	SRPX	high
ENSG00000102010	BMX	high
ENSG00000103769	RAB11A	high
ENSG00000103811	CTSH	high
ENSG00000104067	TJP1	high
ENSG00000104332	SFRP1	high
ENSG00000104368	PLAT	high
ENSG00000104695	PPP2CB	high
ENSG00000104805	NUCB1	high
ENSG00000104979	C19orf53	high
ENSG00000105185	PDCD5	high
ENSG00000105223	PLD3	high
ENSG00000105254	TBCB	high
ENSG00000105329	TGFB1	high
ENSG00000105568	PPP2R1A	high
ENSG00000106538	RARRES2	high
ENSG00000106991	ENG	high
ENSG00000107438	PDLIM1	high
ENSG00000108518	PFN1	high
ENSG00000108691	CCL2	high
ENSG00000110092	CCND1	high
ENSG00000110328	GALNT18	high
ENSG00000110799	VWF	high
ENSG00000110955	ATP5F1B	high
ENSG00000111145	ELK3	high
ENSG00000111229	ARPC3	high
ENSG00000111328	CDK2AP1	high
ENSG00000111341	MGP	high
ENSG00000111669	TPI1	high
ENSG00000111678	C12orf57	high
ENSG00000111775	COX6A1	high
ENSG00000111832	RWDD1	high
ENSG00000111843	TMEM14C	high
ENSG00000111859	NEDD9	high
ENSG00000111897	SERINC1	high
ENSG00000112769	LAMA4	high
ENSG00000112936	C7	high
ENSG00000114698	PLSCR4	high
ENSG00000115380	EFEMP1	high
ENSG00000115461	IGFBP5	high
ENSG00000115464	USP34	high
ENSG00000115524	SF3B1	high
ENSG00000115875	SRSF7	high
ENSG00000116459	ATP5PB	high
ENSG00000116586	LAMTOR2	high
ENSG00000116649	SRM	high
ENSG00000116711	PLA2G4A	high
ENSG00000117318	ID3	high
ENSG00000117362	APH1A	high
ENSG00000117450	PRDX1	high
ENSG00000117519	CNN3	high
ENSG00000117707	PROX1	high
ENSG00000117984	CTSD	high
ENSG00000118217	ATF6	high
ENSG00000119318	RAD23B	high
ENSG00000119421	NDUFA8	high
ENSG00000119655	NPC2	high
ENSG00000120129	DUSP1	high
ENSG00000120306	CYSTM1	high
ENSG00000120318	ARAP3	high
ENSG00000120727	PAIP2	high
ENSG00000122176	FMOD	high
ENSG00000122359	ANXA11	high
ENSG00000122679	RAMP3	high
ENSG00000122862	SRGN	high
ENSG00000123144	TRIR	high
ENSG00000124422	USP22	high
ENSG00000124440	HIF3A	high
ENSG00000124614	RPS10	high
ENSG00000124783	SSR1	high
ENSG00000124942	AHNAK	high
ENSG00000125037	EMC3	high
ENSG00000125148	MT2A	high
ENSG00000125266	EFNB2	high
ENSG00000125356	NDUFA1	high
ENSG00000125743	SNRPD2	high
ENSG00000125968	ID1	high
ENSG00000125977	EIF2S2	high
ENSG00000125995	ROMO1	high
ENSG00000126247	CAPNS1	high
ENSG00000126267	COX6B1	high
ENSG00000126756	UXT	high
ENSG00000127022	CANX	high
ENSG00000127540	UQCR11	high
ENSG00000127914	AKAP9	high
ENSG00000127922	SEM1	high
ENSG00000128052	KDR	high
ENSG00000128463	EMC4	high
ENSG00000128534	LSM8	high
ENSG00000128567	PODXL	high
ENSG00000128951	DUT	high
ENSG00000129235	TXNDC17	high
ENSG00000129559	NEDD8	high
ENSG00000130158	DOCK6	high
ENSG00000130402	ACTN4	high
ENSG00000130511	SSBP4	high
ENSG00000130724	CHMP2A	high
ENSG00000130725	UBE2M	high
ENSG00000130755	GMFG	high
ENSG00000130811	EIF3G	high
ENSG00000131016	AKAP12	high
ENSG00000131051	RBM39	high
ENSG00000131174	COX7B	high
ENSG00000131477	RAMP2	high
ENSG00000131748	STARD3	high
ENSG00000131871	SELENOS	high
ENSG00000132334	PTPRE	high
ENSG00000132507	EIF5A	high
ENSG00000133226	SRRM1	high
ENSG00000133574	GIMAP4	high
ENSG00000133636	NTS	high
ENSG00000133800	LYVE1	high
ENSG00000134825	TMEM258	high
ENSG00000134954	ETS1	high
ENSG00000135363	LMO2	high
ENSG00000136160	EDNRB	high
ENSG00000136213	CHST12	high
ENSG00000136819	C9orf78	high
ENSG00000136826	KLF4	high
ENSG00000136842	TMOD1	high
ENSG00000136997	MYC	high
ENSG00000137033	IL33	high
ENSG00000137077	CCL21	high
ENSG00000137100	DCTN3	high
ENSG00000137288	UQCC2	high
ENSG00000137312	FLOT1	high
ENSG00000137331	IER3	high
ENSG00000137409	MTCH1	high
ENSG00000137710	RDX	high
ENSG00000137962	ARHGAP29	high
ENSG00000138166	DUSP5	high
ENSG00000138495	COX17	high
ENSG00000138594	TMOD3	high
ENSG00000138594	LOC112268148	high
ENSG00000138668	HNRNPD	high
ENSG00000139083	ETV6	high
ENSG00000139168	ZCRB1	high
ENSG00000139218	SCAF11	high
ENSG00000139613	SMARCC2	high
ENSG00000140105	WARS1	high
ENSG00000140307	GTF2A2	high
ENSG00000141279	NPEPPS	high
ENSG00000141522	ARHGDIA	high
ENSG00000141753	IGFBP4	high
ENSG00000142089	IFITM3	high
ENSG00000142694	EVA1B	high
ENSG00000142871	CCN1	high
ENSG00000142910	TINAGL1	high
ENSG00000143761	ARF1	high
ENSG00000143819	EPHX1	high
ENSG00000143870	PDIA6	high
ENSG00000143878	RHOB	high
ENSG00000144224	UBXN4	high
ENSG00000144369	FAM171B	high
ENSG00000144476	ACKR3	high
ENSG00000144802	NFKBIZ	high
ENSG00000145431	PDGFC	high
ENSG00000145494	NDUFS6	high
ENSG00000146416	AIG1	high
ENSG00000147649	MTDH	high
ENSG00000148671	ADIRF	high
ENSG00000149131	SERPING1	high
ENSG00000150593	PDCD4	high
ENSG00000150687	PRSS23	high
ENSG00000150779	TIMM8B	high
ENSG00000150938	CRIM1	high
ENSG00000152104	PTPN14	high
ENSG00000152558	TMEM123	high
ENSG00000153317	ASAP1	high
ENSG00000154133	ROBO4	high
ENSG00000154553	PDLIM3	high
ENSG00000155090	KLF10	high
ENSG00000156411	ATP5MPL	high
ENSG00000158195	WASF2	high
ENSG00000158710	TAGLN2	high
ENSG00000158716	DUSP23	high
ENSG00000159403	C1R	high
ENSG00000160180	TFF3	high
ENSG00000160752	FDPS	high
ENSG00000161203	AP2M1	high
ENSG00000162433	AK4	high
ENSG00000162511	LAPTM5	high
ENSG00000162734	PEA15	high
ENSG00000163453	IGFBP7	high
ENSG00000163463	KRTCAP2	high
ENSG00000163634	THOC7	high
ENSG00000163762	TM4SF18	high
ENSG00000163815	CLEC3B	high
ENSG00000164096	C4orf3	high
ENSG00000164116	GUCY1A1	high
ENSG00000164405	UQCRQ	high
ENSG00000164687	FABP5	high
ENSG00000165280	VCP	high
ENSG00000165507	DEPP1	high
ENSG00000165672	PRDX3	high
ENSG00000165929	TC2N	high
ENSG00000166228	PCBD1	high
ENSG00000166292	TMEM100	high
ENSG00000166295	ANAPC16	high
ENSG00000166337	TAF10	high
ENSG00000166598	HSP90B1	high
ENSG00000166681	BEX3	high
ENSG00000166794	PPIB	high
ENSG00000166946	CCNDBP1	high
ENSG00000167004	PDIA3	high
ENSG00000167468	GPX4	high
ENSG00000167770	OTUB1	high
ENSG00000167772	ANGPTL4	high
ENSG00000167792	NDUFV1	high
ENSG00000167978	SRRM2	high
ENSG00000168002	POLR2G	high
ENSG00000168066	SF1	high
ENSG00000168209	DDIT4	high
ENSG00000168439	STIP1	high
ENSG00000168477	TNXB	high
ENSG00000168522	FNTA	high
ENSG00000168610	STAT3	high
ENSG00000168653	NDUFS5	high
ENSG00000168894	RNF181	high
ENSG00000168899	VAMP5	high
ENSG00000169020	ATP5ME	high
ENSG00000169564	PCBP1	high
ENSG00000169689	CENPX	high
ENSG00000169764	UGP2	high
ENSG00000169919	GUSB	high
ENSG00000170275	CRTAP	high
ENSG00000170296	GABARAP	high
ENSG00000170323	FABP4	high
ENSG00000170345	FOS	high
ENSG00000170989	S1PR1	high
ENSG00000171115	GIMAP8	high
ENSG00000172354	GNB2	high
ENSG00000172380	GNG12	high
ENSG00000172889	EGFL7	high
ENSG00000173113	TRMT112	high
ENSG00000173267	SNCG	high
ENSG00000173598	NUDT4	high
ENSG00000173915	ATP5MD	high
ENSG00000174021	GNG5	high
ENSG00000175130	MARCKSL1	high
ENSG00000175550	DRAP1	high
ENSG00000175745	NR2F1	high
ENSG00000175756	AURKAIP1	high
ENSG00000176046	NUPR1	high
ENSG00000176485	PLAAT3	high
ENSG00000176692	FOXC2	high
ENSG00000177469	CAVIN1	high
ENSG00000177666	PNPLA2	high
ENSG00000177674	AGTRAP	high
ENSG00000177700	POLR2L	high
ENSG00000177885	GRB2	high
ENSG00000177889	UBE2N	high
ENSG00000178449	COX14	high
ENSG00000178695	KCTD12	high
ENSG00000178726	THBD	high
ENSG00000178741	COX5A	high
ENSG00000178878	APOLD1	high
ENSG00000179144	GIMAP7	high
ENSG00000179218	CALR	high
ENSG00000179262	RAD23A	high
ENSG00000179632	MAF1	high
ENSG00000180398	MCFD2	high
ENSG00000182087	TMEM259	high
ENSG00000182108	DEXI	high
ENSG00000182240	BACE2	high
ENSG00000182774	RPS17	high
ENSG00000182809	CRIP2	high
ENSG00000183087	GAS6	high
ENSG00000183617	MRPL54	high
ENSG00000183722	LHFPL6	high
ENSG00000184076	UQCR10	high
ENSG00000184113	CLDN5	high
ENSG00000184752	NDUFA12	high
ENSG00000184983	NDUFA6	high
ENSG00000185070	FLRT2	high
ENSG00000185088	RPS27L	high
ENSG00000185112	FAM43A	high
ENSG00000185187	SIGIRR	high
ENSG00000185624	P4HB	high
ENSG00000185825	BCAP31	high
ENSG00000186994	KANK3	high
ENSG00000187134	AKR1C1	high
ENSG00000187193	MT1X	high
ENSG00000188186	LAMTOR4	high
ENSG00000188229	TUBB4B	high
ENSG00000188243	COMMD6	high
ENSG00000188313	PLSCR1	high
ENSG00000188559	RALGAPA2	high
ENSG00000188783	PRELP	high
ENSG00000189058	APOD	high
ENSG00000189129	PLAC9	high
ENSG00000196196	HRCT1	high
ENSG00000196230	TUBB	high
ENSG00000196562	SULF2	high
ENSG00000196776	CD47	high
ENSG00000196924	FLNA	high
ENSG00000196975	ANXA4	high
ENSG00000197061	H4C3	high
ENSG00000197170	PSMD12	high
ENSG00000197448	GSTK1	high
ENSG00000198355	PIM3	high
ENSG00000198492	YTHDF2	high
ENSG00000198695	ND6	high
ENSG00000198832	SELENOM	high
ENSG00000198843	SELENOT	high
ENSG00000198959	TGM2	high
ENSG00000203883	SOX18	high
ENSG00000204103	MAFB	high
ENSG00000205038	PKHD1L1	high
ENSG00000205581	HMGN1	high
ENSG00000211450	SELENOH	high
ENSG00000211653	IGLV1-40	high
ENSG00000211677	IGLC2	high
ENSG00000212907	ND4L	high
ENSG00000213625	LEPROT	high
ENSG00000213719	CLIC1	high
ENSG00000214063	TSPAN4	high
ENSG00000228253	ATP8	high
ENSG00000235505	CASP4LP	high
ENSG00000239264	TXNDC5	high
ENSG00000240972	MIF	high
ENSG00000241468	ATP5MF	high
ENSG00000243449	C4orf48	high
ENSG00000243678	NME2	high
ENSG00000244879	NA	high
ENSG00000249751	ECSCR	high
ENSG00000260314	MRC1	high
ENSG00000261371	PECAM1	high
ENSG00000273149	NA	high
ENSG00000004399	PLXND1	medium
ENSG00000005020	SKAP2	medium
ENSG00000007080	CCDC124	medium
ENSG00000023318	ERP44	medium
ENSG00000027697	IFNGR1	medium
ENSG00000071127	WDR1	medium
ENSG00000073849	ST6GAL1	medium
ENSG00000076356	PLXNA2	medium
ENSG00000083845	RPS5	medium
ENSG00000087086	FTL	medium
ENSG00000087274	ADD1	medium
ENSG00000088205	DDX18	medium
ENSG00000090238	YPEL3	medium
ENSG00000092841	MYL6	medium
ENSG00000095370	SH2D3C	medium
ENSG00000100567	PSMA3	medium
ENSG00000100767	PAPLN	medium
ENSG00000101224	CDC25B	medium
ENSG00000102580	DNAJC3	medium
ENSG00000102893	PHKB	medium
ENSG00000103152	MPG	medium
ENSG00000104714	ERICH1	medium
ENSG00000108424	KPNB1	medium
ENSG00000109220	CHIC2	medium
ENSG00000113594	LIFR	medium
ENSG00000114416	FXR1	medium
ENSG00000114867	EIF4G1	medium
ENSG00000115977	AAK1	medium
ENSG00000116539	ASH1L	medium
ENSG00000121749	TBC1D15	medium
ENSG00000122873	CISD1	medium
ENSG00000124172	ATP5F1E	medium
ENSG00000124214	STAU1	medium
ENSG00000126934	MAP2K2	medium
ENSG00000128274	A4GALT	medium
ENSG00000131495	NDUFA2	medium
ENSG00000133398	MED10	medium
ENSG00000133703	KRAS	medium
ENSG00000134419	RPS15A	medium
ENSG00000136485	DCAF7	medium
ENSG00000136628	EPRS1	medium
ENSG00000136942	RPL35	medium
ENSG00000139684	ESD	medium
ENSG00000140264	SERF2	medium
ENSG00000140416	TPM1	medium
ENSG00000142534	RPS11	medium
ENSG00000142676	RPL11	medium
ENSG00000143947	RPS27A	medium
ENSG00000145050	MANF	medium
ENSG00000145592	RPL37	medium
ENSG00000146731	CCT6A	medium
ENSG00000147123	NDUFB11	medium
ENSG00000147684	NDUFB9	medium
ENSG00000152804	HHEX	medium
ENSG00000154529	CNTNAP3B	medium
ENSG00000160271	RALGDS	medium
ENSG00000163430	FSTL1	medium
ENSG00000163682	RPL9	medium
ENSG00000163902	RPN1	medium
ENSG00000164190	NIPBL	medium
ENSG00000165476	REEP3	medium
ENSG00000166275	BORCS7	medium
ENSG00000166326	TRIM44	medium
ENSG00000166503	HDGFL3	medium
ENSG00000166562	SEC11C	medium
ENSG00000166595	CIAO2B	medium
ENSG00000168298	H1-4	medium
ENSG00000168994	PXDC1	medium
ENSG00000169504	CLIC4	medium
ENSG00000169908	TM4SF1	medium
ENSG00000171863	RPS7	medium
ENSG00000171992	SYNPO	medium
ENSG00000172239	PAIP1	medium
ENSG00000172809	RPL38	medium
ENSG00000172922	RNASEH2C	medium
ENSG00000173269	MMRN2	medium
ENSG00000174917	MICOS13	medium
ENSG00000182004	SNRPE	medium
ENSG00000182718	ANXA2	medium
ENSG00000184009	ACTG1	medium
ENSG00000184432	COPB2	medium
ENSG00000184743	ATL3	medium
ENSG00000185627	PSMD13	medium
ENSG00000186468	RPS23	medium
ENSG00000187837	H1-2	medium
ENSG00000196531	NACA	medium
ENSG00000198171	DDRGK1	medium
ENSG00000198242	RPL23A	medium
ENSG00000198763	ND2	medium
ENSG00000203667	COX20	medium
ENSG00000204569	PPP1R10	medium
ENSG00000211445	GPX3	medium
ENSG00000211666	IGLV2-14	medium
ENSG00000211896	IGHG1	medium
ENSG00000211897	IGHG3	medium
ENSG00000213064	SFT2D2	medium
ENSG00000213585	VDAC1	medium
ENSG00000221869	CEBPD	medium
ENSG00000234745	HLA-B	medium
ENSG00000234961	NA	medium
ENSG00000240342	RPS2P5	medium
ENSG00000250479	CHCHD10	medium
ENSG00000272636	DOC2B	medium
