IdentityGene	GeneSymbol	Level
ENSG00000003056	M6PR	high
ENSG00000003402	CFLAR	high
ENSG00000005483	KMT2E	high
ENSG00000005844	ITGAL	high
ENSG00000007168	PAFAH1B1	high
ENSG00000009954	BAZ1B	high
ENSG00000010810	FYN	high
ENSG00000019582	CD74	high
ENSG00000020633	RUNX3	high
ENSG00000023287	RB1CC1	high
ENSG00000023445	BIRC3	high
ENSG00000044574	HSPA5	high
ENSG00000051108	HERPUD1	high
ENSG00000051523	CYBA	high
ENSG00000054118	THRAP3	high
ENSG00000054267	ARID4B	high
ENSG00000055163	CYFIP2	high
ENSG00000057657	PRDM1	high
ENSG00000063046	EIF4B	high
ENSG00000065883	CDK13	high
ENSG00000067066	SP100	high
ENSG00000067560	RHOA	high
ENSG00000069275	NUCKS1	high
ENSG00000069493	CLEC2D	high
ENSG00000069667	RORA	high
ENSG00000069702	TGFBR3	high
ENSG00000070831	CDC42	high
ENSG00000072818	ACAP1	high
ENSG00000075415	SLC25A3	high
ENSG00000077984	CST7	high
ENSG00000078304	PPP2R5C	high
ENSG00000078618	NRDC	high
ENSG00000082074	FYB1	high
ENSG00000085224	ATRX	high
ENSG00000087302	RTRAF	high
ENSG00000089327	FXYD5	high
ENSG00000090238	YPEL3	high
ENSG00000090863	GLG1	high
ENSG00000092010	PSME1	high
ENSG00000095794	CREM	high
ENSG00000096060	FKBP5	high
ENSG00000099622	CIRBP	high
ENSG00000099795	NDUFB7	high
ENSG00000100100	PIK3IP1	high
ENSG00000100201	DDX17	high
ENSG00000100354	TNRC6B	high
ENSG00000100450	GZMH	high
ENSG00000100650	SRSF5	high
ENSG00000100664	EIF5	high
ENSG00000100906	NFKBIA	high
ENSG00000100941	PNN	high
ENSG00000101109	STK4	high
ENSG00000101182	PSMA7	high
ENSG00000101596	SMCHD1	high
ENSG00000102317	RBM3	high
ENSG00000102879	CORO1A	high
ENSG00000103266	STUB1	high
ENSG00000103275	UBE2I	high
ENSG00000103363	ELOB	high
ENSG00000103657	HERC1	high
ENSG00000104894	CD37	high
ENSG00000104964	TLE5	high
ENSG00000105254	TBCB	high
ENSG00000106803	SEC61B	high
ENSG00000106948	AKNA	high
ENSG00000107223	EDF1	high
ENSG00000108055	SMC3	high
ENSG00000109180	OCIAD1	high
ENSG00000109321	AREG	high
ENSG00000109332	UBE2D3	high
ENSG00000109390	NDUFC1	high
ENSG00000109689	STIM2	high
ENSG00000109787	KLF3	high
ENSG00000110367	DDX6	high
ENSG00000110651	CD81	high
ENSG00000110852	CLEC2B	high
ENSG00000110934	BIN2	high
ENSG00000111229	ARPC3	high
ENSG00000111276	CDKN1B	high
ENSG00000111371	SLC38A1	high
ENSG00000111678	C12orf57	high
ENSG00000111913	RIPOR2	high
ENSG00000112079	STK38	high
ENSG00000112081	SRSF3	high
ENSG00000112576	CCND3	high
ENSG00000112695	COX7A2	high
ENSG00000112701	SENP6	high
ENSG00000113282	CLINT1	high
ENSG00000113387	SUB1	high
ENSG00000113558	SKP1	high
ENSG00000113811	SELENOK	high
ENSG00000113851	CRBN	high
ENSG00000114353	GNAI2	high
ENSG00000114857	NKTR	high
ENSG00000114861	FOXP1	high
ENSG00000115053	NCL	high
ENSG00000115085	ZAP70	high
ENSG00000115232	ITGA4	high
ENSG00000115524	SF3B1	high
ENSG00000115935	WIPF1	high
ENSG00000115977	AAK1	high
ENSG00000116044	NFE2L2	high
ENSG00000116350	SRSF4	high
ENSG00000116560	SFPQ	high
ENSG00000116754	SRSF11	high
ENSG00000117091	CD48	high
ENSG00000117280	RAB29	high
ENSG00000117614	SYF2	high
ENSG00000117616	RSRP1	high
ENSG00000118503	TNFAIP3	high
ENSG00000119314	PTBP3	high
ENSG00000119335	SET	high
ENSG00000119397	CNTRL	high
ENSG00000120071	KANSL1	high
ENSG00000120690	ELF1	high
ENSG00000122545	SEPTIN7	high
ENSG00000122566	HNRNPA2B1	high
ENSG00000123144	TRIR	high
ENSG00000123416	TUBA1B	high
ENSG00000124575	H1-3	high
ENSG00000124795	DEK	high
ENSG00000124831	LRRFIP1	high
ENSG00000124942	AHNAK	high
ENSG00000125347	IRF1	high
ENSG00000125743	SNRPD2	high
ENSG00000126264	HCST	high
ENSG00000126267	COX6B1	high
ENSG00000127314	RAP1B	high
ENSG00000127483	HP1BP3	high
ENSG00000127528	KLF2	high
ENSG00000127540	UQCR11	high
ENSG00000127603	MACF1	high
ENSG00000127824	TUBA4A	high
ENSG00000127914	AKAP9	high
ENSG00000128340	RAC2	high
ENSG00000128609	NDUFA5	high
ENSG00000129518	EAPP	high
ENSG00000129968	ABHD17A	high
ENSG00000130592	LSP1	high
ENSG00000130770	ATP5IF1	high
ENSG00000130811	EIF3G	high
ENSG00000131018	SYNE1	high
ENSG00000131051	RBM39	high
ENSG00000131143	COX4I1	high
ENSG00000131236	CAP1	high
ENSG00000132002	DNAJB1	high
ENSG00000132334	PTPRE	high
ENSG00000133321	PLAAT4	high
ENSG00000134186	PRPF38B	high
ENSG00000134884	ARGLU1	high
ENSG00000134954	ETS1	high
ENSG00000135048	CEMIP2	high
ENSG00000135968	GCC2	high
ENSG00000136250	AOAH	high
ENSG00000136490	LIMD2	high
ENSG00000136888	ATP6V1G1	high
ENSG00000137441	FGFBP2	high
ENSG00000138767	CNOT6L	high
ENSG00000139278	GLIPR1	high
ENSG00000139644	TMBIM6	high
ENSG00000140030	GPR65	high
ENSG00000140264	SERF2	high
ENSG00000140319	SRP14	high
ENSG00000140612	SEC11A	high
ENSG00000141027	NCOR1	high
ENSG00000141232	TOB1	high
ENSG00000141524	TMC6	high
ENSG00000142168	SOD1	high
ENSG00000142227	EMP3	high
ENSG00000142634	EFHD2	high
ENSG00000143384	MCL1	high
ENSG00000143774	GUK1	high
ENSG00000144674	GOLGA4	high
ENSG00000144746	ARL6IP5	high
ENSG00000144802	NFKBIZ	high
ENSG00000145220	LYAR	high
ENSG00000145287	PLAC8	high
ENSG00000145675	PIK3R1	high
ENSG00000145703	IQGAP2	high
ENSG00000145833	DDX46	high
ENSG00000147065	MSN	high
ENSG00000147684	NDUFB9	high
ENSG00000149311	ATM	high
ENSG00000150093	ITGB1	high
ENSG00000150867	PIP4K2A	high
ENSG00000152082	MZT2B	high
ENSG00000153113	CAST	high
ENSG00000153234	NR4A2	high
ENSG00000153563	CD8A	high
ENSG00000158050	DUSP2	high
ENSG00000158985	CDC42SE2	high
ENSG00000159140	SON	high
ENSG00000160255	ITGB2	high
ENSG00000160654	CD3G	high
ENSG00000161203	AP2M1	high
ENSG00000162434	JAK1	high
ENSG00000162704	ARPC5	high
ENSG00000162909	CAPN2	high
ENSG00000162924	REL	high
ENSG00000163466	ARPC2	high
ENSG00000163479	SSR2	high
ENSG00000163565	IFI16	high
ENSG00000163788	SNRK	high
ENSG00000164919	COX6C	high
ENSG00000164924	YWHAZ	high
ENSG00000165119	HNRNPK	high
ENSG00000165527	ARF6	high
ENSG00000165678	GHITM	high
ENSG00000166233	ARIH1	high
ENSG00000166295	ANAPC16	high
ENSG00000166750	SLFN5	high
ENSG00000166794	PPIB	high
ENSG00000166848	TERF2IP	high
ENSG00000166848	LOC105371348	high
ENSG00000166913	YWHAB	high
ENSG00000167522	ANKRD11	high
ENSG00000167863	ATP5PD	high
ENSG00000167978	SRRM2	high
ENSG00000168066	SF1	high
ENSG00000168298	H1-4	high
ENSG00000168438	CDC40	high
ENSG00000168685	IL7R	high
ENSG00000168899	VAMP5	high
ENSG00000169223	LMAN2	high
ENSG00000169442	CD52	high
ENSG00000169564	PCBP1	high
ENSG00000170144	HNRNPA3	high
ENSG00000170571	EMB	high
ENSG00000170776	AKAP13	high
ENSG00000171223	JUNB	high
ENSG00000171476	HOPX	high
ENSG00000171634	BPTF	high
ENSG00000172183	ISG20	high
ENSG00000172216	CEBPB	high
ENSG00000172543	CTSW	high
ENSG00000173660	UQCRH	high
ENSG00000173821	RNF213	high
ENSG00000175390	EIF3F	high
ENSG00000176731	RBIS	high
ENSG00000176845	METRNL	high
ENSG00000177311	ZBTB38	high
ENSG00000177410	ZFAS1	high
ENSG00000177606	JUN	high
ENSG00000178573	MAF	high
ENSG00000179010	MRFAP1	high
ENSG00000179144	GIMAP7	high
ENSG00000180644	PRF1	high
ENSG00000182154	MRPL41	high
ENSG00000182866	LCK	high
ENSG00000184007	PTP4A2	high
ENSG00000184897	H1-10	high
ENSG00000185088	RPS27L	high
ENSG00000185201	IFITM2	high
ENSG00000185697	MYBL1	high
ENSG00000185787	MORF4L1	high
ENSG00000185811	IKZF1	high
ENSG00000185885	IFITM1	high
ENSG00000187118	CMC1	high
ENSG00000187239	FNBP1	high
ENSG00000187837	H1-2	high
ENSG00000188042	ARL4C	high
ENSG00000188404	SELL	high
ENSG00000189043	NDUFA4	high
ENSG00000189067	LITAF	high
ENSG00000196199	MPHOSPH8	high
ENSG00000196924	FLNA	high
ENSG00000197081	IGF2R	high
ENSG00000197540	GZMM	high
ENSG00000197728	RPS26	high
ENSG00000198258	UBL5	high
ENSG00000198830	HMGN2	high
ENSG00000198851	CD3E	high
ENSG00000204525	HLA-C	high
ENSG00000204592	HLA-E	high
ENSG00000204642	HLA-F	high
ENSG00000205937	RNPS1	high
ENSG00000211592	IGKC	high
ENSG00000211677	IGLC2	high
ENSG00000213654	GPSM3	high
ENSG00000225921	NOL7	high
ENSG00000225972	MTND1P23	high
ENSG00000228474	OST4	high
ENSG00000229474	PATL2	high
ENSG00000229807	XIST	high
ENSG00000231721	LINC-PINT	high
ENSG00000233913	RPL10P9	high
ENSG00000240065	PSMB9	high
ENSG00000245910	SNHG6	high
ENSG00000247774	PCED1B-AS1	high
ENSG00000255302	EID1	high
ENSG00000266472	MRPS21	high
ENSG00000275302	CCL4	high
ENSG00000276045	ORAI1	high
ENSG00000277734	TRAC	high
ENSG00000013374	NUB1	medium
ENSG00000013441	CLK1	medium
ENSG00000038219	BOD1L1	medium
ENSG00000046651	OFD1	medium
ENSG00000058272	PPP1R12A	medium
ENSG00000059804	SLC2A3	medium
ENSG00000062194	GPBP1	medium
ENSG00000064012	CASP8	medium
ENSG00000065413	ANKRD44	medium
ENSG00000067900	ROCK1	medium
ENSG00000068028	RASSF1	medium
ENSG00000071127	WDR1	medium
ENSG00000075142	SRI	medium
ENSG00000076928	ARHGEF1	medium
ENSG00000076928	LOC100505585	medium
ENSG00000079246	XRCC5	medium
ENSG00000085832	EPS15	medium
ENSG00000088179	PTPN4	medium
ENSG00000089248	ERP29	medium
ENSG00000092820	EZR	medium
ENSG00000100316	RPL3	medium
ENSG00000100380	ST13	medium
ENSG00000100523	DDHD1	medium
ENSG00000104131	EIF3J	medium
ENSG00000105372	RPS19	medium
ENSG00000105483	CARD8	medium
ENSG00000107742	SPOCK2	medium
ENSG00000108256	NUFIP2	medium
ENSG00000108312	UBTF	medium
ENSG00000109475	RPL34	medium
ENSG00000110876	SELPLG	medium
ENSG00000111670	GNPTAB	medium
ENSG00000111832	RWDD1	medium
ENSG00000112511	PHF1	medium
ENSG00000114850	SSR3	medium
ENSG00000115128	SF3B6	medium
ENSG00000115419	GLS	medium
ENSG00000115944	COX7A2L	medium
ENSG00000115956	PLEK	medium
ENSG00000116209	TMEM59	medium
ENSG00000119048	UBE2B	medium
ENSG00000119541	VPS4B	medium
ENSG00000119632	IFI27L2	medium
ENSG00000121966	CXCR4	medium
ENSG00000122042	UBL3	medium
ENSG00000122085	MTERF4	medium
ENSG00000122862	SRGN	medium
ENSG00000124659	TBCC	medium
ENSG00000125384	PTGER2	medium
ENSG00000125835	SNRPB	medium
ENSG00000125970	RALY	medium
ENSG00000126698	DNAJC8	medium
ENSG00000128524	ATP6V1F	medium
ENSG00000132510	KDM6B	medium
ENSG00000132819	RBM38	medium
ENSG00000132824	SERINC3	medium
ENSG00000133639	BTG1	medium
ENSG00000134107	BHLHE40	medium
ENSG00000134996	OSTF1	medium
ENSG00000136819	C9orf78	medium
ENSG00000136938	ANP32B	medium
ENSG00000137501	SYTL2	medium
ENSG00000138398	PPIG	medium
ENSG00000139343	SNRPF	medium
ENSG00000140988	RPS2	medium
ENSG00000143443	C1orf56	medium
ENSG00000145592	RPL37	medium
ENSG00000147403	RPL10	medium
ENSG00000147649	MTDH	medium
ENSG00000147669	POLR2K	medium
ENSG00000148019	CEP78	medium
ENSG00000148700	ADD3	medium
ENSG00000149273	RPS3	medium
ENSG00000152818	UTRN	medium
ENSG00000155307	SAMSN1	medium
ENSG00000155307	LOC388813	medium
ENSG00000160310	PRMT2	medium
ENSG00000160613	PCSK7	medium
ENSG00000160799	CCDC12	medium
ENSG00000160932	LY6E	medium
ENSG00000163220	S100A9	medium
ENSG00000163346	PBXIP1	medium
ENSG00000163682	RPL9	medium
ENSG00000163714	U2SURP	medium
ENSG00000164120	HPGD	medium
ENSG00000164463	CREBRF	medium
ENSG00000164691	TAGAP	medium
ENSG00000165280	VCP	medium
ENSG00000166164	BRD7	medium
ENSG00000166946	CCNDBP1	medium
ENSG00000167526	RPL13	medium
ENSG00000169230	PRELID1	medium
ENSG00000169926	KLF13	medium
ENSG00000170889	RPS9	medium
ENSG00000172809	RPL38	medium
ENSG00000175463	TBC1D10C	medium
ENSG00000176953	NFATC2IP	medium
ENSG00000178691	SUZ12	medium
ENSG00000181467	RAP2B	medium
ENSG00000182670	TTC3	medium
ENSG00000182899	RPL35A	medium
ENSG00000183696	UPP1	medium
ENSG00000184203	PPP1R2	medium
ENSG00000185129	PURA	medium
ENSG00000188229	TUBB4B	medium
ENSG00000188994	ZNF292	medium
ENSG00000196352	CD55	medium
ENSG00000197622	CDC42SE1	medium
ENSG00000198625	MDM4	medium
ENSG00000198961	PJA2	medium
ENSG00000204256	BRD2	medium
ENSG00000206503	HLA-A	medium
ENSG00000220205	VAMP2	medium
ENSG00000222041	CYTOR	medium
ENSG00000229117	RPL41	medium
ENSG00000235162	C12orf75	medium
ENSG00000245164	LINC00861	medium
ENSG00000265491	RNF115	medium
ENSG00000265972	TXNIP	medium
ENSG00000271503	CCL5	medium
ENSG00000285410	GABPB1-IT1	medium
