IdentityGene	GeneSymbol	Level
ENSG00000002726	AOC1	high
ENSG00000002933	TMEM176A	high
ENSG00000004059	ARF5	high
ENSG00000004534	RBM6	high
ENSG00000004779	NDUFAB1	high
ENSG00000004799	PDK4	high
ENSG00000005022	SLC25A5	high
ENSG00000005075	POLR2J	high
ENSG00000005206	SPPL2B	high
ENSG00000005483	KMT2E	high
ENSG00000006327	TNFRSF12A	high
ENSG00000006652	IFRD1	high
ENSG00000007306	CEACAM7	high
ENSG00000008018	PSMB1	high
ENSG00000008294	SPAG9	high
ENSG00000008323	PLEKHG6	high
ENSG00000008382	MPND	high
ENSG00000008394	MGST1	high
ENSG00000008517	IL32	high
ENSG00000008988	RPS20	high
ENSG00000009307	CSDE1	high
ENSG00000010256	UQCRC1	high
ENSG00000010278	CD9	high
ENSG00000011422	PLAUR	high
ENSG00000013583	HEBP1	high
ENSG00000013588	GPRC5A	high
ENSG00000014641	MDH1	high
ENSG00000015413	DPEP1	high
ENSG00000016602	CLCA4	high
ENSG00000017797	RALBP1	high
ENSG00000021355	SERPINB1	high
ENSG00000030582	GRN	high
ENSG00000033867	SLC4A7	high
ENSG00000034510	TMSB10	high
ENSG00000035403	VCL	high
ENSG00000039068	CDH1	high
ENSG00000041357	PSMA4	high
ENSG00000042445	RETSAT	high
ENSG00000044115	CTNNA1	high
ENSG00000046604	DSG2	high
ENSG00000048828	FAM120A	high
ENSG00000049759	NEDD4L	high
ENSG00000050405	LIMA1	high
ENSG00000051108	HERPUD1	high
ENSG00000051523	CYBA	high
ENSG00000051620	HEBP2	high
ENSG00000052344	PRSS8	high
ENSG00000052802	MSMO1	high
ENSG00000053371	AKR7A2	high
ENSG00000053747	LAMA3	high
ENSG00000054148	PHPT1	high
ENSG00000054654	SYNE2	high
ENSG00000057608	GDI2	high
ENSG00000059728	MXD1	high
ENSG00000060762	MPC1	high
ENSG00000060971	ACAA1	high
ENSG00000062716	VMP1	high
ENSG00000063046	EIF4B	high
ENSG00000063177	RPL18	high
ENSG00000064601	CTSA	high
ENSG00000064651	SLC12A2	high
ENSG00000065154	OAT	high
ENSG00000065243	PKN2	high
ENSG00000065361	ERBB3	high
ENSG00000065518	NDUFB4	high
ENSG00000065526	SPEN	high
ENSG00000065548	ZC3H15	high
ENSG00000065978	YBX1	high
ENSG00000067064	IDI1	high
ENSG00000067082	KLF6	high
ENSG00000067225	PKM	high
ENSG00000069329	VPS35	high
ENSG00000069849	ATP1B3	high
ENSG00000070214	SLC44A1	high
ENSG00000070756	PABPC1	high
ENSG00000070961	ATP2B1	high
ENSG00000071082	RPL31	high
ENSG00000071127	WDR1	high
ENSG00000071203	MS4A12	high
ENSG00000071967	CYBRD1	high
ENSG00000072274	TFRC	high
ENSG00000072364	AFF4	high
ENSG00000072415	MPP5	high
ENSG00000072778	ACADVL	high
ENSG00000073350	LLGL2	high
ENSG00000073803	MAP3K13	high
ENSG00000074071	MRPS34	high
ENSG00000074416	MGLL	high
ENSG00000075142	SRI	high
ENSG00000075415	SLC25A3	high
ENSG00000075426	FOSL2	high
ENSG00000076554	TPD52	high
ENSG00000076641	PAG1	high
ENSG00000077147	TM9SF3	high
ENSG00000077549	CAPZB	high
ENSG00000078140	UBE2K	high
ENSG00000078369	GNB1	high
ENSG00000078401	EDN1	high
ENSG00000078668	VDAC3	high
ENSG00000079112	CDH17	high
ENSG00000079385	CEACAM1	high
ENSG00000079459	FDFT1	high
ENSG00000081923	ATP8B1	high
ENSG00000083845	RPS5	high
ENSG00000083857	FAT1	high
ENSG00000084207	GSTP1	high
ENSG00000084623	EIF3I	high
ENSG00000084733	RAB10	high
ENSG00000084754	HADHA	high
ENSG00000085224	ATRX	high
ENSG00000085871	MGST2	high
ENSG00000086205	FOLH1	high
ENSG00000086544	ITPKC	high
ENSG00000086598	TMED2	high
ENSG00000086696	HSD17B2	high
ENSG00000087074	PPP1R15A	high
ENSG00000088386	SLC15A1	high
ENSG00000088888	MAVS	high
ENSG00000088986	DYNLL1	high
ENSG00000089009	RPL6	high
ENSG00000089157	RPLP0	high
ENSG00000089220	PEBP1	high
ENSG00000089280	FUS	high
ENSG00000089356	FXYD3	high
ENSG00000089472	HEPH	high
ENSG00000089693	MLF2	high
ENSG00000089902	RCOR1	high
ENSG00000090013	BLVRB	high
ENSG00000090263	MRPS33	high
ENSG00000090266	NDUFB2	high
ENSG00000090402	SI	high
ENSG00000091138	SLC26A3	high
ENSG00000091164	TXNL1	high
ENSG00000091409	ITGA6	high
ENSG00000092820	EZR	high
ENSG00000092841	MYL6	high
ENSG00000093010	COMT	high
ENSG00000093167	LRRFIP2	high
ENSG00000095380	NANS	high
ENSG00000095932	SMIM24	high
ENSG00000096696	DSP	high
ENSG00000096746	HNRNPH3	high
ENSG00000099341	PSMD8	high
ENSG00000099622	CIRBP	high
ENSG00000099624	ATP5F1D	high
ENSG00000099783	HNRNPM	high
ENSG00000099795	NDUFB7	high
ENSG00000099800	TIMM13	high
ENSG00000099812	MISP	high
ENSG00000099834	CDHR5	high
ENSG00000100079	LGALS2	high
ENSG00000100129	EIF3L	high
ENSG00000100170	SLC5A1	high
ENSG00000100221	JOSD1	high
ENSG00000100300	TSPO	high
ENSG00000100316	RPL3	high
ENSG00000100345	MYH9	high
ENSG00000100348	TXN2	high
ENSG00000100387	RBX1	high
ENSG00000100567	PSMA3	high
ENSG00000100650	SRSF5	high
ENSG00000100664	EIF5	high
ENSG00000100811	YY1	high
ENSG00000100823	APEX1	high
ENSG00000100911	PSME2	high
ENSG00000100941	PNN	high
ENSG00000101160	CTSZ	high
ENSG00000101166	PRELID3B	high
ENSG00000101182	PSMA7	high
ENSG00000101311	FERMT1	high
ENSG00000101421	CHMP4B	high
ENSG00000101558	VAPA	high
ENSG00000101577	LPIN2	high
ENSG00000101745	ANKRD12	high
ENSG00000101782	RIOK3	high
ENSG00000102007	PLP2	high
ENSG00000102144	PGK1	high
ENSG00000102317	RBM3	high
ENSG00000102554	KLF5	high
ENSG00000102786	INTS6	high
ENSG00000102837	OLFM4	high
ENSG00000103035	PSMD7	high
ENSG00000103266	STUB1	high
ENSG00000103275	UBE2I	high
ENSG00000103363	ELOB	high
ENSG00000103495	MAZ	high
ENSG00000103534	TMC5	high
ENSG00000103769	RAB11A	high
ENSG00000104067	TJP1	high
ENSG00000104267	CA2	high
ENSG00000104388	RAB2A	high
ENSG00000104408	EIF3E	high
ENSG00000104823	ECH1	high
ENSG00000104870	FCGRT	high
ENSG00000105185	PDCD5	high
ENSG00000105202	FBL	high
ENSG00000105220	GPI	high
ENSG00000105372	RPS19	high
ENSG00000105373	NOP53	high
ENSG00000105379	ETFB	high
ENSG00000105388	CEACAM5	high
ENSG00000105438	KDELR1	high
ENSG00000105568	PPP2R1A	high
ENSG00000105640	RPL18A	high
ENSG00000105669	COPE	high
ENSG00000105755	ETHE1	high
ENSG00000105835	NAMPT	high
ENSG00000105854	PON2	high
ENSG00000106028	SSBP1	high
ENSG00000106077	ABHD11	high
ENSG00000106153	CHCHD2	high
ENSG00000106258	CYP3A5	high
ENSG00000106261	ZKSCAN1	high
ENSG00000106355	LSM5	high
ENSG00000106400	ZNHIT1	high
ENSG00000106404	CLDN15	high
ENSG00000106541	AGR2	high
ENSG00000106565	TMEM176B	high
ENSG00000106682	EIF4H	high
ENSG00000106829	TLE4	high
ENSG00000106853	PTGR1	high
ENSG00000107223	EDF1	high
ENSG00000107262	BAG1	high
ENSG00000107581	EIF3A	high
ENSG00000108107	RPL28	high
ENSG00000108187	PBLD	high
ENSG00000108298	RPL19	high
ENSG00000108561	C1QBP	high
ENSG00000108588	CCDC47	high
ENSG00000108679	LGALS3BP	high
ENSG00000108846	ABCC3	high
ENSG00000108848	LUC7L3	high
ENSG00000108953	YWHAE	high
ENSG00000109062	SLC9A3R1	high
ENSG00000109180	OCIAD1	high
ENSG00000109270	LAMTOR3	high
ENSG00000109321	AREG	high
ENSG00000109390	NDUFC1	high
ENSG00000109475	RPL34	high
ENSG00000109787	KLF3	high
ENSG00000109814	UGDH	high
ENSG00000109971	HSPA8	high
ENSG00000110244	APOA4	high
ENSG00000110321	EIF4G2	high
ENSG00000110492	MDK	high
ENSG00000110628	SLC22A18	high
ENSG00000110700	RPS13	high
ENSG00000110717	NDUFS8	high
ENSG00000110917	MLEC	high
ENSG00000110955	ATP5F1B	high
ENSG00000111011	RSRC2	high
ENSG00000111057	KRT18	high
ENSG00000111229	ARPC3	high
ENSG00000111275	ALDH2	high
ENSG00000111319	SCNN1A	high
ENSG00000111639	MRPL51	high
ENSG00000111666	CHPT1	high
ENSG00000111669	TPI1	high
ENSG00000111775	COX6A1	high
ENSG00000111832	RWDD1	high
ENSG00000111843	TMEM14C	high
ENSG00000111859	NEDD9	high
ENSG00000111912	NCOA7	high
ENSG00000112306	RPS12	high
ENSG00000112514	CUTA	high
ENSG00000112651	MRPL2	high
ENSG00000112667	DNPH1	high
ENSG00000112695	COX7A2	high
ENSG00000112715	VEGFA	high
ENSG00000112739	PRPF4B	high
ENSG00000112972	HMGCS1	high
ENSG00000113070	HBEGF	high
ENSG00000113282	CLINT1	high
ENSG00000113328	CCNG1	high
ENSG00000113558	SKP1	high
ENSG00000113648	MACROH2A1	high
ENSG00000113722	CDX1	high
ENSG00000113732	ATP6V0E1	high
ENSG00000113811	SELENOK	high
ENSG00000114023	FAM162A	high
ENSG00000114113	RBP2	high
ENSG00000114120	SLC25A36	high
ENSG00000114125	RNF7	high
ENSG00000114315	HES1	high
ENSG00000114354	TFG	high
ENSG00000114391	RPL24	high
ENSG00000114857	NKTR	high
ENSG00000114861	FOXP1	high
ENSG00000114942	EEF1B2	high
ENSG00000115053	NCL	high
ENSG00000115091	ACTR3	high
ENSG00000115112	TFCP2L1	high
ENSG00000115128	SF3B6	high
ENSG00000115129	TP53I3	high
ENSG00000115268	RPS15	high
ENSG00000115286	NDUFS7	high
ENSG00000115306	SPTBN1	high
ENSG00000115386	REG1A	high
ENSG00000115419	GLS	high
ENSG00000115524	SF3B1	high
ENSG00000115541	HSPE1	high
ENSG00000115616	SLC9A2	high
ENSG00000115738	ID2	high
ENSG00000115758	ODC1	high
ENSG00000115944	COX7A2L	high
ENSG00000115963	RND3	high
ENSG00000116030	SUMO1	high
ENSG00000116171	SCP2	high
ENSG00000116209	TMEM59	high
ENSG00000116285	ERRFI1	high
ENSG00000116350	SRSF4	high
ENSG00000116459	ATP5PB	high
ENSG00000116539	ASH1L	high
ENSG00000116560	SFPQ	high
ENSG00000116667	C1orf21	high
ENSG00000116717	GADD45A	high
ENSG00000116754	SRSF11	high
ENSG00000117335	CD46	high
ENSG00000117472	TSPAN1	high
ENSG00000117523	PRRC2C	high
ENSG00000117592	PRDX6	high
ENSG00000117614	SYF2	high
ENSG00000117616	RSRP1	high
ENSG00000117984	CTSD	high
ENSG00000118137	APOA1	high
ENSG00000118181	RPS25	high
ENSG00000118482	PHF3	high
ENSG00000118515	SGK1	high
ENSG00000118640	VAMP8	high
ENSG00000118680	MYL12B	high
ENSG00000118816	CCNI	high
ENSG00000118971	CCND2	high
ENSG00000119013	NDUFB3	high
ENSG00000119048	UBE2B	high
ENSG00000119138	KLF9	high
ENSG00000119335	SET	high
ENSG00000119421	NDUFA8	high
ENSG00000119547	ONECUT2	high
ENSG00000119655	NPC2	high
ENSG00000119705	SLIRP	high
ENSG00000119888	EPCAM	high
ENSG00000119986	AVPI1	high
ENSG00000120306	CYSTM1	high
ENSG00000120438	TCP1	high
ENSG00000120675	DNAJC15	high
ENSG00000120694	HSPH1	high
ENSG00000120742	SERP1	high
ENSG00000120963	ZNF706	high
ENSG00000120992	LYPLA1	high
ENSG00000121578	B4GALT4	high
ENSG00000121691	CAT	high
ENSG00000121774	KHDRBS1	high
ENSG00000121900	TMEM54	high
ENSG00000122026	RPL21	high
ENSG00000122042	UBL3	high
ENSG00000122359	ANXA11	high
ENSG00000122378	PRXL2A	high
ENSG00000122406	RPL5	high
ENSG00000122565	CBX3	high
ENSG00000122644	ARL4A	high
ENSG00000122873	CISD1	high
ENSG00000123179	EBPL	high
ENSG00000123358	NR4A1	high
ENSG00000123505	AMD1	high
ENSG00000124172	ATP5F1E	high
ENSG00000124253	PCK1	high
ENSG00000124299	PEPD	high
ENSG00000124429	POF1B	high
ENSG00000124570	SERPINB6	high
ENSG00000124795	DEK	high
ENSG00000125144	MT1G	high
ENSG00000125148	MT2A	high
ENSG00000125356	NDUFA1	high
ENSG00000125398	SOX9	high
ENSG00000125458	NT5C	high
ENSG00000125534	PPDPF	high
ENSG00000125652	ALKBH7	high
ENSG00000125691	RPL23	high
ENSG00000125740	FOSB	high
ENSG00000125743	SNRPD2	high
ENSG00000125775	SDCBP2	high
ENSG00000125835	SNRPB	high
ENSG00000125844	RRBP1	high
ENSG00000125944	HNRNPR	high
ENSG00000125968	ID1	high
ENSG00000125970	RALY	high
ENSG00000125991	ERGIC3	high
ENSG00000125995	ROMO1	high
ENSG00000126005	MMP24OS	high
ENSG00000126247	CAPNS1	high
ENSG00000126267	COX6B1	high
ENSG00000126432	PRDX5	high
ENSG00000126756	UXT	high
ENSG00000126870	DYNC2I1	high
ENSG00000126934	MAP2K2	high
ENSG00000127184	COX7C	high
ENSG00000127324	TSPAN8	high
ENSG00000127540	UQCR11	high
ENSG00000127831	VIL1	high
ENSG00000127838	PNKD	high
ENSG00000127884	ECHS1	high
ENSG00000127914	AKAP9	high
ENSG00000127922	SEM1	high
ENSG00000127948	POR	high
ENSG00000128245	YWHAH	high
ENSG00000128272	ATF4	high
ENSG00000128309	MPST	high
ENSG00000128311	TST	high
ENSG00000128609	NDUFA5	high
ENSG00000129084	PSMA1	high
ENSG00000129235	TXNDC17	high
ENSG00000129250	KIF1C	high
ENSG00000129559	NEDD8	high
ENSG00000129824	RPS4Y1	high
ENSG00000130159	ECSIT	high
ENSG00000130164	LDLR	high
ENSG00000130255	RPL36	high
ENSG00000130312	MRPL34	high
ENSG00000130313	PGLS	high
ENSG00000130332	LSM7	high
ENSG00000130402	ACTN4	high
ENSG00000130414	NDUFA10	high
ENSG00000130513	GDF15	high
ENSG00000130520	LSM4	high
ENSG00000130522	JUND	high
ENSG00000130724	CHMP2A	high
ENSG00000130741	EIF2S3	high
ENSG00000130770	ATP5IF1	high
ENSG00000130821	SLC6A8	high
ENSG00000131142	CCL25	high
ENSG00000131143	COX4I1	high
ENSG00000131174	COX7B	high
ENSG00000131236	CAP1	high
ENSG00000131469	RPL27	high
ENSG00000131495	NDUFA2	high
ENSG00000131771	PPP1R1B	high
ENSG00000131828	PDHA1	high
ENSG00000131981	LGALS3	high
ENSG00000132002	DNAJB1	high
ENSG00000132329	RAMP1	high
ENSG00000132361	CLUH	high
ENSG00000132424	PNISR	high
ENSG00000132432	SEC61G	high
ENSG00000132507	EIF5A	high
ENSG00000132510	KDM6B	high
ENSG00000132698	RAB25	high
ENSG00000132793	LPIN3	high
ENSG00000132963	POMP	high
ENSG00000133112	TPT1	high
ENSG00000133703	KRAS	high
ENSG00000133742	CA1	high
ENSG00000134056	MRPS36	high
ENSG00000134202	GSTM3	high
ENSG00000134240	HMGCS2	high
ENSG00000134419	RPS15A	high
ENSG00000134440	NARS1	high
ENSG00000134755	DSC2	high
ENSG00000134884	ARGLU1	high
ENSG00000135048	CEMIP2	high
ENSG00000135052	GOLM1	high
ENSG00000135090	TAOK3	high
ENSG00000135220	UGT2A3	high
ENSG00000135316	SYNCRIP	high
ENSG00000135373	EHF	high
ENSG00000135390	ATP5MC2	high
ENSG00000135441	BLOC1S1	high
ENSG00000135486	HNRNPA1	high
ENSG00000135506	OS9	high
ENSG00000135549	PKIB	high
ENSG00000135720	DYNC1LI2	high
ENSG00000135916	ITM2C	high
ENSG00000135940	COX5B	high
ENSG00000136044	APPL2	high
ENSG00000136153	LMO7	high
ENSG00000136238	RAC1	high
ENSG00000136240	KDELR2	high
ENSG00000136521	NDUFB5	high
ENSG00000136810	TXN	high
ENSG00000136826	KLF4	high
ENSG00000136872	ALDOB	high
ENSG00000136938	ANP32B	high
ENSG00000136942	RPL35	high
ENSG00000137154	RPS6	high
ENSG00000137210	TMEM14B	high
ENSG00000137309	HMGA1	high
ENSG00000137331	IER3	high
ENSG00000137364	TPMT	high
ENSG00000137409	MTCH1	high
ENSG00000137440	FGFBP1	high
ENSG00000137767	SQOR	high
ENSG00000137815	RTF1	high
ENSG00000137818	RPLP1	high
ENSG00000138029	HADHB	high
ENSG00000138069	RAB1A	high
ENSG00000138071	ACTR2	high
ENSG00000138085	ATRAID	high
ENSG00000138326	RPS24	high
ENSG00000138385	SSB	high
ENSG00000138413	IDH1	high
ENSG00000138434	ITPRID2	high
ENSG00000138449	SLC40A1	high
ENSG00000138495	COX17	high
ENSG00000138600	SPPL2A	high
ENSG00000138640	FAM13A	high
ENSG00000138668	HNRNPD	high
ENSG00000138674	SEC31A	high
ENSG00000138771	SHROOM3	high
ENSG00000139163	ETNK1	high
ENSG00000139218	SCAF11	high
ENSG00000139343	SNRPF	high
ENSG00000139644	TMBIM6	high
ENSG00000139684	ESD	high
ENSG00000139725	RHOF	high
ENSG00000140374	ETFA	high
ENSG00000140391	TSPAN3	high
ENSG00000140575	IQGAP1	high
ENSG00000140612	SEC11A	high
ENSG00000140740	UQCRC2	high
ENSG00000140832	MARVELD3	high
ENSG00000140988	RPS2	high
ENSG00000140990	NDUFB10	high
ENSG00000141002	TCF25	high
ENSG00000141027	NCOR1	high
ENSG00000141198	TOM1L1	high
ENSG00000141232	TOB1	high
ENSG00000141429	GALNT1	high
ENSG00000141504	SAT2	high
ENSG00000141522	ARHGDIA	high
ENSG00000141551	CSNK1D	high
ENSG00000141552	ANAPC11	high
ENSG00000142168	SOD1	high
ENSG00000142192	APP	high
ENSG00000142484	TM4SF5	high
ENSG00000142534	RPS11	high
ENSG00000142541	RPL13A	high
ENSG00000142583	SLC2A5	high
ENSG00000142627	EPHA2	high
ENSG00000142634	EFHD2	high
ENSG00000142676	RPL11	high
ENSG00000142864	SERBP1	high
ENSG00000142867	BCL10	high
ENSG00000142910	TINAGL1	high
ENSG00000142937	RPS8	high
ENSG00000142949	PTPRF	high
ENSG00000143106	PSMA5	high
ENSG00000143153	ATP1B1	high
ENSG00000143158	MPC2	high
ENSG00000143183	TMCO1	high
ENSG00000143198	MGST3	high
ENSG00000143252	SDHC	high
ENSG00000143321	HDGF	high
ENSG00000143375	CGN	high
ENSG00000143384	MCL1	high
ENSG00000143416	SELENBP1	high
ENSG00000143420	ENSA	high
ENSG00000143543	JTB	high
ENSG00000143612	C1orf43	high
ENSG00000143633	C1orf131	high
ENSG00000143727	ACP1	high
ENSG00000143742	SRP9	high
ENSG00000143761	ARF1	high
ENSG00000143776	CDC42BPA	high
ENSG00000143878	RHOB	high
ENSG00000143947	RPS27A	high
ENSG00000144063	MALL	high
ENSG00000144136	SLC20A1	high
ENSG00000144224	UBXN4	high
ENSG00000144381	HSPD1	high
ENSG00000144426	NBEAL1	high
ENSG00000144674	GOLGA4	high
ENSG00000144713	RPL32	high
ENSG00000144802	NFKBIZ	high
ENSG00000145113	MUC4	high
ENSG00000145247	OCIAD2	high
ENSG00000145287	PLAC8	high
ENSG00000145384	FABP2	high
ENSG00000145425	RPS3A	high
ENSG00000145494	NDUFS6	high
ENSG00000145495	MARCHF6	high
ENSG00000145592	RPL37	high
ENSG00000145632	PLK2	high
ENSG00000145703	IQGAP2	high
ENSG00000145741	BTF3	high
ENSG00000145833	DDX46	high
ENSG00000145912	NHP2	high
ENSG00000146066	HIGD2A	high
ENSG00000146701	MDH2	high
ENSG00000146731	CCT6A	high
ENSG00000147123	NDUFB11	high
ENSG00000147155	EBP	high
ENSG00000147403	RPL10	high
ENSG00000147454	SLC25A37	high
ENSG00000147604	RPL7	high
ENSG00000147677	EIF3H	high
ENSG00000147684	NDUFB9	high
ENSG00000147853	AK3	high
ENSG00000147862	NFIB	high
ENSG00000147883	CDKN2B	high
ENSG00000148303	RPL7A	high
ENSG00000148339	SLC25A25	high
ENSG00000148671	ADIRF	high
ENSG00000148700	ADD3	high
ENSG00000148737	TCF7L2	high
ENSG00000148926	ADM	high
ENSG00000149260	CAPN5	high
ENSG00000149273	RPS3	high
ENSG00000149418	ST14	high
ENSG00000149932	TMEM219	high
ENSG00000150459	SAP18	high
ENSG00000150593	PDCD4	high
ENSG00000150753	CCT5	high
ENSG00000150779	TIMM8B	high
ENSG00000150991	UBC	high
ENSG00000151327	FAM177A1	high
ENSG00000151327	LOC101927178	high
ENSG00000151366	NDUFC2	high
ENSG00000151491	EPS8	high
ENSG00000151632	AKR1C2	high
ENSG00000152234	ATP5F1A	high
ENSG00000152291	TGOLN2	high
ENSG00000152518	ZFP36L2	high
ENSG00000153214	TMEM87B	high
ENSG00000153774	CFDP1	high
ENSG00000154274	C4orf19	high
ENSG00000154447	SH3RF1	high
ENSG00000154518	ATP5MC3	high
ENSG00000154639	CXADR	high
ENSG00000154646	TMPRSS15	high
ENSG00000154723	ATP5PF	high
ENSG00000155366	RHOC	high
ENSG00000155368	DBI	high
ENSG00000155850	SLC26A2	high
ENSG00000155957	TMBIM4	high
ENSG00000156261	CCT8	high
ENSG00000156411	ATP5MPL	high
ENSG00000156482	RPL30	high
ENSG00000156508	EEF1A1	high
ENSG00000156675	RAB11FIP1	high
ENSG00000156976	EIF4A2	high
ENSG00000157106	SMG1	high
ENSG00000157557	ETS2	high
ENSG00000157916	RER1	high
ENSG00000158195	WASF2	high
ENSG00000158417	EIF5B	high
ENSG00000158604	TMED4	high
ENSG00000158747	NBL1	high
ENSG00000158747	MICOS10-NBL1	high
ENSG00000158864	NDUFS2	high
ENSG00000159182	PRAC1	high
ENSG00000159199	ATP5MC1	high
ENSG00000159228	CBR1	high
ENSG00000159377	PSMB4	high
ENSG00000159388	BTG2	high
ENSG00000159720	ATP6V0D1	high
ENSG00000160075	SSU72	high
ENSG00000160145	KALRN	high
ENSG00000160194	NDUFV3	high
ENSG00000160752	FDPS	high
ENSG00000160799	CCDC12	high
ENSG00000160868	CYP3A4	high
ENSG00000160888	IER2	high
ENSG00000161011	SQSTM1	high
ENSG00000161013	MGAT4B	high
ENSG00000161016	RPL8	high
ENSG00000161970	RPL26	high
ENSG00000162191	UBXN1	high
ENSG00000162244	RPL29	high
ENSG00000162368	CMPK1	high
ENSG00000162545	CAMK2N1	high
ENSG00000162704	ARPC5	high
ENSG00000162772	ATF3	high
ENSG00000162783	IER5	high
ENSG00000162896	PIGR	high
ENSG00000162909	CAPN2	high
ENSG00000162981	LRATD1	high
ENSG00000163170	BOLA3	high
ENSG00000163293	NIPAL1	high
ENSG00000163399	ATP1A1	high
ENSG00000163435	ELF3	high
ENSG00000163466	ARPC2	high
ENSG00000163468	CCT3	high
ENSG00000163541	SUCLG1	high
ENSG00000163584	RPL22L1	high
ENSG00000163586	FABP1	high
ENSG00000163659	TIPARP	high
ENSG00000163682	RPL9	high
ENSG00000163694	RBM47	high
ENSG00000163701	IL17RE	high
ENSG00000163714	U2SURP	high
ENSG00000163898	LIPH	high
ENSG00000163900	TMEM41A	high
ENSG00000163931	TKT	high
ENSG00000164096	C4orf3	high
ENSG00000164120	HPGD	high
ENSG00000164237	CMBL	high
ENSG00000164258	NDUFS4	high
ENSG00000164266	SPINK1	high
ENSG00000164346	NSA2	high
ENSG00000164405	UQCRQ	high
ENSG00000164442	CITED2	high
ENSG00000164587	RPS14	high
ENSG00000164687	FABP5	high
ENSG00000164695	CHMP4C	high
ENSG00000164896	FASTK	high
ENSG00000164919	COX6C	high
ENSG00000165092	ALDH1A1	high
ENSG00000165119	HNRNPK	high
ENSG00000165140	FBP1	high
ENSG00000165215	CLDN3	high
ENSG00000165280	VCP	high
ENSG00000165475	CRYL1	high
ENSG00000165502	RPL36AL	high
ENSG00000165629	ATP5F1C	high
ENSG00000165637	VDAC2	high
ENSG00000165672	PRDX3	high
ENSG00000165678	GHITM	high
ENSG00000165732	DDX21	high
ENSG00000165828	PRAP1	high
ENSG00000165841	CYP2C19	high
ENSG00000165949	IFI27	high
ENSG00000166012	TAF1D	high
ENSG00000166126	AMN	high
ENSG00000166136	NDUFB8	high
ENSG00000166145	SPINT1	high
ENSG00000166165	CKB	high
ENSG00000166226	CCT2	high
ENSG00000166295	ANAPC16	high
ENSG00000166347	CYB5A	high
ENSG00000166441	RPL27A	high
ENSG00000166483	WEE1	high
ENSG00000166582	CENPV	high
ENSG00000166825	ANPEP	high
ENSG00000166913	YWHAB	high
ENSG00000166920	C15orf48	high
ENSG00000167004	PDIA3	high
ENSG00000167085	PHB	high
ENSG00000167088	SNRPD1	high
ENSG00000167232	ZNF91	high
ENSG00000167283	ATP5MG	high
ENSG00000167315	ACAA2	high
ENSG00000167434	CA4	high
ENSG00000167460	TPM4	high
ENSG00000167470	MIDN	high
ENSG00000167508	MVD	high
ENSG00000167522	ANKRD11	high
ENSG00000167526	RPL13	high
ENSG00000167553	TUBA1C	high
ENSG00000167642	SPINT2	high
ENSG00000167644	C19orf33	high
ENSG00000167658	EEF2	high
ENSG00000167772	ANGPTL4	high
ENSG00000167792	NDUFV1	high
ENSG00000167797	CDK2AP2	high
ENSG00000167863	ATP5PD	high
ENSG00000167930	FAM234A	high
ENSG00000167969	ECI1	high
ENSG00000167978	SRRM2	high
ENSG00000168028	RPSA	high
ENSG00000168036	CTNNB1	high
ENSG00000168118	RAB4A	high
ENSG00000168374	ARF4	high
ENSG00000168447	SCNN1B	high
ENSG00000168528	SERINC2	high
ENSG00000168564	CDKN2AIP	high
ENSG00000168653	NDUFS5	high
ENSG00000168710	AHCYL1	high
ENSG00000168938	PPIC	high
ENSG00000169020	ATP5ME	high
ENSG00000169021	UQCRFS1	high
ENSG00000169223	LMAN2	high
ENSG00000169230	PRELID1	high
ENSG00000169242	EFNA1	high
ENSG00000169564	PCBP1	high
ENSG00000169567	HINT1	high
ENSG00000169692	AGPAT2	high
ENSG00000169714	CNBP	high
ENSG00000169715	MT1E	high
ENSG00000169738	DCXR	high
ENSG00000169764	UGP2	high
ENSG00000169813	HNRNPF	high
ENSG00000169894	MUC3A	high
ENSG00000169905	TOR1AIP2	high
ENSG00000169976	SF3B5	high
ENSG00000170144	HNRNPA3	high
ENSG00000170248	PDCD6IP	high
ENSG00000170345	FOS	high
ENSG00000170421	KRT8	high
ENSG00000170540	ARL6IP1	high
ENSG00000170759	KIF5B	high
ENSG00000170776	AKAP13	high
ENSG00000170860	LSM3	high
ENSG00000170889	RPS9	high
ENSG00000170906	NDUFA3	high
ENSG00000171124	FUT3	high
ENSG00000171159	C9orf16	high
ENSG00000171222	SCAND1	high
ENSG00000171345	KRT19	high
ENSG00000171431	KRT20	high
ENSG00000171490	RSL1D1	high
ENSG00000171735	CAMTA1	high
ENSG00000171747	LGALS4	high
ENSG00000171858	RPS21	high
ENSG00000171863	RPS7	high
ENSG00000172115	CYCS	high
ENSG00000172270	BSG	high
ENSG00000172340	SUCLG2	high
ENSG00000172531	PPP1CA	high
ENSG00000172590	MRPL52	high
ENSG00000172757	CFL1	high
ENSG00000172809	RPL38	high
ENSG00000172831	CES2	high
ENSG00000172890	NADSYN1	high
ENSG00000173141	MRPL57	high
ENSG00000173230	GOLGB1	high
ENSG00000173272	MZT2A	high
ENSG00000173334	TRIB1	high
ENSG00000173436	MICOS10	high
ENSG00000173457	PPP1R14B	high
ENSG00000173660	UQCRH	high
ENSG00000173674	EIF1AX	high
ENSG00000173702	MUC13	high
ENSG00000173801	JUP	high
ENSG00000173821	RNF213	high
ENSG00000173848	NET1	high
ENSG00000173905	GOLIM4	high
ENSG00000173915	ATP5MD	high
ENSG00000174437	ATP2A2	high
ENSG00000174444	RPL4	high
ENSG00000174748	RPL15	high
ENSG00000174886	NDUFA11	high
ENSG00000174917	MICOS13	high
ENSG00000175061	SNHG29	high
ENSG00000175110	MRPS22	high
ENSG00000175130	MARCKSL1	high
ENSG00000175197	DDIT3	high
ENSG00000175390	EIF3F	high
ENSG00000175416	CLTB	high
ENSG00000175756	AURKAIP1	high
ENSG00000175793	SFN	high
ENSG00000176153	GPX2	high
ENSG00000176340	COX8A	high
ENSG00000176597	B3GNT5	high
ENSG00000176731	RBIS	high
ENSG00000176845	METRNL	high
ENSG00000176907	TCIM	high
ENSG00000176946	THAP4	high
ENSG00000177156	TALDO1	high
ENSG00000177200	CHD9	high
ENSG00000177410	ZFAS1	high
ENSG00000177600	RPLP2	high
ENSG00000177606	JUN	high
ENSG00000177697	CD151	high
ENSG00000177954	RPS27	high
ENSG00000178035	IMPDH2	high
ENSG00000178209	PLEC	high
ENSG00000178573	MAF	high
ENSG00000178741	COX5A	high
ENSG00000178828	RNF186	high
ENSG00000178951	ZBTB7A	high
ENSG00000178952	TUFM	high
ENSG00000178982	EIF3K	high
ENSG00000179085	DPM3	high
ENSG00000179091	CYC1	high
ENSG00000179218	CALR	high
ENSG00000179262	RAD23A	high
ENSG00000179271	GADD45GIP1	high
ENSG00000179674	ARL14	high
ENSG00000179820	MYADM	high
ENSG00000180745	CLRN3	high
ENSG00000180817	PPA1	high
ENSG00000181019	NQO1	high
ENSG00000181061	HIGD1A	high
ENSG00000181350	LRRC75A	high
ENSG00000181467	RAP2B	high
ENSG00000181649	PHLDA2	high
ENSG00000181885	CLDN7	high
ENSG00000182004	SNRPE	high
ENSG00000182054	IDH2	high
ENSG00000182087	TMEM259	high
ENSG00000182117	NOP10	high
ENSG00000182196	ARL6IP4	high
ENSG00000182362	YBEY	high
ENSG00000182670	TTC3	high
ENSG00000182774	RPS17	high
ENSG00000182899	RPL35A	high
ENSG00000182944	EWSR1	high
ENSG00000183011	NAA38	high
ENSG00000183255	PTTG1IP	high
ENSG00000183291	SELENOF	high
ENSG00000183648	NDUFB1	high
ENSG00000183723	CMTM4	high
ENSG00000183844	FAM3B	high
ENSG00000183864	TOB2	high
ENSG00000183978	COA3	high
ENSG00000184007	PTP4A2	high
ENSG00000184009	ACTG1	high
ENSG00000184076	UQCR10	high
ENSG00000184434	LRRC19	high
ENSG00000184983	NDUFA6	high
ENSG00000185000	DGAT1	high
ENSG00000185022	MAFF	high
ENSG00000185043	CIB1	high
ENSG00000185088	RPS27L	high
ENSG00000185222	TCEAL9	high
ENSG00000185262	UBALD2	high
ENSG00000185432	METTL7A	high
ENSG00000185499	MUC1	high
ENSG00000185624	P4HB	high
ENSG00000185651	UBE2L3	high
ENSG00000185825	BCAP31	high
ENSG00000186010	NDUFA13	high
ENSG00000186298	PPP1CC	high
ENSG00000186314	PRELID2	high
ENSG00000186352	ANKRD37	high
ENSG00000186468	RPS23	high
ENSG00000186594	MIR22HG	high
ENSG00000186834	HEXIM1	high
ENSG00000187193	MT1X	high
ENSG00000187210	GCNT1	high
ENSG00000187446	CHP1	high
ENSG00000187908	DMBT1	high
ENSG00000188186	LAMTOR4	high
ENSG00000188243	COMMD6	high
ENSG00000188313	PLSCR1	high
ENSG00000188373	C10orf99	high
ENSG00000188612	SUMO2	high
ENSG00000188643	S100A16	high
ENSG00000188846	RPL14	high
ENSG00000189043	NDUFA4	high
ENSG00000189060	H1-0	high
ENSG00000189143	CLDN4	high
ENSG00000189221	MAOA	high
ENSG00000189266	PNRC2	high
ENSG00000189334	S100A14	high
ENSG00000196139	AKR1C3	high
ENSG00000196199	MPHOSPH8	high
ENSG00000196262	PPIA	high
ENSG00000196352	CD55	high
ENSG00000196419	XRCC6	high
ENSG00000196502	SULT1A1	high
ENSG00000196504	PRPF40A	high
ENSG00000196531	NACA	high
ENSG00000196549	MME	high
ENSG00000196642	RABL6	high
ENSG00000196878	LAMB3	high
ENSG00000196937	FAM3C	high
ENSG00000196975	ANXA4	high
ENSG00000197273	GUCA2A	high
ENSG00000197345	MRPL21	high
ENSG00000197448	GSTK1	high
ENSG00000197694	SPTAN1	high
ENSG00000197728	RPS26	high
ENSG00000197747	S100A10	high
ENSG00000197756	RPL37A	high
ENSG00000197888	UGT2B17	high
ENSG00000197894	ADH5	high
ENSG00000197912	SPG7	high
ENSG00000197912	LOC101930112	high
ENSG00000197956	S100A6	high
ENSG00000197958	RPL12	high
ENSG00000197969	VPS13A	high
ENSG00000198034	RPS4X	high
ENSG00000198074	AKR1B10	high
ENSG00000198087	CD2AP	high
ENSG00000198160	MIER1	high
ENSG00000198189	HSD17B11	high
ENSG00000198242	RPL23A	high
ENSG00000198258	UBL5	high
ENSG00000198355	PIM3	high
ENSG00000198380	GFPT1	high
ENSG00000198417	MT1F	high
ENSG00000198431	TXNRD1	high
ENSG00000198435	NRARP	high
ENSG00000198561	CTNND1	high
ENSG00000198643	FAM3D	high
ENSG00000198668	CALM1	high
ENSG00000198695	ND6	high
ENSG00000198712	COX2	high
ENSG00000198721	ECI2	high
ENSG00000198727	CYTB	high
ENSG00000198755	RPL10A	high
ENSG00000198763	ND2	high
ENSG00000198786	ND5	high
ENSG00000198804	COX1	high
ENSG00000198805	PNP	high
ENSG00000198830	HMGN2	high
ENSG00000198840	ND3	high
ENSG00000198856	OSTC	high
ENSG00000198886	ND4	high
ENSG00000198888	ND1	high
ENSG00000198899	ATP6	high
ENSG00000198900	TOP1	high
ENSG00000198918	RPL39	high
ENSG00000198931	APRT	high
ENSG00000198938	COX3	high
ENSG00000203875	SNHG5	high
ENSG00000204219	TCEA3	high
ENSG00000204256	BRD2	high
ENSG00000204385	SLC44A4	high
ENSG00000204388	HSPA1B	high
ENSG00000204389	HSPA1A	high
ENSG00000204569	PPP1R10	high
ENSG00000204628	RACK1	high
ENSG00000205277	MUC12	high
ENSG00000205352	PRR13	high
ENSG00000205358	MT1H	high
ENSG00000205544	TMEM256	high
ENSG00000206573	THUMPD3-AS1	high
ENSG00000210077	NA	high
ENSG00000210082	NA	high
ENSG00000210184	NA	high
ENSG00000210194	NA	high
ENSG00000210196	NA	high
ENSG00000211450	SELENOH	high
ENSG00000211459	NA	high
ENSG00000212907	ND4L	high
ENSG00000213585	VDAC1	high
ENSG00000213619	NDUFS3	high
ENSG00000213639	PPP1CB	high
ENSG00000213719	CLIC1	high
ENSG00000213741	RPS29	high
ENSG00000214026	MRPL23	high
ENSG00000214026	LOC107987373	high
ENSG00000214253	FIS1	high
ENSG00000214530	STARD10	high
ENSG00000214753	HNRNPUL2	high
ENSG00000214756	CSKMT	high
ENSG00000215021	PHB2	high
ENSG00000221983	UBA52	high
ENSG00000224259	LINC01133	high
ENSG00000225921	NOL7	high
ENSG00000225972	MTND1P23	high
ENSG00000226950	DANCR	high
ENSG00000228253	ATP8	high
ENSG00000229117	RPL41	high
ENSG00000229833	PET100	high
ENSG00000230202	NA	high
ENSG00000230989	HSBP1	high
ENSG00000231500	RPS18	high
ENSG00000231925	TAPBP	high
ENSG00000232388	SMIM26	high
ENSG00000233016	SNHG7	high
ENSG00000233041	PHGR1	high
ENSG00000233493	TMEM238	high
ENSG00000233913	RPL10P9	high
ENSG00000233927	RPS28	high
ENSG00000234741	GAS5	high
ENSG00000237550	RPL9P8	high
ENSG00000237973	MTCO1P12	high
ENSG00000239305	RNF103	high
ENSG00000241224	C3orf85	high
ENSG00000241343	RPL36A	high
ENSG00000241468	ATP5MF	high
ENSG00000241837	ATP5PO	high
ENSG00000242086	SDHAP2	high
ENSG00000242372	EIF6	high
ENSG00000242485	MRPL20	high
ENSG00000243709	LEFTY1	high
ENSG00000243955	GSTA1	high
ENSG00000244067	GSTA2	high
ENSG00000244187	TMEM141	high
ENSG00000244754	N4BP2L2	high
ENSG00000244879	NA	high
ENSG00000248144	ADH1C	high
ENSG00000248527	MTATP6P1	high
ENSG00000250479	CHCHD10	high
ENSG00000253958	CLDN23	high
ENSG00000255302	EID1	high
ENSG00000265681	RPL17	high
ENSG00000266412	NCOA4	high
ENSG00000266472	MRPS21	high
ENSG00000266714	MYO15B	high
ENSG00000267519	NA	high
ENSG00000267795	SMIM22	high
ENSG00000269821	KCNQ1OT1	high
ENSG00000272398	CD24	high
ENSG00000272888	NA	high
ENSG00000274012	RN7SL2	high
ENSG00000276168	RN7SL1	high
ENSG00000277791	PSMB3	high
ENSG00000277972	CISD3	high
ENSG00000278311	GGNBP2	high
ENSG00000280138	NA	high
ENSG00000004864	SLC25A13	medium
ENSG00000006459	KDM7A	medium
ENSG00000006831	ADIPOR2	medium
ENSG00000007062	PROM1	medium
ENSG00000007392	LUC7L	medium
ENSG00000008128	CDK11A	medium
ENSG00000009335	UBE3C	medium
ENSG00000010244	ZNF207	medium
ENSG00000011304	PTBP1	medium
ENSG00000012171	SEMA3B	medium
ENSG00000013441	CLK1	medium
ENSG00000026297	RNASET2	medium
ENSG00000029363	BCLAF1	medium
ENSG00000035141	FAM136A	medium
ENSG00000038274	MAT2B	medium
ENSG00000042753	AP2S1	medium
ENSG00000051009	FAM160A2	medium
ENSG00000053918	KCNQ1	medium
ENSG00000059573	ALDH18A1	medium
ENSG00000061794	MRPS35	medium
ENSG00000061936	SFSWAP	medium
ENSG00000062194	GPBP1	medium
ENSG00000063245	EPN1	medium
ENSG00000063322	MED29	medium
ENSG00000064607	SUGP2	medium
ENSG00000065000	AP3D1	medium
ENSG00000065357	DGKA	medium
ENSG00000070444	MNT	medium
ENSG00000073417	PDE8A	medium
ENSG00000073792	IGF2BP2	medium
ENSG00000074276	CDHR2	medium
ENSG00000074356	NCBP3	medium
ENSG00000076604	TRAF4	medium
ENSG00000080031	PTPRH	medium
ENSG00000080608	PUM3	medium
ENSG00000080815	PSEN1	medium
ENSG00000082515	MRPL22	medium
ENSG00000083896	YTHDC1	medium
ENSG00000084674	APOB	medium
ENSG00000085733	CTTN	medium
ENSG00000085760	MTIF2	medium
ENSG00000086504	MRPL28	medium
ENSG00000087884	AAMDC	medium
ENSG00000088682	COQ9	medium
ENSG00000090020	SLC9A1	medium
ENSG00000090061	CCNK	medium
ENSG00000090621	PABPC4	medium
ENSG00000090989	EXOC1	medium
ENSG00000091483	FH	medium
ENSG00000092010	PSME1	medium
ENSG00000092421	SEMA6A	medium
ENSG00000095139	ARCN1	medium
ENSG00000095203	EPB41L4B	medium
ENSG00000096060	FKBP5	medium
ENSG00000096080	MRPS18A	medium
ENSG00000096401	CDC5L	medium
ENSG00000099282	TSPAN15	medium
ENSG00000099797	TECR	medium
ENSG00000099860	GADD45B	medium
ENSG00000099901	RANBP1	medium
ENSG00000099917	MED15	medium
ENSG00000100075	SLC25A1	medium
ENSG00000100347	SAMM50	medium
ENSG00000100417	PMM1	medium
ENSG00000100425	BRD1	medium
ENSG00000100577	GSTZ1	medium
ENSG00000100744	GSKIP	medium
ENSG00000101040	ZMYND8	medium
ENSG00000101049	SGK2	medium
ENSG00000101076	HNF4A	medium
ENSG00000101213	PTK6	medium
ENSG00000101365	IDH3B	medium
ENSG00000101654	RNMT	medium
ENSG00000101856	PGRMC1	medium
ENSG00000102882	MAPK3	medium
ENSG00000103018	CYB5B	medium
ENSG00000103187	COTL1	medium
ENSG00000103254	ANTKMT	medium
ENSG00000103460	TOX3	medium
ENSG00000103485	QPRT	medium
ENSG00000103550	KNOP1	medium
ENSG00000104419	NDRG1	medium
ENSG00000104522	GFUS	medium
ENSG00000104537	ANXA13	medium
ENSG00000104549	SQLE	medium
ENSG00000104852	SNRNP70	medium
ENSG00000104979	C19orf53	medium
ENSG00000104980	TIMM44	medium
ENSG00000105135	ILVBL	medium
ENSG00000105258	POLR2I	medium
ENSG00000105289	TJP3	medium
ENSG00000105364	MRPL4	medium
ENSG00000105699	LSR	medium
ENSG00000105953	OGDH	medium
ENSG00000106052	TAX1BP1	medium
ENSG00000106299	WASL	medium
ENSG00000106789	CORO2A	medium
ENSG00000107020	PLGRKT	medium
ENSG00000107872	FBXL15	medium
ENSG00000108242	CYP2C18	medium
ENSG00000108256	NUFIP2	medium
ENSG00000108587	GOSR1	medium
ENSG00000108788	MLX	medium
ENSG00000109171	SLAIN2	medium
ENSG00000109519	GRPEL1	medium
ENSG00000109854	HTATIP2	medium
ENSG00000110011	DNAJC4	medium
ENSG00000110090	CPT1A	medium
ENSG00000110200	ANAPC15	medium
ENSG00000111237	VPS29	medium
ENSG00000111321	LTBR	medium
ENSG00000111540	RAB5B	medium
ENSG00000111640	GAPDH	medium
ENSG00000111707	SUDS3	medium
ENSG00000111802	TDP2	medium
ENSG00000112096	SOD2	medium
ENSG00000112305	SMAP1	medium
ENSG00000112378	PERP	medium
ENSG00000112658	SRF	medium
ENSG00000112773	TENT5A	medium
ENSG00000112818	MEP1A	medium
ENSG00000112893	MAN2A1	medium
ENSG00000113013	HSPA9	medium
ENSG00000113161	HMGCR	medium
ENSG00000113384	GOLPH3	medium
ENSG00000114127	XRN1	medium
ENSG00000114503	NCBP2	medium
ENSG00000115109	EPB41L5	medium
ENSG00000115339	GALNT3	medium
ENSG00000115364	MRPL19	medium
ENSG00000115457	IGFBP2	medium
ENSG00000115875	SRSF7	medium
ENSG00000116478	HDAC1	medium
ENSG00000116580	GON4L	medium
ENSG00000116679	IVNS1ABP	medium
ENSG00000117139	KDM5B	medium
ENSG00000117318	ID3	medium
ENSG00000117362	APH1A	medium
ENSG00000117528	ABCD3	medium
ENSG00000118363	SPCS2	medium
ENSG00000119471	HSDL2	medium
ENSG00000120162	MOB3B	medium
ENSG00000120690	ELF1	medium
ENSG00000120889	TNFRSF10B	medium
ENSG00000120915	EPHX2	medium
ENSG00000120948	TARDBP	medium
ENSG00000121057	AKAP1	medium
ENSG00000122545	SEPTIN7	medium
ENSG00000122729	ACO1	medium
ENSG00000122958	VPS26A	medium
ENSG00000122971	ACADS	medium
ENSG00000123159	GIPC1	medium
ENSG00000123992	DNPEP	medium
ENSG00000124198	ARFGEF2	medium
ENSG00000124406	ATP8A1	medium
ENSG00000124588	NQO2	medium
ENSG00000124762	CDKN1A	medium
ENSG00000124782	RREB1	medium
ENSG00000125826	RBCK1	medium
ENSG00000125877	ITPA	medium
ENSG00000125912	NCLN	medium
ENSG00000126003	PLAGL2	medium
ENSG00000126456	IRF3	medium
ENSG00000126522	ASL	medium
ENSG00000126768	TIMM17B	medium
ENSG00000127054	INTS11	medium
ENSG00000127334	DYRK2	medium
ENSG00000127554	GFER	medium
ENSG00000127616	SMARCA4	medium
ENSG00000128298	BAIAP2L2	medium
ENSG00000128463	EMC4	medium
ENSG00000128626	MRPS12	medium
ENSG00000129518	EAPP	medium
ENSG00000130202	NECTIN2	medium
ENSG00000130396	AFDN	medium
ENSG00000130762	ARHGEF16	medium
ENSG00000130787	HIP1R	medium
ENSG00000130811	EIF3G	medium
ENSG00000130958	SLC35D2	medium
ENSG00000131165	CHMP1A	medium
ENSG00000131626	PPFIA1	medium
ENSG00000131781	FMO5	medium
ENSG00000132024	CC2D1A	medium
ENSG00000132305	IMMT	medium
ENSG00000132313	MRPL35	medium
ENSG00000132680	KHDC4	medium
ENSG00000133318	RTN3	medium
ENSG00000133816	MICAL2	medium
ENSG00000133816	MICALCL	medium
ENSG00000134283	PPHLN1	medium
ENSG00000134308	YWHAQ	medium
ENSG00000134709	HOOK1	medium
ENSG00000135540	NHSL1	medium
ENSG00000135829	DHX9	medium
ENSG00000135930	EIF4E2	medium
ENSG00000135968	GCC2	medium
ENSG00000135972	MRPS9	medium
ENSG00000136052	SLC41A2	medium
ENSG00000136425	CIB2	medium
ENSG00000136450	SRSF1	medium
ENSG00000136522	MRPL47	medium
ENSG00000136636	KCTD3	medium
ENSG00000136718	IMP4	medium
ENSG00000136813	ECPAS	medium
ENSG00000137073	UBAP2	medium
ENSG00000137267	TUBB2A	medium
ENSG00000137563	GGH	medium
ENSG00000137801	THBS1	medium
ENSG00000137876	RSL24D1	medium
ENSG00000138193	PLCE1	medium
ENSG00000138398	PPIG	medium
ENSG00000138660	AP1AR	medium
ENSG00000138709	LARP1B	medium
ENSG00000138758	SEPTIN11	medium
ENSG00000138777	PPA2	medium
ENSG00000138794	CASP6	medium
ENSG00000138867	GUCD1	medium
ENSG00000139146	SINHCAF	medium
ENSG00000139180	NDUFA9	medium
ENSG00000139428	MMAB	medium
ENSG00000139835	GRTP1	medium
ENSG00000140297	GCNT3	medium
ENSG00000140416	TPM1	medium
ENSG00000140497	SCAMP2	medium
ENSG00000140632	GLYR1	medium
ENSG00000140943	MBTPS1	medium
ENSG00000141503	MINK1	medium
ENSG00000141542	RAB40B	medium
ENSG00000141736	ERBB2	medium
ENSG00000141959	PFKL	medium
ENSG00000141971	MVB12A	medium
ENSG00000142273	CBLC	medium
ENSG00000143549	TPM3	medium
ENSG00000144034	TPRKB	medium
ENSG00000145780	FEM1C	medium
ENSG00000147044	CASK	medium
ENSG00000147654	EBAG9	medium
ENSG00000147813	NAPRT	medium
ENSG00000148334	PTGES2	medium
ENSG00000148341	SH3GLB2	medium
ENSG00000148584	A1CF	medium
ENSG00000148803	FUOM	medium
ENSG00000149582	TMEM25	medium
ENSG00000149761	NUDT22	medium
ENSG00000149782	PLCB3	medium
ENSG00000149823	VPS51	medium
ENSG00000150527	MIA2	medium
ENSG00000151292	CSNK1G3	medium
ENSG00000151461	UPF2	medium
ENSG00000151715	TMEM45B	medium
ENSG00000151914	DST	medium
ENSG00000152894	PTPRK	medium
ENSG00000153879	CEBPG	medium
ENSG00000153904	DDAH1	medium
ENSG00000154144	TBRG1	medium
ENSG00000156510	HKDC1	medium
ENSG00000156709	AIFM1	medium
ENSG00000156711	MAPK13	medium
ENSG00000156966	B3GNT7	medium
ENSG00000157111	TMEM171	medium
ENSG00000157326	DHRS4	medium
ENSG00000157992	KRTCAP3	medium
ENSG00000158158	CNNM4	medium
ENSG00000158552	ZFAND2B	medium
ENSG00000158710	TAGLN2	medium
ENSG00000159314	ARHGAP27	medium
ENSG00000159640	ACE	medium
ENSG00000159842	ABR	medium
ENSG00000160014	CALM3	medium
ENSG00000160180	TFF3	medium
ENSG00000160191	PDE9A	medium
ENSG00000161217	PCYT1A	medium
ENSG00000161267	BDH1	medium
ENSG00000161526	SAP30BP	medium
ENSG00000161547	SRSF2	medium
ENSG00000162032	SPSB3	medium
ENSG00000162069	BICDL2	medium
ENSG00000162390	ACOT11	medium
ENSG00000162664	ZNF326	medium
ENSG00000163131	CTSS	medium
ENSG00000163362	INAVA	medium
ENSG00000163382	NAXE	medium
ENSG00000163597	SNHG16	medium
ENSG00000163624	CDS1	medium
ENSG00000163683	SMIM14	medium
ENSG00000163812	ZDHHC3	medium
ENSG00000164022	AIMP1	medium
ENSG00000164182	NDUFAF2	medium
ENSG00000164221	CCDC112	medium
ENSG00000164300	SERINC5	medium
ENSG00000164626	KCNK5	medium
ENSG00000164733	CTSB	medium
ENSG00000164749	HNF4G	medium
ENSG00000164897	TMUB1	medium
ENSG00000165209	STRBP	medium
ENSG00000165238	WNK2	medium
ENSG00000165264	NDUFB6	medium
ENSG00000165322	ARHGAP12	medium
ENSG00000165516	KLHDC2	medium
ENSG00000165527	ARF6	medium
ENSG00000165806	CASP7	medium
ENSG00000166170	BAG5	medium
ENSG00000166275	BORCS7	medium
ENSG00000166411	IDH3A	medium
ENSG00000166471	TMEM41B	medium
ENSG00000166710	B2M	medium
ENSG00000166747	AP1G1	medium
ENSG00000166797	CIAO2A	medium
ENSG00000166822	TMEM170A	medium
ENSG00000166869	CHP2	medium
ENSG00000166902	MRPL16	medium
ENSG00000167306	MYO5B	medium
ENSG00000167515	TRAPPC2L	medium
ENSG00000167565	SERTAD3	medium
ENSG00000167645	YIF1B	medium
ENSG00000167699	GLOD4	medium
ENSG00000167705	RILP	medium
ENSG00000167741	GGT6	medium
ENSG00000168002	POLR2G	medium
ENSG00000168066	SF1	medium
ENSG00000168237	GLYCTK	medium
ENSG00000168275	COA6	medium
ENSG00000168575	SLC20A2	medium
ENSG00000168765	GSTM4	medium
ENSG00000168903	BTNL3	medium
ENSG00000168961	LGALS9	medium
ENSG00000169718	DUS1L	medium
ENSG00000170545	SMAGP	medium
ENSG00000170584	NUDCD2	medium
ENSG00000170791	CHCHD7	medium
ENSG00000171204	TMEM126B	medium
ENSG00000171302	CANT1	medium
ENSG00000171314	PGAM1	medium
ENSG00000171475	WIPF2	medium
ENSG00000171634	BPTF	medium
ENSG00000171914	TLN2	medium
ENSG00000172053	QARS1	medium
ENSG00000172262	ZNF131	medium
ENSG00000172425	TTC36	medium
ENSG00000172428	COPS9	medium
ENSG00000172500	FIBP	medium
ENSG00000172663	TMEM134	medium
ENSG00000172775	PSME3IP1	medium
ENSG00000172939	OXSR1	medium
ENSG00000173153	ESRRA	medium
ENSG00000173163	COMMD1	medium
ENSG00000173327	MAP3K11	medium
ENSG00000173960	UBXN2A	medium
ENSG00000175265	GOLGA8A	medium
ENSG00000175334	BANF1	medium
ENSG00000175348	TMEM9B	medium
ENSG00000175893	ZDHHC21	medium
ENSG00000176261	ZBTB8OS	medium
ENSG00000176623	RMDN1	medium
ENSG00000176658	MYO1D	medium
ENSG00000176894	PXMP2	medium
ENSG00000176920	FUT2	medium
ENSG00000177106	EPS8L2	medium
ENSG00000177853	ZNF518A	medium
ENSG00000178078	STAP2	medium
ENSG00000179889	PDXDC1	medium
ENSG00000180992	MRPL14	medium
ENSG00000181222	POLR2A	medium
ENSG00000181274	FRAT2	medium
ENSG00000181555	SETD2	medium
ENSG00000181991	MRPS11	medium
ENSG00000182107	TMEM30B	medium
ENSG00000182149	IST1	medium
ENSG00000182165	NA	medium
ENSG00000182197	EXT1	medium
ENSG00000182307	C8orf33	medium
ENSG00000183576	SETD3	medium
ENSG00000183617	MRPL54	medium
ENSG00000184012	TMPRSS2	medium
ENSG00000184068	SREBF2-AS1	medium
ENSG00000184752	NDUFA12	medium
ENSG00000184992	BRI3BP	medium
ENSG00000185101	ANO9	medium
ENSG00000185813	PCYT2	medium
ENSG00000186204	CYP4F12	medium
ENSG00000187017	ESPN	medium
ENSG00000188529	SRSF10	medium
ENSG00000188554	NBR1	medium
ENSG00000188959	C9orf152	medium
ENSG00000196839	ADA	medium
ENSG00000197070	ARRDC1	medium
ENSG00000197555	SIPA1L1	medium
ENSG00000197586	ENTPD6	medium
ENSG00000198130	HIBCH	medium
ENSG00000198142	SOWAHC	medium
ENSG00000198157	HMGN5	medium
ENSG00000198589	LRBA	medium
ENSG00000198648	STK39	medium
ENSG00000198752	CDC42BPB	medium
ENSG00000198836	OPA1	medium
ENSG00000203485	INF2	medium
ENSG00000204220	PFDN6	medium
ENSG00000204287	HLA-DRA	medium
ENSG00000204356	NELFE	medium
ENSG00000204463	BAG6	medium
ENSG00000204580	DDR1	medium
ENSG00000204842	ATXN2	medium
ENSG00000204922	UQCC3	medium
ENSG00000204991	SPIRE2	medium
ENSG00000205213	LGR4	medium
ENSG00000205364	MT1M	medium
ENSG00000211895	IGHA1	medium
ENSG00000213047	DENND1B	medium
ENSG00000213442	RPL18AP3	medium
ENSG00000213463	SYNJ2BP	medium
ENSG00000213523	SRA1	medium
ENSG00000213563	C8orf82	medium
ENSG00000213593	TMX2	medium
ENSG00000213853	EMP2	medium
ENSG00000213918	DNASE1	medium
ENSG00000213977	TAX1BP3	medium
ENSG00000215193	PEX26	medium
ENSG00000217128	FNIP1	medium
ENSG00000224051	CPTP	medium
ENSG00000225969	NA	medium
ENSG00000226742	HSBP1L1	medium
ENSG00000229719	NA	medium
ENSG00000234545	FAM133B	medium
ENSG00000234771	NA	medium
ENSG00000238045	NA	medium
ENSG00000240230	COX19	medium
ENSG00000242612	DECR2	medium
ENSG00000243147	MRPL33	medium
ENSG00000246705	H2AJ	medium
ENSG00000248771	SMIM31	medium
ENSG00000250069	NA	medium
ENSG00000250317	SMIM20	medium
ENSG00000250722	SELENOP	medium
ENSG00000251022	THAP9-AS1	medium
ENSG00000256338	RPL41P2	medium
ENSG00000258890	CEP95	medium
ENSG00000261150	EPPK1	medium
ENSG00000261183	SPINT1-AS1	medium
ENSG00000266402	SNHG25	medium
ENSG00000270170	NCBP2AS2	medium
ENSG00000271447	MMP28	medium
ENSG00000278053	DDX52	medium
ENSG00000285933	NA	medium
