IdentityGene	GeneSymbol	Level
ENSG00000002933	TMEM176A	high
ENSG00000003402	CFLAR	high
ENSG00000019582	CD74	high
ENSG00000023445	BIRC3	high
ENSG00000034713	GABARAPL2	high
ENSG00000048740	CELF2	high
ENSG00000067082	KLF6	high
ENSG00000068796	KIF2A	high
ENSG00000075292	ZNF638	high
ENSG00000075618	FSCN1	high
ENSG00000077984	CST7	high
ENSG00000080503	SMARCA2	high
ENSG00000080546	SESN1	high
ENSG00000084070	SMAP2	high
ENSG00000084733	RAB10	high
ENSG00000090104	RGS1	high
ENSG00000096060	FKBP5	high
ENSG00000099995	SF3A1	high
ENSG00000100906	NFKBIA	high
ENSG00000101109	STK4	high
ENSG00000102524	TNFSF13B	high
ENSG00000102893	PHKB	high
ENSG00000103024	NME3	high
ENSG00000103187	COTL1	high
ENSG00000103811	CTSH	high
ENSG00000104714	ERICH1	high
ENSG00000105246	EBI3	high
ENSG00000106565	TMEM176B	high
ENSG00000107372	ZFAND5	high
ENSG00000107551	RASSF4	high
ENSG00000108639	SYNGR2	high
ENSG00000109321	AREG	high
ENSG00000111275	ALDH2	high
ENSG00000111678	C12orf57	high
ENSG00000112149	CD83	high
ENSG00000115738	ID2	high
ENSG00000115935	WIPF1	high
ENSG00000116717	GADD45A	high
ENSG00000118418	HMGN3	high
ENSG00000118816	CCNI	high
ENSG00000119508	NR4A3	high
ENSG00000119900	OGFRL1	high
ENSG00000120675	DNAJC15	high
ENSG00000120875	DUSP4	high
ENSG00000124762	CDKN1A	high
ENSG00000125534	PPDPF	high
ENSG00000125970	RALY	high
ENSG00000128016	ZFP36	high
ENSG00000131203	IDO1	high
ENSG00000131378	RFTN1	high
ENSG00000132002	DNAJB1	high
ENSG00000132329	RAMP1	high
ENSG00000132424	PNISR	high
ENSG00000134107	BHLHE40	high
ENSG00000134884	ARGLU1	high
ENSG00000135596	MICAL1	high
ENSG00000135837	CEP350	high
ENSG00000136003	ISCU	high
ENSG00000137312	FLOT1	high
ENSG00000137509	PRCP	high
ENSG00000138166	DUSP5	high
ENSG00000140612	SEC11A	high
ENSG00000141232	TOB1	high
ENSG00000141682	PMAIP1	high
ENSG00000143198	MGST3	high
ENSG00000145819	ARHGAP26	high
ENSG00000154978	VOPP1	high
ENSG00000155307	SAMSN1	high
ENSG00000155307	LOC388813	high
ENSG00000155962	CLIC2	high
ENSG00000156976	EIF4A2	high
ENSG00000157514	TSC22D3	high
ENSG00000158050	DUSP2	high
ENSG00000159128	IFNGR2	high
ENSG00000161011	SQSTM1	high
ENSG00000162434	JAK1	high
ENSG00000164032	H2AZ1	high
ENSG00000165637	VDAC2	high
ENSG00000167468	GPX4	high
ENSG00000168214	RBPJ	high
ENSG00000168264	IRF2BP2	high
ENSG00000168685	IL7R	high
ENSG00000170296	GABARAP	high
ENSG00000172292	CERS6	high
ENSG00000173848	NET1	high
ENSG00000175130	MARCKSL1	high
ENSG00000180758	GPR157	high
ENSG00000184922	FMNL1	high
ENSG00000185215	TNFAIP2	high
ENSG00000185236	RAB11B	high
ENSG00000196396	PTPN1	high
ENSG00000197329	PELI1	high
ENSG00000197747	S100A10	high
ENSG00000198382	UVRAG	high
ENSG00000212907	ND4L	high
ENSG00000221869	CEBPD	high
ENSG00000228253	ATP8	high
ENSG00000248527	MTATP6P1	high
ENSG00000261040	WFDC21P	high
ENSG00000277443	MARCKS	high
ENSG00000102962	CCL22	medium
ENSG00000117036	ETV3	medium
ENSG00000123349	PFDN5	medium
ENSG00000127184	COX7C	medium
ENSG00000130592	LSP1	medium
ENSG00000133639	BTG1	medium
ENSG00000135390	ATP5MC2	medium
ENSG00000136810	TXN	medium
ENSG00000137818	RPLP1	medium
ENSG00000143947	RPS27A	medium
ENSG00000148303	RPL7A	medium
ENSG00000164587	RPS14	medium
ENSG00000166128	RAB8B	medium
ENSG00000167658	EEF2	medium
ENSG00000171223	JUNB	medium
ENSG00000172809	RPL38	medium
ENSG00000177606	JUN	medium
ENSG00000181163	NPM1	medium
ENSG00000184009	ACTG1	medium
ENSG00000196262	PPIA	medium
ENSG00000198786	ND5	medium
ENSG00000198886	ND4	medium
ENSG00000198899	ATP6	medium
ENSG00000198938	COX3	medium
ENSG00000204287	HLA-DRA	medium
ENSG00000204389	HSPA1A	medium
ENSG00000211459	NA	medium
ENSG00000234745	HLA-B	medium
