IdentityGene	GeneSymbol	Level
ENSG00000005483	KMT2E	high
ENSG00000007944	MYLIP	high
ENSG00000008952	SEC62	high
ENSG00000010810	FYN	high
ENSG00000047365	ARAP2	high
ENSG00000048740	CELF2	high
ENSG00000051108	HERPUD1	high
ENSG00000051523	CYBA	high
ENSG00000057657	PRDM1	high
ENSG00000067066	SP100	high
ENSG00000067082	KLF6	high
ENSG00000067560	RHOA	high
ENSG00000069667	RORA	high
ENSG00000070831	CDC42	high
ENSG00000072818	ACAP1	high
ENSG00000077984	CST7	high
ENSG00000085224	ATRX	high
ENSG00000086061	DNAJA1	high
ENSG00000089220	PEBP1	high
ENSG00000090104	RGS1	high
ENSG00000092010	PSME1	high
ENSG00000092199	HNRNPC	high
ENSG00000092820	EZR	high
ENSG00000099341	PSMD8	high
ENSG00000099622	CIRBP	high
ENSG00000100906	NFKBIA	high
ENSG00000101182	PSMA7	high
ENSG00000102760	RGCC	high
ENSG00000103363	ELOB	high
ENSG00000105323	HNRNPUL1	high
ENSG00000105374	NKG7	high
ENSG00000105404	RABAC1	high
ENSG00000105968	H2AZ2	high
ENSG00000106803	SEC61B	high
ENSG00000106829	TLE4	high
ENSG00000108654	DDX5	high
ENSG00000109321	AREG	high
ENSG00000110848	CD69	high
ENSG00000110958	PTGES3	high
ENSG00000111011	RSRC2	high
ENSG00000111229	ARPC3	high
ENSG00000111371	SLC38A1	high
ENSG00000111640	GAPDH	high
ENSG00000111796	KLRB1	high
ENSG00000112695	COX7A2	high
ENSG00000113088	GZMK	high
ENSG00000113387	SUB1	high
ENSG00000113558	SKP1	high
ENSG00000113580	NR3C1	high
ENSG00000115128	SF3B6	high
ENSG00000115738	ID2	high
ENSG00000115935	WIPF1	high
ENSG00000116741	RGS2	high
ENSG00000118058	KMT2A	high
ENSG00000118503	TNFAIP3	high
ENSG00000118680	MYL12B	high
ENSG00000119541	VPS4B	high
ENSG00000120129	DUSP1	high
ENSG00000120690	ELF1	high
ENSG00000122417	ODF2L	high
ENSG00000122545	SEPTIN7	high
ENSG00000123146	ADGRE5	high
ENSG00000125347	IRF1	high
ENSG00000125740	FOSB	high
ENSG00000125971	DYNLRB1	high
ENSG00000126756	UXT	high
ENSG00000127540	UQCR11	high
ENSG00000127824	TUBA4A	high
ENSG00000128016	ZFP36	high
ENSG00000132002	DNAJB1	high
ENSG00000133321	PLAAT4	high
ENSG00000134294	SLC38A2	high
ENSG00000134884	ARGLU1	high
ENSG00000135046	ANXA1	high
ENSG00000135404	CD63	high
ENSG00000135940	COX5B	high
ENSG00000135968	GCC2	high
ENSG00000136167	LCP1	high
ENSG00000136527	TRA2B	high
ENSG00000138646	HERC5	high
ENSG00000138767	CNOT6L	high
ENSG00000139218	SCAF11	high
ENSG00000139278	GLIPR1	high
ENSG00000141232	TOB1	high
ENSG00000142227	EMP3	high
ENSG00000142864	SERBP1	high
ENSG00000143384	MCL1	high
ENSG00000143549	TPM3	high
ENSG00000143933	CALM2	high
ENSG00000144028	SNRNP200	high
ENSG00000144746	ARL6IP5	high
ENSG00000144802	NFKBIZ	high
ENSG00000145220	LYAR	high
ENSG00000145675	PIK3R1	high
ENSG00000146285	SCML4	high
ENSG00000147872	PLIN2	high
ENSG00000150093	ITGB1	high
ENSG00000150593	PDCD4	high
ENSG00000151883	PARP8	high
ENSG00000153234	NR4A2	high
ENSG00000153563	CD8A	high
ENSG00000156467	UQCRB	high
ENSG00000156650	KAT6B	high
ENSG00000158050	DUSP2	high
ENSG00000161011	SQSTM1	high
ENSG00000163191	S100A11	high
ENSG00000163660	CCNL1	high
ENSG00000164105	SAP30	high
ENSG00000164543	STK17A	high
ENSG00000164674	SYTL3	high
ENSG00000164691	TAGAP	high
ENSG00000166794	PPIB	high
ENSG00000166848	TERF2IP	high
ENSG00000166848	LOC105371348	high
ENSG00000168209	DDIT4	high
ENSG00000168685	IL7R	high
ENSG00000169045	HNRNPH1	high
ENSG00000169230	PRELID1	high
ENSG00000170571	EMB	high
ENSG00000170776	AKAP13	high
ENSG00000171476	HOPX	high
ENSG00000171634	BPTF	high
ENSG00000172216	CEBPB	high
ENSG00000172543	CTSW	high
ENSG00000173660	UQCRH	high
ENSG00000174718	RESF1	high
ENSG00000174946	GPR171	high
ENSG00000177606	JUN	high
ENSG00000178449	COX14	high
ENSG00000179144	GIMAP7	high
ENSG00000179820	MYADM	high
ENSG00000183508	TENT5C	high
ENSG00000184203	PPP1R2	high
ENSG00000184205	TSPYL2	high
ENSG00000184897	H1-10	high
ENSG00000185088	RPS27L	high
ENSG00000185338	SOCS1	high
ENSG00000189043	NDUFA4	high
ENSG00000189067	LITAF	high
ENSG00000196199	MPHOSPH8	high
ENSG00000197111	PCBP2	high
ENSG00000197747	S100A10	high
ENSG00000205352	PRR13	high
ENSG00000205581	HMGN1	high
ENSG00000212907	ND4L	high
ENSG00000215301	DDX3X	high
ENSG00000221869	CEBPD	high
ENSG00000235576	NA	high
ENSG00000236278	NA	high
ENSG00000244754	N4BP2L2	high
ENSG00000247774	PCED1B-AS1	high
ENSG00000255302	EID1	high
ENSG00000265241	RBM8A	high
ENSG00000265681	RPL17	high
ENSG00000267519	NA	high
ENSG00000271503	CCL5	high
ENSG00000275302	CCL4	high
ENSG00000008018	PSMB1	medium
ENSG00000058272	PPP1R12A	medium
ENSG00000087086	FTL	medium
ENSG00000104529	EEF1D	medium
ENSG00000105193	RPS16	medium
ENSG00000105372	RPS19	medium
ENSG00000105887	MTPN	medium
ENSG00000105887	LUZP6	medium
ENSG00000108298	RPL19	medium
ENSG00000114942	EEF1B2	medium
ENSG00000115232	ITGA4	medium
ENSG00000116473	RAP1A	medium
ENSG00000118181	RPS25	medium
ENSG00000122026	RPL21	medium
ENSG00000122862	SRGN	medium
ENSG00000125870	SNRPB2	medium
ENSG00000129515	SNX6	medium
ENSG00000132475	H3-3B	medium
ENSG00000142534	RPS11	medium
ENSG00000142541	RPL13A	medium
ENSG00000143947	RPS27A	medium
ENSG00000144747	TMF1	medium
ENSG00000145494	NDUFS6	medium
ENSG00000147403	RPL10	medium
ENSG00000149806	FAU	medium
ENSG00000156508	EEF1A1	medium
ENSG00000160948	VPS28	medium
ENSG00000161016	RPL8	medium
ENSG00000162244	RPL29	medium
ENSG00000166441	RPL27A	medium
ENSG00000166595	CIAO2B	medium
ENSG00000171223	JUNB	medium
ENSG00000174444	RPL4	medium
ENSG00000182117	NOP10	medium
ENSG00000182899	RPL35A	medium
ENSG00000187514	PTMA	medium
ENSG00000188846	RPL14	medium
ENSG00000197756	RPL37A	medium
ENSG00000198886	ND4	medium
ENSG00000231500	RPS18	medium
ENSG00000233927	RPS28	medium
