<?xml version='1.0' encoding='UTF-8'?>
<!-- This file was generated by dvisvgm 3.2.2 -->
<svg version='1.1' xmlns='http://www.w3.org/2000/svg' xmlns:xlink='http://www.w3.org/1999/xlink' width='8.537986pt' height='8.498138pt' viewBox='167.586562 -7.795769 8.537986 8.498138'>
<defs>
<path id='g0-137' d='M2.889166-1.872976C2.86924-1.853051 2.839352-1.863014 2.809465-1.882939C2.789539-1.902864 2.779577-1.932752 2.789539-1.952677C2.809465-1.972603 2.839352-1.96264 2.86924-1.942715C2.889166-1.92279 2.899128-1.892902 2.889166-1.872976ZM2.729763-2.092154C2.749689-2.062267 2.749689-2.032379 2.729763-2.022416S2.67995-2.022416 2.660025-2.052304C2.6401-2.072229 2.6401-2.11208 2.660025-2.122042S2.709838-2.11208 2.729763-2.092154ZM2.500623-2.321295C2.49066-2.30137 2.470735-2.30137 2.450809-2.311333S2.420922-2.331258 2.430884-2.351183S2.450809-2.371108 2.470735-2.361146S2.510585-2.331258 2.500623-2.321295ZM2.620174-2.191781C2.600249-2.171856 2.580324-2.181818 2.560399-2.201743S2.530511-2.241594 2.550436-2.261519C2.560399-2.271482 2.590286-2.261519 2.610212-2.241594S2.630137-2.201743 2.620174-2.191781ZM3.098381-1.77335C3.088418-1.753425 3.058531-1.743462 3.028643-1.753425S2.968867-1.793275 2.978829-1.8132S3.01868-1.843088 3.048568-1.833126S3.108344-1.793275 3.098381-1.77335ZM3.327522-1.753425C3.327522-1.733499 3.297634-1.713574 3.267746-1.713574S3.20797-1.733499 3.20797-1.753425S3.237858-1.803238 3.267746-1.803238C3.307597-1.803238 3.327522-1.77335 3.327522-1.753425ZM3.5467-1.793275C3.5467-1.77335 3.516812-1.753425 3.486924-1.743462S3.437111-1.753425 3.427148-1.77335S3.447073-1.8132 3.476961-1.823163S3.536737-1.8132 3.5467-1.793275ZM7.113325-3.556663C7.113325-2.30137 6.296389-1.235367 5.17061-.856787C5.021171-.826899 4.971357-.916563 4.971357-.996264C4.971357-1.085928 4.98132-1.39477 4.98132-1.77335C4.98132-2.042341 4.881694-2.211706 4.782067-2.30137C5.419676-2.371108 6.087173-2.610212 6.087173-3.706102C6.087173-4.014944 5.967621-4.273973 5.788294-4.473225C5.818182-4.542964 5.927771-4.83188 5.768369-5.230386C5.529265-5.300125 4.98132-4.931507 4.98132-4.931507C4.752179-5.001245 4.523039-5.021171 4.273973-5.021171S3.785803-5.001245 3.556663-4.931507C3.556663-4.931507 3.008717-5.300125 2.769614-5.230386C2.610212-4.83188 2.719801-4.542964 2.749689-4.473225C2.570361-4.273973 2.450809-4.014944 2.450809-3.706102C2.450809-2.620174 3.118306-2.371108 3.755915-2.30137C3.676214-2.231631 3.596513-2.102117 3.566625-1.92279C3.407223-1.853051 2.988792-1.723537 2.739726-2.161893C2.580324-2.430884 2.311333-2.450809 2.311333-2.450809C2.032379-2.450809 2.281445-2.271482 2.281445-2.271482C2.470735-2.191781 2.600249-1.863014 2.600249-1.863014C2.769614-1.354919 3.556663-1.524284 3.556663-1.524284C3.566625-1.285181 3.566625-1.066002 3.566625-.996264C3.566625-.916563 3.516812-.826899 3.367372-.856787C2.241594-1.235367 1.424658-2.30137 1.424658-3.556663C1.424658-5.13076 2.699875-6.405978 4.273973-6.405978S7.113325-5.13076 7.113325-3.556663ZM8.537983-6.22665C8.537983-7.113325 7.820672-7.830635 6.933998-7.830635H1.603985C.71731-7.830635 0-7.113325 0-6.22665V-.886675C0 0 .71731 .707347 1.603985 .707347H6.933998C7.820672 .707347 8.537983 0 8.537983-.886675V-6.22665Z'/>
</defs>
<g id='page1'>
<use x='167.586562' y='0' xlink:href='#g0-137'/>
</g>
</svg>