{
    "build": {"dockerfile": "../Dockerfile"},
    "remoteUser": "builder",
    "privileged": true,

    "customizations": {
      "vscode": {
        "extensions": ["ms-vscode.cpptools-extension-pack", "xaver.clang-format"],
        "settings": {
            "cmake.buildDirectory": "/tmp/build"
        }
      }
    }
}
