{
    "image": "registry.gitlab.com/buildgrid/buildbox/buildbox-common:latest",
    "remoteUser": "builder",

    "customizations": {
      "vscode": {
        "extensions": ["ms-vscode.cpptools-extension-pack", "xaver.clang-format"],
        "settings": {
            "cmake.buildDirectory": "/tmp/build"
        }
      }
    }
}
