{
    "build": {"dockerfile": "Dockerfile"},
    "remoteUser": "builder",
    "capAdd": ["SYS_ADMIN"],
    "runArgs": ["--device", "/dev/fuse"],
    "postStartCommand" : "nohup bash -c '/usr/local/bin/buildbox-casd --log-level=debug /tmp/casd --quota-high=20G --quota-low=15G > /tmp/buildbox-casd.log 2>&1 &' ",
    "mounts": [{"source": "casd-cache-volume", "target": "/tmp/casd", "type": "volume"}],


    "customizations": {
      "vscode": {
        "extensions": ["ms-vscode.cpptools-extension-pack", "xaver.clang-format"],
        "settings": {
          "cmake.configureSettings": {"CMAKE_CXX_COMPILER_LAUNCHER": "/usr/local/bin/recc", "CMAKE_C_COMPILER_LAUNCHER": "/usr/local/bin/recc"}
        }
      }
    }
}
