%YAML 1.1
%TAG !u! tag:unity3d.com,2011:
--- !u!114 &11400000
MonoBehaviour:
  m_ObjectHideFlags: 0
  m_CorrespondingSourceObject: {fileID: 0}
  m_PrefabInstance: {fileID: 0}
  m_PrefabAsset: {fileID: 0}
  m_GameObject: {fileID: 0}
  m_Enabled: 1
  m_EditorHideFlags: 0
  m_Script: {fileID: 11500000, guid: e5a6e4141e60a524ca41ffe5546c783c, type: 3}
  m_Name: Fast2
  m_EditorClassIdentifier: 
  health: 30
  speed: 30
  fireRate: 0.25
  worth: 15
  range: 15
