{
  "data_exploit":[
  {"title":"Actrius","cast":["[[Núria Espert]]","[[Rosa Maria Sardà]]","[[Anna Lizaran]]","[[Mercè Pons]]"],"directors":["[[Ventura Pons]]"],"producers":["[[Ventura Pons]]"],"companies":["[[Buena Vista International]]"],"year":1997},
  {"title":"Army of Darkness","cast":["[[Bruce Campbell]]","[[Embeth Davidtz]]","[[Marcus Gilbert (actor)|Marcus Gilbert]]","[[Ian Abercrombie]]","Richard Grove","Timothy Patrick Quill","Michael Earl Reid","[[Bridget Fonda]]","[[Bill Moseley]]","[[Patricia Tallman]]","[[Ted Raimi]]","[[Angela Featherstone]]"],"directors":["[[Sam Raimi]]"],"producers":["[[Robert Tapert]]"],"companies":["[[Dino De Laurentiis|Dino De Laurentiis Communications]]","[[Renaissance Pictures]]","[[Introvision International]]","[[Universal Pictures]]"],"year":1992},
  {"title":"The Birth of a Nation","cast":["[[Lillian Gish]]","[[Mae Marsh]]","[[Henry B. Walthall]]","[[Miriam Cooper]]","[[Ralph Lewis (actor)|Ralph Lewis]]","[[George Siegmann]]","[[Walter Long (actor)|Walter Long]]","[[Mary Alden]]","[[Wallace Reid]]","[[Joseph Henabery]]","[[Elmer Clifton]]","[[Robert Harron]]","[[Josephine Crowell]]","[[Spottiswoode Aitken]]","[[George Beranger]]","Maxfield Stanley","[[Jennie Lee (American actress)|Jennie Lee]]","[[Donald Crisp]]","[[Howard Gaye]]","[[Harry Braham]]","[[Edmund Burns]]","[[David Butler (director)|David Butler]]","William Freeman","[[Sam De Grasse]]","[[Olga Grey]]","[[Russell Hicks (actor)|Russell Hicks]]","[[Elmo Lincoln]]","[[Eugene Pallette]]","[[Charles Stevens (actor)|Charles Stevens]]","[[Madame Sul-Te-Wan]]","[[Raoul Walsh]]","Lenore Cooper","[[Violet Wilkey]]","[[Tom Wilson (actor)|Tom Wilson]]","Donna Montran","Alberta Lee","Allan Sears","[[Vester Pegg]]","[[Alma Rubens]]","[[Mary Wynn]]","[[Jules White]]","[[Monte Blue]]","[[Gibson Gowland]]","[[Fred Burns (actor)|Fred Burns]]","[[Charles King (character actor)|Charles King]]"],"directors":["[[D. W. Griffith]]"],"producers":["[[D. W. Griffith]]","[[Harry Aitken]]"],"companies":["David W. Griffith Corp.","Epoch Producing Co."],"year":1915},
  {"title":"Blade Runner","cast":["[[Harrison Ford]]","[[Rutger Hauer]]","[[Sean Young]]","[[Edward James Olmos]]","[[M. Emmet Walsh]]","[[Daryl Hannah]]","[[William Sanderson]]","[[Brion James]]","[[Joe Turkel]]","[[Joanna Cassidy]]","[[James Hong]]","[[Morgan Paull]]","[[Hy Pyke]]"],"directors":["[[Ridley Scott]]"],"producers":["[[Michael Deeley]]"],"companies":["[[The Ladd Company]]","[[Shaw Brothers]]","Blade Runner Partnership","[[Warner Bros.]]"],"year":1982},
  {"title":"Blazing Saddles","cast":["[[Cleavon Little]]","[[Gene Wilder]]","[[Slim Pickens]]","[[Alex Karras]]","[[Mel Brooks]]","[[Harvey Korman]]","[[Madeline Kahn]]","[[Burton Gilliam]]","[[David Huddleston]]","[[Liam Dunn]]","[[John Hillerman]]","[[George Furth]]","[[Jack Starrett|Claude Ennis Starrett, Jr.]]","[[Carol Arthur]]","Richard Collier","[[Charles McGregor]]","[[Robyn Hilton]]","[[Don Megowan]]","[[Dom DeLuise]]","[[Count Basie]]","[[Rodney Allen Rippy]]","[[Robert Ridgely]]","[[Ralph Manza]]"],"directors":["[[Mel Brooks]]"],"producers":["[[Michael Hertzberg]]"],"companies":["Crossbow Productions","[[Warner Bros.]]"],"year":1974},
  {"title":"Blue Velvet (film)","cast":["[[Kyle MacLachlan]]","[[Isabella Rossellini]]","[[Dennis Hopper]]","[[Laura Dern]]","[[Hope Lange]]","[[George Dickerson]]","[[Dean Stockwell]]","[[Priscilla Pointer]]","[[Frances Bay]]","Jack Harvey","Ken Stovitz","[[Brad Dourif]]","[[Jack Nance]]","J. Michael Hunter","Dick Green","[[Fred Pickler]]","[[Megan Mullally]]","Jon Jon Snipes"],"directors":["[[David Lynch]]"],"producers":["[[Fred C. Caruso|Fred Caruso]]"],"companies":["[[De Laurentiis Entertainment Group]]"],"year":1986},
  {"title":"Barry Lyndon","cast":["[[Ryan O'Neal]]","[[Marisa Berenson]]","[[Patrick Magee (actor)|Patrick Magee]]","[[Hardy Kruger]]","[[Diana Koerner]]","[[Gay Hamilton]]","[[Michael Hordern]]","[[Hardy Krüger]]","[[Godfrey Quigley]]","[[Steven Berkoff]]","[[Marie Kean]]","[[Murray Melvin]]","[[Frank Middlemass]]","[[Leon Vitali]]","[[Dominic Savage]]","[[Leonard Rossiter]]","[[André Morell]]","[[Anthony Sharp]]","[[Philip Stone]]","[[David Morley (musician)|David Morley]]","[[Diana Körner|Diana Koerner]]","[[Arthur O'Sullivan]]","[[Billy Boyle]]","[[Jonathan Cecil]]","[[Peter Cellier]]","[[Geoffrey Chater]]","[[Wolf Kahler]]","[[Liam Redmond]]","[[Roger Booth (actor)|Roger Booth]]","[[Ferdy Mayne]]","[[John Sharp (actor)|John Sharp]]","[[Pat Roach]]","[[Hans Meyer (actor)|Hans Meyer]]"],"directors":["[[Stanley Kubrick]]"],"producers":["[[Stanley Kubrick]]"],"companies":["[[Hawk Films]]","Peregrine Productions","[[Warner Bros.]]","[[Columbia Pictures|Columbia]]-Warner Distributors"],"year":1975},
  {"title":"Buffy the Vampire Slayer (film)","cast":["[[Kristy Swanson]]","[[Donald Sutherland]]","[[Paul Reubens]]","[[Rutger Hauer]]","[[Luke Perry]]","[[Hilary Swank]]","Paris Vaughan","Michele Abrams","[[Randall Batinkoff]]","[[David Arquette]]","[[Stephen Root]]","[[Natasha Gregson Wagner]]","[[Sasha Jenson]]","[[Thomas Jane|Tom Jane]]","[[Candy Clark]]","[[Ben Affleck]]","[[Ricki Lake]]","[[Seth Green]]","[[Robert Arquette]]"],"directors":["[[Fran Rubel Kuzui]]"],"producers":["[[Howard Rosenman]]","[[Kaz Kuzui]]"],"companies":["Sandollar Productions","Kuzui Enterprises","[[20th Century Fox]]"],"year":1992},
  {"title":"Braveheart","cast":["[[Mel Gibson]]","[[Sophie Marceau]]","[[Patrick McGoohan]]","[[Catherine McCormack]]","[[Brendan Gleeson]]","James Robinson","[[Angus Macfadyen]]","Mhairi Calvey","Andrew Weir","[[Peter Hanly]]","[[James Cosmo]]","[[David O'Hara]]","[[Ian Bannen]]","[[Seán McGinley]]","[[Brian Cox (actor)|Brian Cox]]","[[Sean Lawlor]]","Sandy Nelson","[[Stephen Billington]]","[[John Kavanagh (actor)|John Kavanagh]]","[[Alun Armstrong]]","John Murtagh","[[Tommy Flanagan (actor)|Tommy Flanagan]]","[[Donal Gibson]]","Jeanne Marine","[[Michael Byrne (actor)|Michael Byrne]]","[[Malcolm Tierney]]","[[Bernard Horsfall]]","[[Peter Mullan]]","[[Gerard McSorley]]","[[Richard Leaf]]","[[Mark Lees]]","[[Tam White]]","[[Jimmy Chisholm]]","[[David Gant]]"],"directors":["[[Mel Gibson]]"],"producers":["[[Mel Gibson]]","[[Alan Ladd Jr.]]","[[Bruce Davey]]"],"companies":["[[Icon Productions]]","[[The Ladd Company]]","[[Paramount Pictures]]","[[20th Century Fox]]"],"year":1995},
  {"title":"Batman (1989 film)","cast":["[[Jack Nicholson]]","[[Michael Keaton]]","[[Kim Basinger]]","[[Robert Wuhl]]","[[Pat Hingle]]","[[Billy Dee Williams]]","[[Michael Gough]]","[[Jack Palance]]","[[Jerry Hall]]","[[Tracey Walter]]","[[Lee Wallace (actor)|Lee Wallace]]","[[William Hootkins]]","[[Hugo Blick|Hugo E. Blick]]","Charles Roskilly","David Baxt","Sharon Holm","[[Garrick Hagon]]","Liza Ross","Adrian Meyers"],"directors":["[[Tim Burton]]"],"producers":["[[Jon Peters]]","[[Peter Guber]]"],"companies":["Guber-Peters Company","[[Warner Bros.]]"],"year":1989}
  ]}