<?xml version="1.0" encoding="UTF-8" standalone="no"?>
<!-- Created with Inkscape (http://www.inkscape.org/) -->

<svg
   xmlns:dc="http://purl.org/dc/elements/1.1/"
   xmlns:cc="http://creativecommons.org/ns#"
   xmlns:rdf="http://www.w3.org/1999/02/22-rdf-syntax-ns#"
   xmlns:svg="http://www.w3.org/2000/svg"
   xmlns="http://www.w3.org/2000/svg"
   xmlns:sodipodi="http://sodipodi.sourceforge.net/DTD/sodipodi-0.dtd"
   xmlns:inkscape="http://www.inkscape.org/namespaces/inkscape"
   width="320mm"
   height="450mm"
   viewBox="0 0 320 450"
   version="1.1"
   id="svg9650"
   inkscape:version="0.92.4 (5da689c313, 2019-01-14)"
   sodipodi:docname="marker-bleu-2.svg">
  <defs
     id="defs9644" />
  <sodipodi:namedview
     id="base"
     pagecolor="#ffffff"
     bordercolor="#666666"
     borderopacity="1.0"
     inkscape:pageopacity="0.0"
     inkscape:pageshadow="2"
     inkscape:zoom="0.35"
     inkscape:cx="400"
     inkscape:cy="560"
     inkscape:document-units="mm"
     inkscape:current-layer="layer1"
     showgrid="false"
     inkscape:pagecheckerboard="true"
     inkscape:window-width="3840"
     inkscape:window-height="2104"
     inkscape:window-x="-16"
     inkscape:window-y="-16"
     inkscape:window-maximized="1" />
  <metadata
     id="metadata9647">
    <rdf:RDF>
      <cc:Work
         rdf:about="">
        <dc:format>image/svg+xml</dc:format>
        <dc:type
           rdf:resource="http://purl.org/dc/dcmitype/StillImage" />
        <dc:title></dc:title>
      </cc:Work>
    </rdf:RDF>
  </metadata>
  <g
     inkscape:label="Calque 1"
     inkscape:groupmode="layer"
     id="layer1"
     transform="translate(0,153)">
    <g
       id="g9699"
       transform="translate(-68.338096,88.144051)">
      <title
         id="title9701">Marker</title>
      <g
         style="fill:#007bff;fill-opacity:1"
         transform="matrix(2.8792018,0,0,2.8345396,-1322.8339,-594.54442)"
         id="g9664">
        <title
           id="title9682">marker</title>
        <path
           inkscape:connector-curvature="0"
           id="path9680"
           d="m 537.59555,283.39157 c -0.46014,-0.2329 -4.62533,-5.91649 -10.13753,-13.8331 -1.70265,-2.44534 -9.30904,-13.85835 -11.47412,-17.21636 -2.42073,-3.75449 -5.41325,-8.59641 -8.33976,-13.49375 -1.65222,-2.76489 -3.11311,-5.20567 -3.24641,-5.42395 -3.146,-5.15133 -9.97269,-18.18621 -12.60977,-24.07709 -0.94457,-2.11005 -1.88728,-4.19364 -2.09489,-4.6302 -1.08238,-2.27592 -4.03416,-10.7232 -4.76144,-13.62604 -1.23709,-4.93773 -1.28123,-5.32513 -1.29628,-11.37709 -0.0151,-6.06579 0.1204,-7.40006 1.20895,-11.90625 3.29664,-13.64678 11.9015,-25.87766 23.69585,-33.68107 6.73955,-4.45904 13.58241,-7.17877 21.91165,-8.70889 2.79991,-0.51436 15.26409,-0.42317 17.85938,0.13067 4.22169,0.9009 5.71467,1.28417 7.91136,2.03097 11.67877,3.97036 21.70572,11.51762 28.66385,21.5752 3.75079,5.42155 6.96423,12.5136 8.28384,18.28239 1.01257,4.42654 1.19139,5.8096 1.34788,10.4249 0.18355,5.41307 -0.0519,7.97154 -1.13176,12.2969 -0.95108,3.80964 -3.72696,11.92795 -4.97789,14.55831 -0.20762,0.43656 -1.15801,2.53719 -2.11199,4.66807 -2.76764,6.18205 -8.75065,17.57022 -12.9075,24.56838 -0.30253,0.50933 -1.67886,2.83105 -3.0585,5.15938 -1.37965,2.32833 -2.77388,4.65005 -3.09829,5.15937 -0.32442,0.50933 -1.17225,1.84575 -1.88407,2.96983 -3.15997,4.99012 -4.69388,7.35159 -8.7263,13.43434 -2.36352,3.56526 -5.05147,7.56215 -5.97324,8.88198 -6.04402,8.65416 -9.69536,13.6018 -10.22119,13.84995 -0.74515,0.35165 -2.11998,0.34347 -2.83183,-0.0168 z m 4.02855,-10.74269 c 3.78795,-5.33713 12.8436,-18.70121 15.50811,-22.88645 0.5327,-0.83675 1.36552,-2.14644 1.85069,-2.91042 0.48517,-0.76398 1.33668,-2.10344 1.89223,-2.97656 2.12946,-3.34673 3.60377,-5.71782 4.13764,-6.65444 0.23634,-0.41464 1.08064,-1.82546 1.87622,-3.13514 4.409,-7.25813 12.95259,-23.27613 14.84032,-27.82347 0.232,-0.55886 0.79759,-1.90909 1.25686,-3.00049 1.87795,-4.46271 2.59376,-6.35093 3.4103,-8.99583 0.47171,-1.52797 1.01388,-3.25438 1.20482,-3.83646 0.49209,-1.50019 0.59329,-2.01713 1.19076,-6.08282 0.5067,-3.44802 0.51333,-3.82813 0.13557,-7.77754 -0.4523,-4.72873 -0.71886,-6.33054 -1.61209,-9.68756 -4.40525,-16.55603 -18.07611,-30.22641 -34.64161,-34.64038 -5.41986,-1.44415 -12.1702,-2.14305 -16.72621,-1.73176 -8.51593,0.76878 -13.54839,2.15638 -20.31258,5.60081 -13.63039,6.94081 -23.53554,20.61022 -25.92398,35.77586 -0.89608,5.68982 -0.98688,8.47702 -0.40584,12.45797 0.89846,6.1557 2.59974,11.46087 6.91505,21.56354 0.98669,2.30998 5.84348,11.94689 8.09636,16.06494 3.54158,6.47365 5.9146,10.56436 9.82239,16.93226 3.061,4.98802 3.39255,5.51626 6.5241,10.39447 1.74519,2.71859 6.56264,9.94233 9.61644,14.41979 2.59658,3.80709 3.07547,4.49602 5.33363,7.67291 0.72406,1.01865 1.74575,2.47716 2.27041,3.24115 0.52467,0.76398 1.04219,1.38906 1.15005,1.38906 0.10786,0 1.27352,-1.51805 2.59036,-3.37344 z m -6.93896,-68.59839 c -3.32786,-0.60879 -7.45505,-2.60057 -10.47815,-5.05675 -3.63895,-2.95654 -6.27875,-6.74348 -7.94231,-11.39366 -0.87066,-2.43379 -0.8808,-2.51542 -0.8808,-7.09234 0,-4.58753 0.008,-4.65337 0.89387,-7.14375 2.74038,-7.70589 7.92337,-12.88887 15.62926,-15.62925 2.49038,-0.88563 2.55622,-0.89387 7.14375,-0.89387 4.57692,0 4.65855,0.0101 7.09234,0.8808 3.15057,1.12708 5.3789,2.3725 7.83953,4.38155 3.61072,2.94807 6.19203,6.66585 7.85421,11.31219 0.87066,2.43379 0.8808,2.51542 0.8808,7.09233 0,4.58754 -0.008,4.65338 -0.89387,7.14375 -2.74453,7.71756 -7.99311,12.95872 -15.62926,15.60716 -2.32051,0.80482 -2.80816,0.87799 -6.35,0.95281 -2.11005,0.0446 -4.43177,-0.0279 -5.15937,-0.16097 z m 7.65325,-5.53918 c 6.02761,-1.04388 10.46628,-4.31508 13.15007,-9.69131 0.83756,-1.67781 1.18191,-2.81295 1.59771,-5.2668 0.50984,-3.0089 0.51322,-3.22972 0.0887,-5.79872 -0.72908,-4.41206 -2.23279,-7.47011 -5.06676,-10.30409 -2.83398,-2.83397 -5.89203,-4.33769 -10.3041,-5.06676 -2.569,-0.42452 -2.78981,-0.42114 -5.79872,0.0887 -2.45385,0.4158 -3.58898,0.76015 -5.2668,1.5977 -5.47152,2.73136 -8.6611,7.12456 -9.72314,13.39224 -0.50985,3.00891 -0.51323,3.22972 -0.0887,5.79872 0.72907,4.41207 2.23278,7.47012 5.06676,10.3041 2.72106,2.72106 5.85763,4.31434 9.88235,5.01993 2.93561,0.51465 3.07442,0.51306 6.46263,-0.0737 z"
           style="fill:#007bff;fill-opacity:1;stroke-width:0.26458335" />
        <path
           inkscape:connector-curvature="0"
           id="path9678"
           d="m 536.95927,282.68471 c -0.52317,-0.55578 -1.42747,-1.71469 -2.00955,-2.57535 -0.58208,-0.86065 -2.29871,-3.29318 -3.81472,-5.40562 -8.125,-11.3215 -20.94379,-31.22416 -27.2686,-42.33767 -0.62113,-1.0914 -1.36622,-2.40109 -1.65576,-2.91041 -0.28953,-0.50933 -0.80424,-1.40229 -1.1438,-1.98438 -2.06044,-3.53209 -8.33045,-15.9514 -10.01832,-19.84375 -3.34465,-7.713 -4.91721,-12.08585 -6.23127,-17.32736 -1.02207,-4.07683 -1.32899,-6.52291 -1.32899,-10.59177 0,-14.05499 5.90955,-27.88779 16.39246,-38.3707 8.84001,-8.84002 19.95965,-14.40301 31.9737,-15.99599 3.74948,-0.49715 10.69492,-0.50292 14.34009,-0.0119 12.17679,1.64022 23.12267,7.11382 32.02153,16.01268 10.59046,10.59045 16.39723,24.26223 16.39723,38.60653 0,3.72548 -0.31975,6.32315 -1.22491,9.95145 -1.21414,4.86684 -2.77592,9.43825 -4.92638,14.41979 -0.72242,1.67349 -1.5644,3.63802 -1.87107,4.36563 -1.41201,3.35014 -8.33653,16.80372 -10.96251,21.29895 -9.68332,16.5762 -18.81451,30.84165 -28.19802,44.05313 -7.16449,10.08722 -6.78699,9.65729 -8.47946,9.65729 -0.8632,0 -1.20246,-0.17214 -1.99165,-1.01053 z m 2.9813,-7.65458 c 4.50346,-6.14847 16.22804,-23.34666 17.90225,-26.25989 0.2927,-0.50932 1.48371,-2.41432 2.64669,-4.23333 2.00851,-3.14151 7.20706,-11.75561 10.37882,-17.19792 3.24369,-5.56573 9.51122,-17.76071 11.28642,-21.96041 0.46134,-1.09141 1.02541,-2.4011 1.2535,-2.91042 1.84745,-4.12535 4.19777,-11.35136 4.94834,-15.21354 1.17164,-6.02886 1.1765,-8.72869 0.0281,-15.61042 -2.63123,-15.76745 -12.98465,-29.5269 -27.31055,-36.29506 -14.02209,-6.62462 -30.04076,-6.62394 -44.04674,0.002 -14.42785,6.82539 -24.72074,20.54818 -27.32121,36.42547 -1.15192,7.0331 -1.14588,9.30316 0.0412,15.47813 2.60897,13.57134 14.32672,36.76052 33.12121,65.54616 5.19156,7.9514 15.82844,23.22154 16.17566,23.22154 0.0933,0 0.49662,-0.44648 0.89632,-0.99219 z m -5.10497,-70.98198 c -4.61644,-0.96805 -8.70657,-3.15819 -12.24602,-6.55737 -2.97937,-2.8613 -5.0743,-6.22936 -6.44915,-10.36845 -0.69858,-2.10315 -0.74701,-2.53201 -0.74701,-6.61459 0,-4.08308 0.0484,-4.51117 0.74725,-6.61458 1.44921,-4.36155 2.9605,-6.80664 6.22468,-10.07082 3.26419,-3.26419 5.70927,-4.77547 10.07083,-6.22468 2.10341,-0.6989 2.53149,-0.74726 6.61458,-0.74726 4.08258,0 4.51144,0.0484 6.61459,0.74702 3.97779,1.32127 6.85219,3.05155 9.84659,5.92728 2.97938,2.86131 5.0743,6.22937 6.44915,10.36846 0.69858,2.10315 0.74702,2.532 0.74702,6.61458 0,4.08309 -0.0484,4.51118 -0.74726,6.61459 -1.44921,4.36155 -2.96049,6.80663 -6.22468,10.07082 -3.28091,3.28091 -5.76609,4.81217 -10.07082,6.20519 -1.92818,0.62395 -2.77732,0.73974 -5.95313,0.81171 -2.03729,0.0462 -4.23177,-0.0267 -4.87662,-0.1619 z m 9.28767,-5.82492 c 8.07391,-2.06145 13.24768,-8.96792 13.27103,-17.71549 0.0284,-10.62975 -7.71379,-18.3719 -18.34354,-18.34353 -8.79383,0.0235 -15.59246,5.14439 -17.76006,13.37738 -1.10042,4.17963 -0.61444,9.78766 1.14731,13.2396 2.92479,5.73077 7.56265,8.98371 14.36379,10.07456 1.44608,0.23194 5.20893,-0.0931 7.32147,-0.63252 z"
           style="fill:#007bff;fill-opacity:1;stroke-width:0.26458335" />
        <path
           inkscape:connector-curvature="0"
           id="path9676"
           d="m 537.37625,283.09992 c -1.01384,-0.93473 -10.73523,-14.73834 -16.35104,-23.21718 -17.54885,-26.49554 -29.19504,-48.07606 -34.47595,-63.88433 -2.21353,-6.62615 -3.06251,-11.09613 -3.05883,-16.10512 0.015,-20.43715 12.35034,-39.8459 31.35095,-49.32842 7.43547,-3.71078 15.6588,-5.61962 24.20938,-5.61962 4.25233,0 6.99912,0.27319 10.98021,1.09208 19.7562,4.06375 36.14612,18.96334 42.16486,38.33083 2.11166,6.79505 2.93564,14.74332 2.13061,20.55221 -0.80085,5.77863 -3.51434,14.20494 -7.31232,22.70716 -5.19393,11.62722 -14.59274,28.53307 -23.79266,42.79636 -0.63357,0.98226 -1.7068,2.64914 -2.38494,3.70416 -6.81781,10.60676 -19.53134,28.80408 -20.47783,29.31063 -0.8586,0.45951 -2.29339,0.29654 -2.98244,-0.33876 z m 4.45264,-10.57585 c 8.64642,-12.24251 15.52051,-22.67973 23.74757,-36.05695 6.26723,-10.19053 14.92103,-26.59931 17.65159,-33.46979 0.26025,-0.65485 0.89433,-2.21429 1.40906,-3.46544 1.31812,-3.20393 3.21384,-9.37224 3.93584,-12.80644 1.15527,-5.49505 0.6359,-13.8601 -1.25668,-20.24062 -3.47271,-11.70769 -10.25332,-21.03662 -20.08738,-27.63674 -6.03784,-4.05229 -12.31776,-6.55461 -19.71146,-7.8543 -5.06222,-0.88986 -12.27076,-0.83891 -17.4625,0.12342 -2.11005,0.39111 -4.31271,0.8836 -4.89479,1.09442 -0.58209,0.21082 -1.20973,0.38853 -1.39476,0.39492 -0.56286,0.0194 -5.08863,1.85266 -7.33649,2.97176 -9.70479,4.83151 -17.47606,12.60277 -22.30757,22.30756 -1.11909,2.24787 -2.95233,6.77364 -2.97176,7.33649 -0.006,0.18503 -0.1841,0.81268 -0.39492,1.39476 -0.21082,0.58208 -0.69968,2.78474 -1.08636,4.89479 -1.01972,5.5644 -1.02179,11.24313 -0.006,15.7998 2.35644,10.5682 8.12822,23.61293 18.31388,41.391 3.1745,5.54079 3.82332,6.62004 8.72367,14.51128 5.85094,9.42199 21.83105,33.05633 22.3507,33.05633 0.0728,0 1.32292,-1.68581 2.77813,-3.74625 z m -7.14375,-68.60134 c -7.44572,-1.66711 -13.19808,-6.01811 -16.78953,-12.69936 -2.84126,-5.28567 -3.43411,-11.92651 -1.57283,-17.61812 2.48416,-7.59628 8.25662,-13.37006 15.82549,-15.8291 2.79529,-0.90816 4.91725,-1.16607 8.21271,-0.99821 12.33128,0.62812 22.49309,11.34865 22.49309,23.7298 0,12.94428 -10.99132,23.86731 -23.9356,23.78687 -1.45521,-0.009 -3.36021,-0.17639 -4.23333,-0.37188 z m 9.6146,-5.68681 c 6.27032,-1.76036 10.71546,-6.23746 12.52917,-12.61925 0.82883,-2.91636 0.82429,-7.31692 -0.0106,-10.25638 -0.93968,-3.30852 -2.2474,-5.53915 -4.66418,-7.95594 -3.65939,-3.6594 -7.65013,-5.26197 -13.10338,-5.26197 -6.25257,0 -11.29616,2.4282 -14.81282,7.13153 -2.46226,3.29313 -3.55255,6.74083 -3.55255,11.23383 0,5.45325 1.60258,9.44399 5.26198,13.10339 2.88232,2.88232 5.80073,4.3676 10.14822,5.16479 1.87763,0.3443 6.02718,0.0712 8.20415,-0.54 z"
           style="fill:#007bff;fill-opacity:1;stroke-width:0.26458335" />
        <path
           inkscape:connector-curvature="0"
           id="path9674"
           d="m 537.56956,283.31658 c -0.29734,-0.20827 -1.09812,-1.19053 -1.77952,-2.18282 -0.68139,-0.99228 -2.00512,-2.87571 -2.94161,-4.1854 -21.427,-29.96573 -38.92839,-60.20914 -45.47376,-78.58124 -4.11848,-11.56013 -4.81292,-18.96514 -2.7194,-28.99799 4.0148,-19.24025 18.5021,-35.41861 37.26972,-41.6201 17.84354,-5.89614 37.04049,-2.33292 51.86457,9.62678 2.29888,1.85468 6.81749,6.39374 8.62898,8.66805 7.71851,9.69047 12.16886,22.09644 12.19014,33.98172 0.0191,10.68427 -5.55463,25.52666 -18.06568,48.10716 -7.53527,13.59998 -19.47519,32.25253 -30.7399,48.02187 -0.93556,1.30969 -2.38692,3.3747 -3.22524,4.58891 -0.83832,1.21421 -1.76323,2.37507 -2.05536,2.57969 -0.68664,0.48094 -2.26188,0.4774 -2.95294,-0.007 z m 5.21392,-12.12848 c 14.90382,-21.0601 27.56313,-41.61457 35.90767,-58.30195 4.89851,-9.79604 8.19767,-18.36476 9.75304,-25.33109 0.96599,-4.32651 1.01701,-10.76918 0.12392,-15.64627 -1.9734,-10.77658 -6.5324,-19.62653 -13.91213,-27.00626 -7.37573,-7.37573 -16.18223,-11.91446 -27.00626,-13.9186 -4.62849,-0.85699 -12.62889,-0.84454 -17.33021,0.027 -10.75118,1.99302 -19.49417,6.51263 -26.87357,13.89202 -4.65936,4.65936 -7.88914,9.41046 -10.44256,15.3613 -2.82532,6.58449 -4.03978,12.40289 -4.05971,19.44976 -0.0116,4.11031 0.0679,4.99074 0.70872,7.84107 3.62144,16.10906 17.02715,41.58947 38.78114,73.71183 4.02685,5.94614 10.4378,15.00885 10.61723,15.00885 0.0728,0 1.75249,-2.28944 3.73272,-5.08764 z m -7.50112,-67.12355 c -3.644,-0.66518 -8.05932,-2.7473 -11.06549,-5.21813 -3.69332,-3.03561 -6.52792,-7.24231 -8.07834,-11.98868 -0.67479,-2.06577 -0.73463,-2.583 -0.73463,-6.35 0,-3.77406 0.0589,-4.28035 0.73805,-6.35 2.6781,-8.16058 8.41038,-13.89352 16.55881,-16.56071 2.06749,-0.67674 2.57987,-0.73614 6.35,-0.73614 3.767,0 4.28423,0.0598 6.35,0.73463 8.02537,2.62151 13.94072,8.53686 16.56223,16.56222 0.67479,2.06577 0.73463,2.58301 0.73463,6.35 0,3.77407 -0.0589,4.28036 -0.73805,6.35 -2.68115,8.16987 -8.50589,13.98683 -16.55881,16.53668 -1.82192,0.57688 -2.87696,0.72986 -5.55625,0.80565 -1.81901,0.0514 -3.87198,-0.01 -4.56215,-0.13552 z m 9.46134,-5.93303 c 3.22598,-1.02579 5.04918,-2.13274 7.42364,-4.5072 2.35752,-2.35752 3.45583,-4.15711 4.53069,-7.42364 0.61268,-1.86192 0.69884,-2.55747 0.70522,-5.69294 0.006,-3.17373 -0.0713,-3.8083 -0.69795,-5.69294 -1.0904,-3.27957 -2.1857,-5.07138 -4.53796,-7.42363 -2.35225,-2.35226 -4.14406,-3.44756 -7.42364,-4.53797 -1.88464,-0.62661 -2.51921,-0.7044 -5.69294,-0.69795 -3.13547,0.006 -3.83102,0.0926 -5.69294,0.70522 -3.26652,1.07487 -5.06612,2.17318 -7.42364,4.5307 -2.35752,2.35751 -3.45582,4.15711 -4.53069,7.42363 -0.61268,1.86192 -0.69884,2.55747 -0.70522,5.69294 -0.006,3.17374 0.0713,3.8083 0.69795,5.69294 1.0904,3.27958 2.18571,5.07139 4.53796,7.42364 2.77401,2.774 5.59024,4.26547 9.69517,5.13452 2.10347,0.44533 6.74592,0.1258 9.11435,-0.62732 z"
           style="fill:#007bff;fill-opacity:1;stroke-width:0.26458335" />
        <path
           inkscape:connector-curvature="0"
           id="path9672"
           d="m 537.61558,283.13455 c -1.83386,-1.44251 -17.74599,-24.75901 -26.34607,-38.60563 -9.50648,-15.306 -17.75605,-30.87093 -22.18987,-41.86692 -2.40308,-5.9597 -3.75999,-10.27546 -4.84421,-15.40738 -0.84832,-4.01536 -0.84489,-10.92576 0.008,-15.61042 1.75343,-9.63389 5.07492,-17.14028 11.12214,-25.13541 1.71857,-2.27215 6.66705,-7.28732 9.01003,-9.13146 4.99108,-3.92843 9.2683,-6.41834 14.83167,-8.63401 2.9895,-1.1906 7.0934,-2.33283 10.98021,-3.05611 4.58851,-0.85386 13.13857,-0.85386 17.72708,0 9.73595,1.81172 17.15305,5.09752 25.13542,11.13509 2.27215,1.71857 7.28732,6.66705 9.13146,9.01003 7.18341,9.12652 11.10823,18.73255 12.1982,29.85511 0.16712,1.70528 0.23803,4.4102 0.1576,6.01093 -0.68239,13.57999 -10.34573,34.98718 -30.06359,66.59984 -6.61816,10.61055 -22.48644,33.65565 -23.98745,34.83634 -0.39203,0.30838 -1.03786,0.56069 -1.43518,0.56069 -0.39731,0 -1.04314,-0.25231 -1.43518,-0.56069 z m 4.66587,-11.14712 c 19.22244,-27.06704 35.12614,-54.07686 41.99089,-71.31461 5.03365,-12.63977 6.04656,-20.41113 3.98672,-30.5875 -2.57908,-12.74156 -10.14555,-24.07795 -20.89788,-31.31004 -17.6161,-11.84872 -41.56184,-11.28969 -58.60521,1.36818 -2.72035,2.02036 -8.04914,7.34915 -10.0695,10.06949 -8.20888,11.05297 -11.71379,26.0343 -8.88261,37.96771 3.19727,13.47642 11.60706,30.6708 27.36981,55.95937 6.14715,9.86203 21.31278,32.14687 21.87709,32.14687 0.0975,0 1.55132,-1.93476 3.23069,-4.29947 z m -6.69986,-67.91766 c -12.11238,-2.22721 -20.9843,-13.12775 -20.25379,-24.88494 0.35526,-5.71779 2.82646,-11.06335 7.08158,-15.31846 3.08513,-3.08513 6.37641,-5.0414 10.58028,-6.28871 2.18725,-0.64896 2.92255,-0.73856 6.0611,-0.73856 3.13856,0 3.87386,0.0896 6.06111,0.73856 4.20386,1.24731 7.49514,3.20358 10.58027,6.28871 3.08513,3.08512 5.0414,6.3764 6.2887,10.58027 0.64897,2.18725 0.73857,2.92255 0.73857,6.0611 0,3.13856 -0.0896,3.87386 -0.73857,6.06111 -1.2473,4.20386 -3.20357,7.49514 -6.2887,10.58027 -4.48869,4.48869 -9.77126,6.83601 -15.84763,7.04192 -1.67349,0.0567 -3.5918,0.002 -4.26292,-0.12127 z m 9.15771,-5.83016 c 5.81289,-1.82274 10.2567,-6.30058 12.08311,-12.17562 0.89341,-2.87383 0.89247,-8.24445 -0.002,-11.1125 -1.85556,-5.94987 -6.26368,-10.35798 -12.21355,-12.21346 -2.86805,-0.8944 -8.23867,-0.89534 -11.1125,-0.002 -5.93029,1.84358 -10.37181,6.28511 -12.2154,12.2154 -0.8934,2.87383 -0.89247,8.24445 0.002,11.1125 2.05799,6.59926 7.2157,11.24736 14.08543,12.6937 2.03287,0.428 7.28078,0.13792 9.37282,-0.51808 z"
           style="fill:#007bff;fill-opacity:1;stroke-width:0.26458335" />
        <path
           inkscape:connector-curvature="0"
           id="path9670"
           d="m 537.66076,283.17009 c -1.69296,-1.33168 -17.17202,-23.91363 -25.12136,-36.64881 -16.05558,-25.72174 -25.40244,-45.36826 -28.31542,-59.51728 -0.87208,-4.23589 -0.81729,-10.41584 0.13977,-15.76509 4.12205,-23.0392 22.29273,-41.2151 45.41817,-45.43125 3.3514,-0.61102 4.54104,-0.70078 9.26884,-0.69935 6.87481,0.002 10.93099,0.65414 17.30787,2.78236 22.31926,7.44881 38.00636,28.79521 38.08407,51.82332 0.0167,4.93782 -0.39013,7.57869 -2.04529,13.27786 -4.96239,17.08683 -19.66638,43.97202 -41.36783,75.63808 -4.37574,6.38495 -9.94721,14.03547 -10.58882,14.54016 -0.36719,0.28883 -0.99268,0.52515 -1.39,0.52515 -0.39731,0 -1.02281,-0.23632 -1.39,-0.52515 z m 4.75402,-11.31496 c 7.85026,-11.03738 16.75144,-24.54919 22.87684,-34.72656 12.99521,-21.59157 20.25935,-37.02741 23.15952,-49.21249 0.67121,-2.82014 0.72292,-3.43947 0.70685,-8.46667 -0.0156,-4.87914 -0.0908,-5.76945 -0.74898,-8.86354 -1.16309,-5.4679 -2.19167,-8.45616 -4.52931,-13.15869 -4.49851,-9.04943 -12.69894,-17.24986 -21.74837,-21.74836 -4.68674,-2.3298 -7.6589,-3.35465 -13.15869,-4.53733 -3.23703,-0.6961 -3.82132,-0.73966 -9.92188,-0.73966 -6.10055,0 -6.68484,0.0436 -9.92187,0.73966 -5.61844,1.2082 -8.4831,2.20694 -13.47575,4.69822 -8.75635,4.36933 -16.92317,12.55806 -21.32747,21.3847 -2.43754,4.88505 -3.45311,7.81384 -4.63316,13.36146 -0.65815,3.09409 -0.73338,3.9844 -0.74898,8.86354 -0.0161,5.0272 0.0356,5.64653 0.70686,8.46667 3.65691,15.36455 15.42342,38.27599 34.28588,66.76055 6.82278,10.3032 14.73108,21.61027 15.11449,21.61027 0.11658,0 1.63039,-1.99429 3.36402,-4.43177 z m -6.00985,-67.69285 c -6.1003,-1.12707 -9.87108,-3.04926 -13.91526,-7.09344 -4.91524,-4.91524 -7.08864,-9.99292 -7.08864,-16.5611 0,-6.56818 2.1734,-11.64585 7.08864,-16.56109 3.46182,-3.46182 6.60327,-5.30188 11.12631,-6.51705 2.99198,-0.80384 7.87758,-0.80384 10.86956,0 4.26003,1.14451 7.47977,2.96368 10.71348,6.05315 4.96881,4.74717 7.52879,10.5361 7.52879,17.02499 0,6.4889 -2.55998,12.27783 -7.52879,17.025 -3.21558,3.07215 -6.44779,4.89243 -10.7243,6.03958 -1.79056,0.4803 -6.71479,0.8403 -8.06979,0.58996 z m 8.46667,-5.92821 c 6.05674,-2.11934 9.73077,-5.78571 11.93038,-11.90549 0.54723,-1.52254 0.61813,-2.19018 0.61813,-5.82084 0,-3.64204 -0.0697,-4.29352 -0.6224,-5.82083 -2.2222,-6.14028 -5.81426,-9.73363 -11.92611,-11.93038 -1.52254,-0.54724 -2.19018,-0.61813 -5.82084,-0.61813 -3.63066,0 -4.2983,0.0709 -5.82083,0.61813 -7.76914,2.79242 -12.26572,8.69452 -12.63326,16.58209 -0.16177,3.47191 0.17269,5.69399 1.25873,8.36271 1.95566,4.80562 5.50249,8.2972 10.28484,10.12464 2.68037,1.02422 3.79686,1.18548 7.57198,1.09359 2.74483,-0.0668 3.78696,-0.20526 5.15938,-0.68549 z"
           style="fill:#007bff;fill-opacity:1;stroke-width:0.26458335" />
        <path
           inkscape:connector-curvature="0"
           id="path9668"
           d="m 537.81909,283.30604 c -0.741,-0.51902 -10.27735,-13.89404 -15.19157,-21.30663 -20.39251,-30.76004 -32.3227,-53.20672 -37.12458,-69.85 -1.37558,-4.76778 -1.85989,-8.04849 -1.83576,-12.43542 0.0664,-12.06468 4.45134,-24.11433 12.30395,-33.8106 7.44678,-9.19516 17.67353,-15.90491 28.8957,-18.9584 9.17797,-2.49728 19.21257,-2.48779 28.47143,0.0269 3.32454,0.90295 7.16699,2.40652 10.60516,4.14986 12.28357,6.22841 22.06998,17.16038 27.05407,30.22091 3.15874,8.27732 4.28318,18.32753 2.85468,25.51504 -3.32298,16.7196 -15.65783,40.87034 -38.37817,75.14167 -4.91421,7.41259 -14.45057,20.78761 -15.19157,21.30663 -0.30561,0.21406 -0.85987,0.3892 -1.23167,0.3892 -0.3718,0 -0.92605,-0.17514 -1.23167,-0.3892 z m 1.89728,-7.61445 c 0.23415,-0.32742 0.99309,-1.36922 1.68653,-2.3151 3.64528,-4.97233 13.25545,-19.21944 18.19689,-26.97694 4.32193,-6.78495 11.37249,-18.65841 14.30345,-24.08764 7.94978,-14.72597 11.94777,-24.03614 14.25904,-33.20521 1.55511,-6.1693 1.54399,-13.04886 -0.0324,-20.0321 -4.654,-20.61695 -21.93792,-36.16367 -42.87047,-38.5616 -3.04573,-0.3489 -9.37161,-0.3489 -12.41734,0 -20.93255,2.39793 -38.21647,17.94465 -42.87047,38.5616 -0.95881,4.24747 -1.2802,7.81768 -1.11258,12.35918 0.12326,3.33944 0.29347,4.55612 1.07345,7.67292 1.84977,7.39167 4.54326,14.1177 9.95969,24.87083 1.9791,3.92907 4.53106,8.81063 5.67103,10.84792 1.8523,3.31033 9.56474,16.27203 11.26255,18.92808 0.3638,0.56913 1.12652,1.78189 1.69492,2.69502 1.37878,2.21496 12.9395,19.51219 15.18298,22.71687 0.97638,1.39469 2.31101,3.27907 2.96585,4.18751 2.43984,3.3847 2.34878,3.31481 3.04686,2.33866 z m -3.04686,-71.53878 c -6.36866,-1.2556 -10.23269,-3.15785 -14.09739,-6.94011 -7.15278,-7.00021 -9.16368,-17.32428 -5.09123,-26.13857 4.89308,-10.59042 16.47247,-16.35682 27.14675,-13.51874 10.52109,2.79734 18.07752,12.39147 18.07752,22.95235 0,10.67111 -7.79571,20.42247 -18.41091,23.02951 -2.17097,0.53318 -6.33674,0.86949 -7.62474,0.61556 z m 8.59896,-6.04147 c 2.84144,-0.98247 4.94137,-2.28884 7.01921,-4.36668 2.06165,-2.06165 3.36772,-4.15122 4.38729,-7.01921 0.70351,-1.97893 0.75248,-2.38353 0.75248,-6.21771 0,-3.83417 -0.049,-4.23878 -0.75248,-6.2177 -1.01957,-2.86799 -2.32564,-4.95756 -4.38729,-7.01921 -2.06165,-2.06165 -4.15122,-3.36772 -7.01921,-4.38729 -1.97893,-0.70352 -2.38354,-0.75248 -6.21771,-0.75248 -3.83417,0 -4.23878,0.049 -6.21771,0.75248 -2.86799,1.01957 -4.95756,2.32564 -7.01921,4.38729 -2.06165,2.06165 -3.36771,4.15122 -4.38729,7.01921 -0.70351,1.97892 -0.75248,2.38353 -0.75248,6.2177 0,3.83418 0.049,4.23878 0.75248,6.21771 2.20688,6.20777 6.87355,10.40235 13.25859,11.91729 1.07969,0.25617 2.68775,0.34847 5.02708,0.28856 2.92642,-0.075 3.75537,-0.19729 5.55625,-0.81996 z"
           style="fill:#007bff;fill-opacity:1;stroke-width:0.26458335" />
        <path
           inkscape:connector-curvature="0"
           id="path9666"
           d="m 538.03522,283.36189 c -0.50987,-0.2452 -4.74621,-5.94783 -9.97311,-13.42499 -5.51395,-7.88781 -15.05942,-22.69421 -20.8099,-32.27916 -5.3333,-8.88959 -12.93543,-23.1003 -15.28642,-28.575 -0.46868,-1.0914 -1.07102,-2.46062 -1.33854,-3.04271 -1.4986,-3.26082 -4.07093,-10.34183 -5.13911,-14.14669 -1.1564,-4.11914 -1.8437,-8.55496 -1.82563,-11.78247 0.0304,-5.42979 1.32244,-12.67597 3.25518,-18.25625 0.88726,-2.56175 4.07907,-8.78317 5.96802,-11.63278 6.63931,-10.01587 16.58257,-17.88301 27.64422,-21.8722 4.68903,-1.69102 14.01026,-3.40439 18.52083,-3.40439 4.51057,0 13.8318,1.71337 18.52084,3.40439 10.99859,3.96644 21.28337,12.09598 27.61732,21.82993 4.87377,7.48995 7.6675,14.95063 8.78073,23.44901 1.0842,8.27676 0.25649,14.30913 -3.33998,24.34166 -1.30788,3.64842 -2.30147,6.18606 -3.15964,8.06979 -0.26518,0.58209 -0.86561,1.95131 -1.3343,3.04271 -1.26395,2.94334 -6.66336,13.46121 -9.77942,19.05 -5.56862,9.98757 -12.11527,20.55789 -20.89315,33.73437 -5.03031,7.551 -5.00905,7.52022 -10.6072,15.35778 -4.62282,6.47206 -5.14573,6.94255 -6.82074,6.137 z m 4.08468,-10.91144 c 5.98705,-8.37345 14.2864,-20.8125 19.41832,-29.10417 1.351,-2.18281 2.72221,-4.38547 3.04713,-4.89479 2.33275,-3.65666 6.57968,-10.98929 9.19454,-15.875 0.58412,-1.09141 1.15174,-2.10344 1.26136,-2.24896 0.73243,-0.97227 6.5648,-12.9427 8.18599,-16.80104 0.45859,-1.0914 0.94312,-2.2225 1.07673,-2.51354 0.89776,-1.95548 3.0234,-8.31045 3.80546,-11.37708 0.94522,-3.70644 1.20089,-5.80978 1.20693,-9.92882 0.0107,-7.34584 -1.49308,-14.10345 -4.62054,-20.76285 -5.14182,-10.94858 -13.29307,-19.06964 -24.26693,-24.17703 -4.40741,-2.05127 -10.00753,-3.66522 -14.7566,-4.25284 -2.91736,-0.36098 -10.33755,-0.35442 -13.3684,0.0118 -14.65211,1.77049 -28.64897,10.8015 -36.25291,23.39098 -3.56423,5.90113 -6.20349,13.40244 -6.98183,19.84375 -0.35769,2.9602 -0.36569,8.91384 -0.0153,11.37708 0.93348,6.56189 4.14541,15.39307 9.86357,27.11979 1.17082,2.4011 2.68483,5.37766 3.36448,6.61458 0.67965,1.23693 1.65601,3.02287 2.16971,3.96875 2.88523,5.31273 6.83992,12.12325 9.06453,15.61042 0.32492,0.50932 1.69613,2.71198 3.04713,4.89479 3.83161,6.19076 6.1057,9.66329 13.3418,20.37292 3.86774,5.72437 8.98925,12.84067 9.18911,12.76819 0.10341,-0.0375 1.46497,-1.85413 3.02569,-4.03694 z m -4.92122,-68.30026 c -4.75186,-0.94197 -5.83773,-1.2574 -8.03184,-2.33313 -8.25069,-4.04515 -13.75272,-12.57034 -13.75272,-21.30932 0,-12.55092 11.08571,-23.63663 23.63664,-23.63663 12.55093,0 23.63664,11.08571 23.63664,23.63663 0,10.6119 -8.26003,20.81015 -18.64605,23.02136 -2.61649,0.55705 -5.73693,0.84029 -6.84267,0.62109 z m 6.41187,-5.50837 c 4.93576,-1.04598 9.82234,-4.88316 12.064,-9.47325 0.623,-1.27565 1.30263,-3.12112 1.51029,-4.10104 0.4845,-2.28623 0.4845,-6.83335 0,-9.11958 -1.04598,-4.93576 -4.88316,-9.82233 -9.47325,-12.064 -1.27565,-0.62299 -3.12112,-1.30262 -4.10104,-1.51028 -2.28623,-0.4845 -6.83335,-0.4845 -9.11958,0 -4.93576,1.04598 -9.82234,4.88315 -12.064,9.47324 -0.62299,1.27566 -1.30262,3.12113 -1.51029,4.10104 -0.48449,2.28623 -0.48449,6.83335 0,9.11958 1.04701,4.94061 4.88259,9.82206 9.48301,12.06877 1.28102,0.62561 3.06696,1.29785 3.96875,1.49384 2.18311,0.47449 7.02931,0.48062 9.24211,0.0117 z"
           style="fill:#007bff;fill-opacity:1;stroke-width:0.26458335" />
      </g>
      <circle
         r="60"
         cy="-82.76786"
         cx="230.84523"
         id="path9684"
         style="fill:#007bff;fill-opacity:1;stroke:none;stroke-width:29.50580788;stroke-miterlimit:4;stroke-dasharray:none;stroke-opacity:1" />
    </g>
  </g>
</svg>
