{"_id":1,"__v":0,"adjacentVertex":[{"_id":2,"weight":5.563955855450858}]}
{"_id":2,"__v":0,"adjacentVertex":[{"_id":3,"weight":5.617406137682187},{"_id":1,"weight":5.563955855450858}]}
{"_id":3,"__v":0,"adjacentVertex":[{"_id":4,"weight":4.7969930984019795},{"_id":2,"weight":5.617406137682187}]}
{"_id":4,"__v":0,"adjacentVertex":[{"_id":5,"weight":7.380153952467227},{"_id":3,"weight":4.7969930984019795}]}
{"_id":5,"__v":0,"adjacentVertex":[{"_id":6,"weight":7.546846226071525},{"_id":4,"weight":7.380153952467227},{"_id":141,"weight":8.073247790286775}]}
{"_id":6,"__v":0,"adjacentVertex":[{"_id":7,"weight":5.935153944299017},{"_id":5,"weight":7.546846226071525},{"_id":141,"weight":2.544185593282433}]}
{"_id":7,"__v":0,"adjacentVertex":[{"_id":8,"weight":5.35812752270246},{"_id":6,"weight":5.93515394429902},{"_id":141,"weight":6.20421483808375},{"_id":164,"weight":5.7691165260659325}]}
{"_id":8,"__v":0,"adjacentVertex":[{"_id":9,"weight":3.959634657487957},{"_id":7,"weight":5.358127522702464}]}
{"_id":9,"__v":0,"adjacentVertex":[{"_id":10,"weight":4.4967427834532545},{"_id":8,"weight":3.959634657487957}]}
{"_id":10,"__v":0,"adjacentVertex":[{"_id":11,"weight":3.4760301507444846},{"_id":9,"weight":4.4967427834532545},{"_id":258,"weight":3.2509683809329384}]}
{"_id":11,"__v":0,"adjacentVertex":[{"_id":12,"weight":4.665552479092597},{"_id":10,"weight":3.4760301507444846},{"_id":162,"weight":3.053298620457197},{"_id":253,"weight":2.498756715762887}]}
{"_id":12,"__v":0,"adjacentVertex":[{"_id":13,"weight":2.611832550354085},{"_id":11,"weight":4.665552479092597}]}
{"_id":13,"__v":0,"adjacentVertex":[{"_id":14,"weight":3.65919106620709},{"_id":12,"weight":2.61183255035409},{"_id":205,"weight":10.2768362523504}]}
{"_id":14,"__v":0,"adjacentVertex":[{"_id":15,"weight":4.46938951385339},{"_id":13,"weight":3.65919106620709},{"_id":205,"weight":7.04160234526309},{"_id":254,"weight":3.116418232385215},{"_id":256,"weight":3.199589975127716}]}
{"_id":15,"__v":0,"adjacentVertex":[{"_id":16,"weight":2.68160732928491},{"_id":14,"weight":4.46938951385339},{"_id":205,"weight":3.68696742160111},{"_id":251,"weight":4.233318476869068}]}
{"_id":16,"__v":0,"adjacentVertex":[{"_id":17,"weight":3.4654452801519393},{"_id":15,"weight":2.6816073292849065},{"_id":137,"weight":2.967099287173115}]}
{"_id":17,"__v":0,"adjacentVertex":[{"_id":18,"weight":2.2794316328646},{"_id":16,"weight":3.4654452801519393},{"_id":137,"weight":4.81122082158291}]}
{"_id":18,"__v":0,"adjacentVertex":[{"_id":19,"weight":2.1896877341722356},{"_id":17,"weight":2.2794316328646},{"_id":137,"weight":6.9153310247642255}]}
{"_id":19,"__v":0,"adjacentVertex":[{"_id":20,"weight":0.29061410741999755},{"_id":18,"weight":2.1896877341722356}]}
{"_id":20,"__v":0,"adjacentVertex":[{"_id":21,"weight":0.26680003969600957},{"_id":19,"weight":0.29061410741999755},{"_id":194,"weight":0.3060273187830065}]}
{"_id":21,"__v":0,"adjacentVertex":[{"_id":22,"weight":0.149425633354226},{"_id":20,"weight":0.26680003969601}]}
{"_id":22,"__v":0,"adjacentVertex":[{"_id":23,"weight":0.1328934896953633},{"_id":21,"weight":0.14942563335422585}]}
{"_id":23,"__v":0,"adjacentVertex":[{"_id":24,"weight":0.5454321526414113},{"_id":22,"weight":0.1328934896953633},{"_id":168,"weight":0.11300561414600602}]}
{"_id":24,"__v":0,"adjacentVertex":[{"_id":25,"weight":0.4317671432355042},{"_id":23,"weight":0.5454321526414113},{"_id":168,"weight":0.5544562094753762}]}
{"_id":25,"__v":0,"adjacentVertex":[{"_id":26,"weight":1.0166634331442235},{"_id":24,"weight":0.4317671432355042}]}
{"_id":26,"__v":0,"adjacentVertex":[{"_id":27,"weight":0.7609169318141741},{"_id":25,"weight":1.0166634331442235}]}
{"_id":27,"__v":0,"adjacentVertex":[{"_id":28,"weight":1.5231696969833923},{"_id":26,"weight":0.7609169318141741},{"_id":170,"weight":0.35498889172589}]}
{"_id":28,"__v":0,"adjacentVertex":[{"_id":29,"weight":1.7906212024509198},{"_id":27,"weight":1.5231696969833923},{"_id":170,"weight":1.3383554674231837},{"_id":210,"weight":1.3464339535971217}]}
{"_id":29,"__v":0,"adjacentVertex":[{"_id":30,"weight":1.3259700821204874},{"_id":28,"weight":1.7906212024509198}]}
{"_id":30,"__v":0,"adjacentVertex":[{"_id":31,"weight":2.467132944795257},{"_id":29,"weight":1.3259700821204874},{"_id":217,"weight":1.251963931624745}]}
{"_id":31,"__v":0,"adjacentVertex":[{"_id":32,"weight":4.4519437836566444},{"_id":30,"weight":2.467132944795257},{"_id":261,"weight":2.589701673066083}]}
{"_id":32,"__v":0,"adjacentVertex":[{"_id":33,"weight":4.152889557953192},{"_id":31,"weight":4.4519437836566444}]}
{"_id":33,"__v":0,"adjacentVertex":[{"_id":34,"weight":4.274366431854938},{"_id":32,"weight":4.152889557953192}]}
{"_id":34,"__v":0,"adjacentVertex":[{"_id":35,"weight":3.0455877237140996},{"_id":33,"weight":4.274366431854938}]}
{"_id":35,"__v":0,"adjacentVertex":[{"_id":36,"weight":6.100289813802758},{"_id":34,"weight":3.0455877237140996}]}
{"_id":36,"__v":0,"adjacentVertex":[{"_id":37,"weight":6.089978820458195},{"_id":35,"weight":6.100289813802758}]}
{"_id":37,"__v":0,"adjacentVertex":[{"_id":38,"weight":4.885114329146039},{"_id":36,"weight":6.089978820458195}]}
{"_id":38,"__v":0,"adjacentVertex":[{"_id":39,"weight":5.037318004018666},{"_id":37,"weight":4.885114329146039},{"_id":269,"weight":4.231176375895525}]}
{"_id":39,"__v":0,"adjacentVertex":[{"_id":40,"weight":4.187274455213999},{"_id":38,"weight":5.037318004018666},{"_id":270,"weight":2.980726594372643},{"_id":269,"weight":2.165667768425256}]}
{"_id":40,"__v":0,"adjacentVertex":[{"_id":41,"weight":6.316765208515302},{"_id":39,"weight":4.187274455213999},{"_id":270,"weight":2.3553670670862137}]}
{"_id":41,"__v":0,"adjacentVertex":[{"_id":42,"weight":4.67247941475194},{"_id":40,"weight":6.316765208515302},{"_id":271,"weight":3.468631365685119}]}
{"_id":42,"__v":0,"adjacentVertex":[{"_id":43,"weight":1.0482537406017758},{"_id":41,"weight":4.67247941475194}]}
{"_id":43,"__v":0,"adjacentVertex":[{"_id":44,"weight":1.4923332944784826},{"_id":42,"weight":1.0482537406017758}]}
{"_id":44,"__v":0,"adjacentVertex":[{"_id":45,"weight":2.686569875692879},{"_id":43,"weight":1.4923332944784826}]}
{"_id":45,"__v":0,"adjacentVertex":[{"_id":46,"weight":4.2762155070509245},{"_id":44,"weight":2.686569875692879}]}
{"_id":46,"__v":0,"adjacentVertex":[{"_id":47,"weight":6.712369000642786},{"_id":45,"weight":4.2762155070509245}]}
{"_id":47,"__v":0,"adjacentVertex":[{"_id":48,"weight":1.59428939401742},{"_id":46,"weight":6.712369000642786}]}
{"_id":48,"__v":0,"adjacentVertex":[{"_id":49,"weight":1.4255705010201605},{"_id":47,"weight":1.59428939401742}]}
{"_id":49,"__v":0,"adjacentVertex":[{"_id":50,"weight":1.1801480672053857},{"_id":48,"weight":1.4255705010201605}]}
{"_id":50,"__v":0,"adjacentVertex":[{"_id":51,"weight":0.3272302509628781},{"_id":49,"weight":1.1801480672053857}]}
{"_id":51,"__v":0,"adjacentVertex":[{"_id":52,"weight":0.03099255932225498},{"_id":50,"weight":0.3272302509628781}]}
{"_id":52,"__v":0,"adjacentVertex":[{"_id":53,"weight":0.035428686374688934},{"_id":51,"weight":0.03099255932225498}]}
{"_id":53,"__v":0,"adjacentVertex":[{"_id":54,"weight":0.025086854333515866},{"_id":52,"weight":0.035428686374688934}]}
{"_id":54,"__v":0,"adjacentVertex":[{"_id":55,"weight":0.097992134939139},{"_id":53,"weight":0.025086854333515866}]}
{"_id":55,"__v":0,"adjacentVertex":[{"_id":56,"weight":0.1301706488758444},{"_id":54,"weight":0.097992134939139}]}
{"_id":56,"__v":0,"adjacentVertex":[{"_id":57,"weight":0.08787032732075366},{"_id":55,"weight":0.1301706488758444}]}
{"_id":57,"__v":0,"adjacentVertex":[{"_id":58,"weight":0.19772078623819486},{"_id":56,"weight":0.08787032732075366}]}
{"_id":58,"__v":0,"adjacentVertex":[{"_id":59,"weight":0.042925527650179825},{"_id":57,"weight":0.19772078623819486}]}
{"_id":59,"__v":0,"adjacentVertex":[{"_id":60,"weight":0.016277253115219992},{"_id":58,"weight":0.042925527650179825}]}
{"_id":60,"__v":0,"adjacentVertex":[{"_id":61,"weight":0.12413555515824719},{"_id":59,"weight":0.016277253115219992}]}
{"_id":61,"__v":0,"adjacentVertex":[{"_id":62,"weight":0.01671475715656969},{"_id":60,"weight":0.12413555515824719}]}
{"_id":62,"__v":0,"adjacentVertex":[{"_id":63,"weight":0.08766174755523393},{"_id":61,"weight":0.01671475715656969}]}
{"_id":63,"__v":0,"adjacentVertex":[{"_id":64,"weight":0.01742121449490176},{"_id":62,"weight":0.08766174755523393}]}
{"_id":64,"__v":0,"adjacentVertex":[{"_id":65,"weight":0.0437927804167792},{"_id":63,"weight":0.0174212144949018}]}
{"_id":65,"__v":0,"adjacentVertex":[{"_id":66,"weight":0.06621341546972244},{"_id":64,"weight":0.043792780416779205}]}
{"_id":66,"__v":0,"adjacentVertex":[{"_id":67,"weight":0.29600371913330753},{"_id":65,"weight":0.06621341546972244}]}
{"_id":67,"__v":0,"adjacentVertex":[{"_id":68,"weight":0.1619266421936704},{"_id":66,"weight":0.29600371913330753}]}
{"_id":68,"__v":0,"adjacentVertex":[{"_id":69,"weight":2.036333088654536},{"_id":67,"weight":0.1619266421936704}]}
{"_id":69,"__v":0,"adjacentVertex":[{"_id":70,"weight":2.1583847275336683},{"_id":68,"weight":2.036333088654536},{"_id":171,"weight":2.2185139535815184},{"_id":242,"weight":2.560221624013135}]}
{"_id":70,"__v":0,"adjacentVertex":[{"_id":71,"weight":2.488352002242801},{"_id":69,"weight":2.1583847275336683}]}
{"_id":71,"__v":0,"adjacentVertex":[{"_id":72,"weight":2.391792827391052},{"_id":70,"weight":2.488352002242801},{"_id":236,"weight":2.078196037406111},{"_id":242,"weight":2.3157259214160937}]}
{"_id":72,"__v":0,"adjacentVertex":[{"_id":73,"weight":2.8117314172540446},{"_id":71,"weight":2.391792827391052},{"_id":145,"weight":2.1590541058267383},{"_id":259,"weight":0.9935199704734893}]}
{"_id":73,"__v":0,"adjacentVertex":[{"_id":74,"weight":3.145874628170823},{"_id":72,"weight":2.8117314172540446}]}
{"_id":74,"__v":0,"adjacentVertex":[{"_id":75,"weight":2.9184348607948745},{"_id":73,"weight":3.145874628170823},{"_id":155,"weight":2.5900312282229465}]}
{"_id":75,"__v":0,"adjacentVertex":[{"_id":76,"weight":2.3929120232759122},{"_id":74,"weight":2.9184348607948745},{"_id":155,"weight":1.9532795024851044}]}
{"_id":76,"__v":0,"adjacentVertex":[{"_id":77,"weight":1.8455189355803843},{"_id":75,"weight":2.3929120232759122}]}
{"_id":77,"__v":0,"adjacentVertex":[{"_id":78,"weight":1.5733377996178481},{"_id":76,"weight":1.8455189355803843},{"_id":206,"weight":1.5574360241112803}]}
{"_id":78,"__v":0,"adjacentVertex":[{"_id":79,"weight":2.43940242732581},{"_id":77,"weight":1.57333779961785},{"_id":195,"weight":2.3326573816985787}]}
{"_id":79,"__v":0,"adjacentVertex":[{"_id":80,"weight":2.505844566633943},{"_id":78,"weight":2.4394024273258146}]}
{"_id":80,"__v":0,"adjacentVertex":[{"_id":81,"weight":2.4037513554154937},{"_id":79,"weight":2.505844566633943}]}
{"_id":81,"__v":0,"adjacentVertex":[{"_id":82,"weight":1.9715387860644018},{"_id":80,"weight":2.4037513554154937}]}
{"_id":82,"__v":0,"adjacentVertex":[{"_id":83,"weight":2.1233966088059537},{"_id":81,"weight":1.9715387860644018}]}
{"_id":83,"__v":0,"adjacentVertex":[{"_id":84,"weight":2.1752970156558895},{"_id":82,"weight":2.1233966088059537}]}
{"_id":84,"__v":0,"adjacentVertex":[{"_id":85,"weight":1.9863433218417845},{"_id":83,"weight":2.1752970156558895},{"_id":199,"weight":3.4639678981039594}]}
{"_id":85,"__v":0,"adjacentVertex":[{"_id":86,"weight":0.7748550945113392},{"_id":84,"weight":1.9863433218417845}]}
{"_id":86,"__v":0,"adjacentVertex":[{"_id":87,"weight":3.576987531188431},{"_id":85,"weight":0.7748550945113392},{"_id":291,"weight":2.254780364811123}]}
{"_id":87,"__v":0,"adjacentVertex":[{"_id":88,"weight":1.640808657426182},{"_id":86,"weight":3.576987531188431},{"_id":213,"weight":1.7376264387245701},{"_id":291,"weight":1.4029613866409616}]}
{"_id":88,"__v":0,"adjacentVertex":[{"_id":89,"weight":1.4301254390992777},{"_id":87,"weight":1.640808657426182},{"_id":292,"weight":1.5361379487382198},{"_id":213,"weight":0.8752903235188272}]}
{"_id":89,"__v":0,"adjacentVertex":[{"_id":90,"weight":1.8891844437209524},{"_id":88,"weight":1.4301254390992777},{"_id":215,"weight":0.9719817025274926}]}
{"_id":90,"__v":0,"adjacentVertex":[{"_id":91,"weight":1.760424874197834},{"_id":89,"weight":1.8891844437209524},{"_id":294,"weight":1.6600202220960982},{"_id":276,"weight":1.8733261504391971}]}
{"_id":91,"__v":0,"adjacentVertex":[{"_id":92,"weight":1.7131168527773957},{"_id":90,"weight":1.760424874197834}]}
{"_id":92,"__v":0,"adjacentVertex":[{"_id":93,"weight":1.515733868403952},{"_id":91,"weight":1.7131168527773957}]}
{"_id":93,"__v":0,"adjacentVertex":[{"_id":94,"weight":1.3203109615985353},{"_id":92,"weight":1.515733868403952}]}
{"_id":94,"__v":0,"adjacentVertex":[{"_id":95,"weight":1.2119506544165302},{"_id":93,"weight":1.3203109615985353}]}
{"_id":95,"__v":0,"adjacentVertex":[{"_id":96,"weight":1.38109187008966},{"_id":94,"weight":1.21195065441653}]}
{"_id":96,"__v":0,"adjacentVertex":[{"_id":97,"weight":1.206393821361738},{"_id":95,"weight":1.3810918700896622}]}
{"_id":97,"__v":0,"adjacentVertex":[{"_id":98,"weight":1.054963303091988},{"_id":96,"weight":1.206393821361738}]}
{"_id":98,"__v":0,"adjacentVertex":[{"_id":99,"weight":1.109040801308521},{"_id":97,"weight":1.054963303091988},{"_id":282,"weight":0.6776894644917137}]}
{"_id":99,"__v":0,"adjacentVertex":[{"_id":100,"weight":1.4582815349677016},{"_id":98,"weight":1.109040801308521}]}
{"_id":100,"__v":0,"adjacentVertex":[{"_id":101,"weight":1.0817372607096458},{"_id":99,"weight":1.4582815349677016}]}
{"_id":101,"__v":0,"adjacentVertex":[{"_id":102,"weight":0.795726679326347},{"_id":100,"weight":1.0817372607096458}]}
{"_id":102,"__v":0,"adjacentVertex":[{"_id":103,"weight":0.8505521575527774},{"_id":101,"weight":0.795726679326347}]}
{"_id":103,"__v":0,"adjacentVertex":[{"_id":104,"weight":0.737733995886797},{"_id":102,"weight":0.8505521575527774}]}
{"_id":104,"__v":0,"adjacentVertex":[{"_id":105,"weight":0.9138596870254294},{"_id":103,"weight":0.737733995886797},{"_id":121,"weight":0.9043520784623531}]}
{"_id":105,"__v":0,"adjacentVertex":[{"_id":106,"weight":0.7540413400719906},{"_id":104,"weight":0.9138596870254294},{"_id":121,"weight":0.9396183078367774}]}
{"_id":106,"__v":0,"adjacentVertex":[{"_id":107,"weight":0.9068090598657813},{"_id":105,"weight":0.7540413400719906},{"_id":121,"weight":1.380706332335481}]}
{"_id":107,"__v":0,"adjacentVertex":[{"_id":108,"weight":0.944374901853271},{"_id":106,"weight":0.9068090598657813}]}
{"_id":108,"__v":0,"adjacentVertex":[{"_id":109,"weight":1.11353346133596},{"_id":107,"weight":0.944374901853271}]}
{"_id":109,"__v":0,"adjacentVertex":[{"_id":110,"weight":1.4849391060204944},{"_id":108,"weight":1.113533461335958}]}
{"_id":110,"__v":0,"adjacentVertex":[{"_id":111,"weight":0.9831152470383753},{"_id":109,"weight":1.4849391060204944}]}
{"_id":111,"__v":0,"adjacentVertex":[{"_id":110,"weight":0.9831152470383753}]}
{"_id":112,"__v":0,"adjacentVertex":[{"_id":113,"weight":1.3487828570396532},{"_id":153,"weight":1.1739038720911306}]}
{"_id":113,"__v":0,"adjacentVertex":[{"_id":114,"weight":1.3261542271286466},{"_id":112,"weight":1.3487828570396532}]}
{"_id":114,"__v":0,"adjacentVertex":[{"_id":115,"weight":1.4223678714953716},{"_id":113,"weight":1.3261542271286466}]}
{"_id":115,"__v":0,"adjacentVertex":[{"_id":116,"weight":1.0469265444191436},{"_id":114,"weight":1.4223678714953716}]}
{"_id":116,"__v":0,"adjacentVertex":[{"_id":117,"weight":0.7735278834128856},{"_id":115,"weight":1.0469265444191436}]}
{"_id":117,"__v":0,"adjacentVertex":[{"_id":118,"weight":0.8406778924822924},{"_id":116,"weight":0.7735278834128856}]}
{"_id":118,"__v":0,"adjacentVertex":[{"_id":142,"weight":1.1196323900020624},{"_id":117,"weight":0.8406778924822924},{"_id":154,"weight":2.5222401425848164}]}
{"_id":119,"__v":0,"adjacentVertex":[{"_id":120,"weight":0.012183160138844056}]}
{"_id":120,"__v":0,"adjacentVertex":[{"_id":121,"weight":0.006334112132861511},{"_id":119,"weight":0.012183160138844056}]}
{"_id":121,"__v":0,"adjacentVertex":[{"_id":120,"weight":0.006334112132861511},{"_id":104,"weight":0.9043520784623531},{"_id":105,"weight":0.9396183078367774},{"_id":106,"weight":1.380706332335481}]}
{"_id":122,"__v":0,"adjacentVertex":[{"_id":123,"weight":0.040463809199882975}]}
{"_id":123,"__v":0,"adjacentVertex":[{"_id":124,"weight":0.02871010359058469},{"_id":122,"weight":0.040463809199882975}]}
{"_id":124,"__v":0,"adjacentVertex":[{"_id":125,"weight":0.03761071795690057},{"_id":123,"weight":0.02871010359058469}]}
{"_id":125,"__v":0,"adjacentVertex":[{"_id":126,"weight":0.01215369899600461},{"_id":124,"weight":0.03761071795690057}]}
{"_id":126,"__v":0,"adjacentVertex":[{"_id":127,"weight":0.023879154576763553},{"_id":125,"weight":0.01215369899600461}]}
{"_id":127,"__v":0,"adjacentVertex":[{"_id":128,"weight":0.008431332683348806},{"_id":126,"weight":0.023879154576763553}]}
{"_id":128,"__v":0,"adjacentVertex":[{"_id":129,"weight":0.012624255730427116},{"_id":127,"weight":0.008431332683348806}]}
{"_id":129,"__v":0,"adjacentVertex":[{"_id":130,"weight":0.027846656912957127},{"_id":128,"weight":0.012624255730427116}]}
{"_id":130,"__v":0,"adjacentVertex":[{"_id":131,"weight":0.028749223315318134},{"_id":129,"weight":0.027846656912957127}]}
{"_id":131,"__v":0,"adjacentVertex":[{"_id":132,"weight":0.032662766988048014},{"_id":130,"weight":0.028749223315318134}]}
{"_id":132,"__v":0,"adjacentVertex":[{"_id":133,"weight":0.030979369486545175},{"_id":131,"weight":0.032662766988048014}]}
{"_id":133,"__v":0,"adjacentVertex":[{"_id":134,"weight":0.016612580350088665},{"_id":132,"weight":0.030979369486545175}]}
{"_id":134,"__v":0,"adjacentVertex":[{"_id":135,"weight":0.0794370120333467},{"_id":133,"weight":0.016612580350088665}]}
{"_id":135,"__v":0,"adjacentVertex":[{"_id":136,"weight":0.09882840467793319},{"_id":134,"weight":0.0794370120333467}]}
{"_id":136,"__v":0,"adjacentVertex":[{"_id":137,"weight":0.5306344792061358},{"_id":135,"weight":0.09882840467793319},{"_id":205,"weight":0.6033337042341509}]}
{"_id":137,"__v":0,"adjacentVertex":[{"_id":136,"weight":0.530634479206136},{"_id":16,"weight":2.96709928717312},{"_id":17,"weight":4.81122082158291},{"_id":18,"weight":6.91533102476423}]}
{"_id":138,"__v":0,"adjacentVertex":[{"_id":139,"weight":0.16308323975873038}]}
{"_id":139,"__v":0,"adjacentVertex":[{"_id":140,"weight":0.3515409176627291},{"_id":138,"weight":0.16308323975873038}]}
{"_id":140,"__v":0,"adjacentVertex":[{"_id":141,"weight":0.31472128866272114},{"_id":139,"weight":0.3515409176627291}]}
{"_id":141,"__v":0,"adjacentVertex":[{"_id":140,"weight":0.31472128866272114},{"_id":5,"weight":8.073247790286775},{"_id":6,"weight":2.544185593282433},{"_id":7,"weight":6.204214838083749},{"_id":290,"weight":5.315870008160554}]}
{"_id":142,"__v":0,"adjacentVertex":[{"_id":143,"weight":1.5766321249230641},{"_id":118,"weight":1.1196323900020624},{"_id":154,"weight":2.0614400711319094}]}
{"_id":143,"__v":0,"adjacentVertex":[{"_id":144,"weight":1.8230427081225629},{"_id":142,"weight":1.5766321249230641},{"_id":154,"weight":2.0950653180978525}]}
{"_id":144,"__v":0,"adjacentVertex":[{"_id":145,"weight":1.8766376972319205},{"_id":143,"weight":1.8230427081225629},{"_id":192,"weight":1.9098178688822107}]}
{"_id":145,"__v":0,"adjacentVertex":[{"_id":144,"weight":1.87663769723192},{"_id":72,"weight":2.15905410582674},{"_id":243,"weight":1.7440840854482444},{"_id":236,"weight":2.2312634985489286},{"_id":235,"weight":0.8868513332574871}]}
{"_id":146,"__v":0,"adjacentVertex":[{"_id":147,"weight":0.006135038236740975}]}
{"_id":147,"__v":0,"adjacentVertex":[{"_id":148,"weight":0.03102312300125099},{"_id":146,"weight":0.006135038236740975}]}
{"_id":148,"__v":0,"adjacentVertex":[{"_id":149,"weight":0.012572760392003971},{"_id":147,"weight":0.03102312300125099}]}
{"_id":149,"__v":0,"adjacentVertex":[{"_id":150,"weight":0.0234251867394643},{"_id":148,"weight":0.012572760392003971}]}
{"_id":150,"__v":0,"adjacentVertex":[{"_id":151,"weight":0.02588269809769135},{"_id":149,"weight":0.0234251867394643}]}
{"_id":151,"__v":0,"adjacentVertex":[{"_id":152,"weight":0.04922350373693053},{"_id":150,"weight":0.02588269809769135}]}
{"_id":152,"__v":0,"adjacentVertex":[{"_id":153,"weight":0.2074904870823537},{"_id":151,"weight":0.04922350373693053}]}
{"_id":153,"__v":0,"adjacentVertex":[{"_id":152,"weight":0.2074904870823537},{"_id":112,"weight":1.1739038720911306}]}
{"_id":154,"__v":0,"adjacentVertex":[{"_id":155,"weight":1.88227059715983},{"_id":142,"weight":2.06144007113191},{"_id":143,"weight":2.09506531809785},{"_id":118,"weight":2.5222401425848164}]}
{"_id":155,"__v":0,"adjacentVertex":[{"_id":75,"weight":1.9532795024851044},{"_id":74,"weight":2.5900312282229465},{"_id":154,"weight":1.882270597159833},{"_id":207,"weight":1.4982758215498564}]}
{"_id":156,"__v":0,"adjacentVertex":[{"_id":157,"weight":1.9910504153355812}]}
{"_id":157,"__v":0,"adjacentVertex":[{"_id":158,"weight":2.03388541189876},{"_id":156,"weight":1.9910504153355812}]}
{"_id":158,"__v":0,"adjacentVertex":[{"_id":159,"weight":2.9306231313012376},{"_id":157,"weight":2.03388541189876},{"_id":163,"weight":4.756607542483837}]}
{"_id":159,"__v":0,"adjacentVertex":[{"_id":160,"weight":3.0323275249038666},{"_id":158,"weight":2.9306231313012376},{"_id":163,"weight":2.9622987566341106}]}
{"_id":160,"__v":0,"adjacentVertex":[{"_id":161,"weight":2.890790290310198},{"_id":159,"weight":3.0323275249038666}]}
{"_id":161,"__v":0,"adjacentVertex":[{"_id":162,"weight":2.7580618676517563},{"_id":160,"weight":2.890790290310198}]}
{"_id":162,"__v":0,"adjacentVertex":[{"_id":161,"weight":2.7580618676517563},{"_id":11,"weight":3.053298620457197}]}
{"_id":163,"__v":0,"adjacentVertex":[{"_id":164,"weight":3.744037022765168},{"_id":158,"weight":4.756607542483837},{"_id":159,"weight":2.9622987566341106}]}
{"_id":164,"__v":0,"adjacentVertex":[{"_id":163,"weight":3.744037022765168},{"_id":7,"weight":5.7691165260659325}]}
{"_id":165,"__v":0,"adjacentVertex":[{"_id":166,"weight":0.0156893597375524},{"_id":193,"weight":0.04289570622282744}]}
{"_id":166,"__v":0,"adjacentVertex":[{"_id":167,"weight":0.056701361281298365},{"_id":165,"weight":0.0156893597375524},{"_id":193,"weight":0.0401629497881546}]}
{"_id":167,"__v":0,"adjacentVertex":[{"_id":168,"weight":0.07913373830327022},{"_id":166,"weight":0.056701361281298365}]}
{"_id":168,"__v":0,"adjacentVertex":[{"_id":167,"weight":0.07913373830327022},{"_id":23,"weight":0.11300561414600602},{"_id":24,"weight":0.5544562094753762}]}
{"_id":169,"__v":0,"adjacentVertex":[{"_id":170,"weight":0.11245257608054839}]}
{"_id":170,"__v":0,"adjacentVertex":[{"_id":169,"weight":0.11245257608054839},{"_id":28,"weight":1.3383554674231837},{"_id":27,"weight":0.35498889172589}]}
{"_id":171,"__v":0,"adjacentVertex":[{"_id":172,"weight":2.131376133166844},{"_id":69,"weight":2.2185139535815184}]}
{"_id":172,"__v":0,"adjacentVertex":[{"_id":173,"weight":1.3813790219789994},{"_id":171,"weight":2.131376133166844}]}
{"_id":173,"__v":0,"adjacentVertex":[{"_id":174,"weight":0.45449905979758837},{"_id":172,"weight":1.3813790219789994}]}
{"_id":174,"__v":0,"adjacentVertex":[{"_id":175,"weight":0.6484376993683794},{"_id":173,"weight":0.45449905979758837}]}
{"_id":175,"__v":0,"adjacentVertex":[{"_id":176,"weight":0.5927793669726571},{"_id":174,"weight":0.6484376993683794}]}
{"_id":176,"__v":0,"adjacentVertex":[{"_id":177,"weight":0.5503430671753191},{"_id":175,"weight":0.5927793669726571},{"_id":188,"weight":0.47598712164332424}]}
{"_id":177,"__v":0,"adjacentVertex":[{"_id":178,"weight":0.847049829782352},{"_id":176,"weight":0.5503430671753191}]}
{"_id":178,"__v":0,"adjacentVertex":[{"_id":179,"weight":0.7597808569978078},{"_id":177,"weight":0.847049829782352}]}
{"_id":179,"__v":0,"adjacentVertex":[{"_id":180,"weight":0.3514054460206773},{"_id":178,"weight":0.7597808569978078}]}
{"_id":180,"__v":0,"adjacentVertex":[{"_id":181,"weight":0.23939047224075605},{"_id":179,"weight":0.3514054460206773}]}
{"_id":181,"__v":0,"adjacentVertex":[{"_id":182,"weight":0.21062077313651129},{"_id":180,"weight":0.23939047224075605}]}
{"_id":182,"__v":0,"adjacentVertex":[{"_id":183,"weight":0.06875704469118447},{"_id":181,"weight":0.21062077313651129}]}
{"_id":183,"__v":0,"adjacentVertex":[{"_id":184,"weight":0.12286698330160106},{"_id":182,"weight":0.06875704469118447}]}
{"_id":184,"__v":0,"adjacentVertex":[{"_id":185,"weight":0.3057010995740514},{"_id":183,"weight":0.12286698330160106}]}
{"_id":185,"__v":0,"adjacentVertex":[{"_id":186,"weight":0.45573130001065326},{"_id":184,"weight":0.3057010995740514}]}
{"_id":186,"__v":0,"adjacentVertex":[{"_id":187,"weight":0.4257073141434106},{"_id":185,"weight":0.45573130001065326}]}
{"_id":187,"__v":0,"adjacentVertex":[{"_id":186,"weight":0.4257073141434106}]}
{"_id":188,"__v":0,"adjacentVertex":[{"_id":189,"weight":0.7700947701634168},{"_id":176,"weight":0.47598712164332424}]}
{"_id":189,"__v":0,"adjacentVertex":[{"_id":190,"weight":0.5765971093565297},{"_id":188,"weight":0.7700947701634168},{"_id":218,"weight":0.25233552662997566}]}
{"_id":190,"__v":0,"adjacentVertex":[{"_id":191,"weight":0.7491580398069977},{"_id":189,"weight":0.5765971093565297}]}
{"_id":191,"__v":0,"adjacentVertex":[{"_id":192,"weight":0.7089811559606272},{"_id":190,"weight":0.7491580398069977},{"_id":232,"weight":0.44723534543582555},{"_id":234,"weight":0.555170931853963}]}
{"_id":192,"__v":0,"adjacentVertex":[{"_id":191,"weight":0.7089811559606272},{"_id":144,"weight":1.9098178688822107},{"_id":233,"weight":0.5188705508826822},{"_id":243,"weight":2.240727608007254}]}
{"_id":193,"__v":0,"adjacentVertex":[{"_id":194,"weight":0.009342864150004373},{"_id":166,"weight":0.0401629497881546},{"_id":165,"weight":0.04289570622282744}]}
{"_id":194,"__v":0,"adjacentVertex":[{"_id":193,"weight":0.00934286415000437},{"_id":20,"weight":0.3060273187830065}]}
{"_id":195,"__v":0,"adjacentVertex":[{"_id":196,"weight":0.5376516632655404},{"_id":78,"weight":2.3326573816985787},{"_id":285,"weight":2.415997359895252}]}
{"_id":196,"__v":0,"adjacentVertex":[{"_id":197,"weight":1.6578203433734908},{"_id":195,"weight":0.5376516632655404}]}
{"_id":197,"__v":0,"adjacentVertex":[{"_id":198,"weight":1.5524489782024813},{"_id":196,"weight":1.6578203433734908}]}
{"_id":198,"__v":0,"adjacentVertex":[{"_id":197,"weight":1.5524489782024813}]}
{"_id":199,"__v":0,"adjacentVertex":[{"_id":200,"weight":1.3471214429127882},{"_id":84,"weight":3.4639678981039594},{"_id":283,"weight":1.876317730260025}]}
{"_id":200,"__v":0,"adjacentVertex":[{"_id":201,"weight":1.258806329518723},{"_id":199,"weight":1.3471214429127882}]}
{"_id":201,"__v":0,"adjacentVertex":[{"_id":202,"weight":1.1957546056514057},{"_id":200,"weight":1.258806329518723}]}
{"_id":202,"__v":0,"adjacentVertex":[{"_id":203,"weight":1.2126423087631717},{"_id":201,"weight":1.1957546056514057}]}
{"_id":203,"__v":0,"adjacentVertex":[{"_id":204,"weight":1.4341950407836968},{"_id":202,"weight":1.2126423087631717}]}
{"_id":204,"__v":0,"adjacentVertex":[{"_id":203,"weight":1.4341950407836968}]}
{"_id":205,"__v":0,"adjacentVertex":[{"_id":136,"weight":0.6033337042341509},{"_id":13,"weight":10.276836252350376},{"_id":14,"weight":7.041602345263087},{"_id":15,"weight":3.6869674216011137}]}
{"_id":206,"__v":0,"adjacentVertex":[{"_id":207,"weight":1.636887251486371},{"_id":77,"weight":1.5574360241112803}]}
{"_id":207,"__v":0,"adjacentVertex":[{"_id":206,"weight":1.636887251486371},{"_id":155,"weight":1.4982758215498564},{"_id":244,"weight":2.913069364365863}]}
{"_id":208,"__v":0,"adjacentVertex":[{"_id":209,"weight":0.061949796698593775}]}
{"_id":209,"__v":0,"adjacentVertex":[{"_id":210,"weight":0.01962860012360606},{"_id":208,"weight":0.061949796698593775}]}
{"_id":210,"__v":0,"adjacentVertex":[{"_id":209,"weight":0.01962860012360606},{"_id":28,"weight":1.3464339535971217},{"_id":216,"weight":1.4326524696775236}]}
{"_id":211,"__v":0,"adjacentVertex":[{"_id":212,"weight":0.09365591190456667}]}
{"_id":212,"__v":0,"adjacentVertex":[{"_id":213,"weight":0.1132152831387897},{"_id":211,"weight":0.09365591190456667},{"_id":214,"weight":0.08281862511463006}]}
{"_id":213,"__v":0,"adjacentVertex":[{"_id":212,"weight":0.1132152831387897},{"_id":87,"weight":1.7376264387245701},{"_id":88,"weight":0.8752903235188272}]}
{"_id":214,"__v":0,"adjacentVertex":[{"_id":215,"weight":0.1731496235346072},{"_id":212,"weight":0.08281862511463006}]}
{"_id":215,"__v":0,"adjacentVertex":[{"_id":214,"weight":0.1731496235346072},{"_id":89,"weight":0.9719817025274926},{"_id":274,"weight":0.8038988017000319}]}
{"_id":216,"__v":0,"adjacentVertex":[{"_id":217,"weight":1.6871911620876243},{"_id":210,"weight":1.4326524696775236}]}
{"_id":217,"__v":0,"adjacentVertex":[{"_id":216,"weight":1.6871911620876243},{"_id":30,"weight":1.251963931624745}]}
{"_id":218,"__v":0,"adjacentVertex":[{"_id":219,"weight":0.24052768017366868},{"_id":189,"weight":0.25233552662997566},{"_id":237,"weight":0.38125148552377414}]}
{"_id":219,"__v":0,"adjacentVertex":[{"_id":220,"weight":0.20858913228043602},{"_id":218,"weight":0.24052768017366868}]}
{"_id":220,"__v":0,"adjacentVertex":[{"_id":221,"weight":0.19813699779105415},{"_id":219,"weight":0.20858913228043602}]}
{"_id":221,"__v":0,"adjacentVertex":[{"_id":222,"weight":0.1606537934819943},{"_id":220,"weight":0.19813699779105415}]}
{"_id":222,"__v":0,"adjacentVertex":[{"_id":223,"weight":0.14836428697859588},{"_id":221,"weight":0.1606537934819943}]}
{"_id":223,"__v":0,"adjacentVertex":[{"_id":224,"weight":0.13656639969490525},{"_id":222,"weight":0.14836428697859588}]}
{"_id":224,"__v":0,"adjacentVertex":[{"_id":225,"weight":0.1018592500754316},{"_id":223,"weight":0.13656639969490525}]}
{"_id":225,"__v":0,"adjacentVertex":[{"_id":226,"weight":0.014156303474767328},{"_id":224,"weight":0.1018592500754316},{"_id":228,"weight":0.06634715157792599}]}
{"_id":226,"__v":0,"adjacentVertex":[{"_id":227,"weight":0.0051569542901095},{"_id":225,"weight":0.014156303474767328}]}
{"_id":227,"__v":0,"adjacentVertex":[{"_id":226,"weight":0.0051569542901095}]}
{"_id":228,"__v":0,"adjacentVertex":[{"_id":229,"weight":0.1612032632968622},{"_id":225,"weight":0.06634715157792599}]}
{"_id":229,"__v":0,"adjacentVertex":[{"_id":230,"weight":0.1641207129315578},{"_id":228,"weight":0.1612032632968622}]}
{"_id":230,"__v":0,"adjacentVertex":[{"_id":231,"weight":0.311152841457496},{"_id":229,"weight":0.1641207129315578}]}
{"_id":231,"__v":0,"adjacentVertex":[{"_id":232,"weight":0.3959880841507609},{"_id":230,"weight":0.311152841457496}]}
{"_id":232,"__v":0,"adjacentVertex":[{"_id":233,"weight":0.5394357867452214},{"_id":231,"weight":0.3959880841507609},{"_id":191,"weight":0.44723534543582555}]}
{"_id":233,"__v":0,"adjacentVertex":[{"_id":232,"weight":0.5394357867452214},{"_id":192,"weight":0.5188705508826822}]}
{"_id":234,"__v":0,"adjacentVertex":[{"_id":235,"weight":0.6096504175381583},{"_id":191,"weight":0.555170931853963}]}
{"_id":235,"__v":0,"adjacentVertex":[{"_id":236,"weight":1.510185533415146},{"_id":234,"weight":0.6096504175381583},{"_id":145,"weight":0.8868513332574871},{"_id":259,"weight":0.7987852068111957},{"_id":260,"weight":1.1470485864833375}]}
{"_id":236,"__v":0,"adjacentVertex":[{"_id":235,"weight":1.510185533415146},{"_id":71,"weight":2.078196037406111},{"_id":145,"weight":2.2312634985489286},{"_id":255,"weight":1.7634870544872339}]}
{"_id":237,"__v":0,"adjacentVertex":[{"_id":238,"weight":0.35385034279635025},{"_id":218,"weight":0.38125148552377414}]}
{"_id":238,"__v":0,"adjacentVertex":[{"_id":239,"weight":0.8824637394466256},{"_id":237,"weight":0.35385034279635025}]}
{"_id":239,"__v":0,"adjacentVertex":[{"_id":240,"weight":0.8658968764437557},{"_id":238,"weight":0.8824637394466256}]}
{"_id":240,"__v":0,"adjacentVertex":[{"_id":241,"weight":1.2322595570701724},{"_id":239,"weight":0.8658968764437557}]}
{"_id":241,"__v":0,"adjacentVertex":[{"_id":242,"weight":1.7325671341038675},{"_id":240,"weight":1.2322595570701724}]}
{"_id":242,"__v":0,"adjacentVertex":[{"_id":241,"weight":1.73256713410387},{"_id":69,"weight":2.56022162401313},{"_id":71,"weight":2.3157259214160937},{"_id":255,"weight":2.3307608377469062}]}
{"_id":243,"__v":0,"adjacentVertex":[{"_id":244,"weight":3.0138906218486112},{"_id":192,"weight":2.240727608007254},{"_id":145,"weight":1.7440840854482444}]}
{"_id":244,"__v":0,"adjacentVertex":[{"_id":243,"weight":3.0138906218486112},{"_id":207,"weight":2.913069364365863}]}
{"_id":245,"__v":0,"adjacentVertex":[{"_id":246,"weight":0.2129849212301484}]}
{"_id":246,"__v":0,"adjacentVertex":[{"_id":247,"weight":0.24452322490303874},{"_id":245,"weight":0.2129849212301484}]}
{"_id":247,"__v":0,"adjacentVertex":[{"_id":248,"weight":0.3299090649284802},{"_id":246,"weight":0.24452322490303874},{"_id":252,"weight":3.113417866522386}]}
{"_id":248,"__v":0,"adjacentVertex":[{"_id":249,"weight":1.3312406863322783},{"_id":247,"weight":0.3299090649284802},{"_id":254,"weight":3.4194810721569957}]}
{"_id":249,"__v":0,"adjacentVertex":[{"_id":250,"weight":1.357270474928181},{"_id":248,"weight":1.3312406863322783}]}
{"_id":250,"__v":0,"adjacentVertex":[{"_id":249,"weight":1.357270474928181},{"_id":253,"weight":1.9590221518230397}]}
{"_id":251,"__v":0,"adjacentVertex":[{"_id":252,"weight":3.4399203966294682},{"_id":15,"weight":4.233318476869068}]}
{"_id":252,"__v":0,"adjacentVertex":[{"_id":251,"weight":3.4399203966294682},{"_id":247,"weight":3.113417866522386}]}
{"_id":253,"__v":0,"adjacentVertex":[{"_id":11,"weight":2.498756715762887},{"_id":250,"weight":1.9590221518230397},{"_id":257,"weight":2.799492437911435},{"_id":258,"weight":2.388742602394143}]}
{"_id":254,"__v":0,"adjacentVertex":[{"_id":248,"weight":3.4194810721569957},{"_id":14,"weight":3.116418232385215}]}
{"_id":255,"__v":0,"adjacentVertex":[{"_id":242,"weight":2.3307608377469062},{"_id":236,"weight":1.7634870544872339}]}
{"_id":256,"__v":0,"adjacentVertex":[{"_id":257,"weight":2.4461464798647596},{"_id":14,"weight":3.199589975127716}]}
{"_id":257,"__v":0,"adjacentVertex":[{"_id":256,"weight":2.4461464798647596},{"_id":253,"weight":2.799492437911435}]}
{"_id":258,"__v":0,"adjacentVertex":[{"_id":253,"weight":2.388742602394143},{"_id":10,"weight":3.2509683809329384}]}
{"_id":259,"__v":0,"adjacentVertex":[{"_id":260,"weight":1.0875662101869703},{"_id":72,"weight":0.9935199704734893},{"_id":235,"weight":0.7987852068111957}]}
{"_id":260,"__v":0,"adjacentVertex":[{"_id":259,"weight":1.0875662101869703},{"_id":235,"weight":1.1470485864833375}]}
{"_id":261,"__v":0,"adjacentVertex":[{"_id":262,"weight":4.2629205334849205},{"_id":31,"weight":2.589701673066083}]}
{"_id":262,"__v":0,"adjacentVertex":[{"_id":263,"weight":4.31020702638624},{"_id":261,"weight":4.2629205334849205}]}
{"_id":263,"__v":0,"adjacentVertex":[{"_id":264,"weight":3.915061254824349},{"_id":262,"weight":4.31020702638624}]}
{"_id":264,"__v":0,"adjacentVertex":[{"_id":265,"weight":4.54753673418928},{"_id":263,"weight":3.915061254824349}]}
{"_id":265,"__v":0,"adjacentVertex":[{"_id":266,"weight":5.00917998260957},{"_id":264,"weight":4.54753673418928}]}
{"_id":266,"__v":0,"adjacentVertex":[{"_id":267,"weight":4.170510910275467},{"_id":265,"weight":5.00917998260957}]}
{"_id":267,"__v":0,"adjacentVertex":[{"_id":268,"weight":4.459320138240889},{"_id":266,"weight":4.170510910275467}]}
{"_id":268,"__v":0,"adjacentVertex":[{"_id":269,"weight":4.89896685285565},{"_id":267,"weight":4.459320138240889}]}
{"_id":269,"__v":0,"adjacentVertex":[{"_id":270,"weight":3.3334384699271102},{"_id":268,"weight":4.89896685285565},{"_id":39,"weight":2.165667768425256},{"_id":38,"weight":4.231176375895525},{"_id":273,"weight":3.3558479522533684}]}
{"_id":270,"__v":0,"adjacentVertex":[{"_id":271,"weight":4.210887872950591},{"_id":269,"weight":3.3334384699271102},{"_id":40,"weight":2.3553670670862137},{"_id":39,"weight":2.980726594372643},{"_id":272,"weight":2.6443081683787124},{"_id":273,"weight":1.4542656142633983}]}
{"_id":271,"__v":0,"adjacentVertex":[{"_id":270,"weight":4.210887872950591},{"_id":41,"weight":3.468631365685119},{"_id":272,"weight":2.2189053902488256}]}
{"_id":272,"__v":0,"adjacentVertex":[{"_id":271,"weight":2.2189053902488256},{"_id":270,"weight":2.6443081683787124},{"_id":273,"weight":2.5418811334996905}]}
{"_id":273,"__v":0,"adjacentVertex":[{"_id":272,"weight":2.5418811334996905},{"_id":269,"weight":3.3558479522533684},{"_id":270,"weight":1.4542656142633983}]}
{"_id":274,"__v":0,"adjacentVertex":[{"_id":275,"weight":1.434020624153736},{"_id":215,"weight":0.8038988017000319}]}
{"_id":275,"__v":0,"adjacentVertex":[{"_id":276,"weight":1.5854682414931445},{"_id":274,"weight":1.434020624153736}]}
{"_id":276,"__v":0,"adjacentVertex":[{"_id":277,"weight":1.4996599456785427},{"_id":275,"weight":1.5854682414931445},{"_id":90,"weight":1.8733261504391971}]}
{"_id":277,"__v":0,"adjacentVertex":[{"_id":278,"weight":1.6600108591114184},{"_id":276,"weight":1.4996599456785427}]}
{"_id":278,"__v":0,"adjacentVertex":[{"_id":279,"weight":1.34843099112954},{"_id":277,"weight":1.6600108591114184}]}
{"_id":279,"__v":0,"adjacentVertex":[{"_id":280,"weight":1.4199826563557267},{"_id":278,"weight":1.34843099112954}]}
{"_id":280,"__v":0,"adjacentVertex":[{"_id":281,"weight":1.33703420665842},{"_id":279,"weight":1.4199826563557267}]}
{"_id":281,"__v":0,"adjacentVertex":[{"_id":282,"weight":0.991036722840184},{"_id":280,"weight":1.33703420665842}]}
{"_id":282,"__v":0,"adjacentVertex":[{"_id":281,"weight":0.991036722840184},{"_id":98,"weight":0.6776894644917137}]}
{"_id":283,"__v":0,"adjacentVertex":[{"_id":284,"weight":2.001805312067577},{"_id":199,"weight":1.876317730260025}]}
{"_id":284,"__v":0,"adjacentVertex":[{"_id":285,"weight":2.1211932716978064},{"_id":283,"weight":2.001805312067577}]}
{"_id":285,"__v":0,"adjacentVertex":[{"_id":284,"weight":2.1211932716978064},{"_id":195,"weight":2.415997359895252}]}
{"_id":286,"__v":0,"adjacentVertex":[{"_id":287,"weight":5.256897228124615}]}
{"_id":287,"__v":0,"adjacentVertex":[{"_id":288,"weight":5.12541937625437},{"_id":286,"weight":5.256897228124615}]}
{"_id":288,"__v":0,"adjacentVertex":[{"_id":289,"weight":6.459255332563955},{"_id":287,"weight":5.12541937625437}]}
{"_id":289,"__v":0,"adjacentVertex":[{"_id":290,"weight":6.4842077773306945},{"_id":288,"weight":6.459255332563955}]}
{"_id":290,"__v":0,"adjacentVertex":[{"_id":289,"weight":6.4842077773306945},{"_id":141,"weight":5.315870008160554}]}
{"_id":291,"__v":0,"adjacentVertex":[{"_id":292,"weight":2.137757386225834},{"_id":86,"weight":2.254780364811123},{"_id":87,"weight":1.4029613866409616}]}
{"_id":292,"__v":0,"adjacentVertex":[{"_id":293,"weight":1.306208701112334},{"_id":291,"weight":2.137757386225834},{"_id":88,"weight":1.5361379487382198}]}
{"_id":293,"__v":0,"adjacentVertex":[{"_id":294,"weight":1.7117639623486844},{"_id":292,"weight":1.306208701112334}]}
{"_id":294,"__v":0,"adjacentVertex":[{"_id":293,"weight":1.7117639623486844},{"_id":90,"weight":1.6600202220960982}]}
