{"_id":1,"name":"Cat Lai","codeID":"VNSGN","coordinateID":122,"__v":0}
{"_id":2,"name":"Yokohama","codeID":"JPYOK","coordinateID":138,"__v":0}
{"_id":3,"name":"Felixstowe","codeID":"GBFXT","coordinateID":119,"__v":0}
{"_id":4,"name":"Venice","codeID":"ITVCE","coordinateID":146,"__v":0}
{"_id":5,"name":"Singapore","codeID":"SGSIN","coordinateID":165,"__v":0}
{"_id":6,"name":"Klang","codeID":"MYPKG","coordinateID":169,"__v":0}
{"_id":7,"name":"Lisbon","codeID":"PTLIS","coordinateID":211,"__v":0}
{"_id":8,"name":"Piraeus","codeID":"GRPIR","coordinateID":227,"__v":0}
{"_id":9,"name":"Manila","codeID":"PHMNL","coordinateID":245,"__v":0}
