((("care" .
   [1 0 0 0])
  ("pe" .
   [1 0])
  ("Site-ului" .
   [1 0 0 0 0 0 0 0 0])
  ("browser-ului" .
   [0 0 0 0 1 0 0 0 0 0 0 0])
  ("final" .
   [1 0 0 0 0])
  ("paragraphs" .
   [0 0 0 0 1 0 0 0 0 0])
  ("doc" .
   [2 0 0])
  ("toPlainText" .
   [0 0 0 1 0 0 0 0 0 0 0])
  ("middle" .
   [1 0 0 0 0 0])
  ("Document" .
   [1 0 0 0 0 0 0 0])
  ("QTextEdit" .
   [0 0 0 0 0 0 0 0 1])
  ("addWidget" .
   [2 0 0 0 0 0 0 0 0])
  ("addItem" .
   [1 0 0 1 0 0 0])
  ("insert_text" .
   [1 0 0 0 0 0 0 0 0 0 0])
  ("edit" .
   [1 1 0 0])
  ("button" .
   [2 0 0 0 0 0])
  ("docx" .
   [2 0 0 0])
  ("openpyxl" .
   [0 0 0 0 0 1 0 0])
  ("elem" .
   [2 0 0 0])
  ("body" .
   [1 0 0 0])
  ("4.7310" .
   [2 0 0 0 0 0])
  ("4.6670" .
   [2 0 0 0 0 0])
  ("tramp-default-method" .
   [0 0 0 0 0 0 0 0 0 0 0 0 0 0 0 0 0 0 0 1])
  ("imenu" .
   [2 0 0 0 0])
  ("a" .
   [7])
  ("auto-fill-mode" .
   [0 0 0 0 0 0 0 0 0 0 0 1 0 0])
  ("ispell-personal-dictionary" .
   [1 0 0 0 0 0 0 0 0 0 0 0 0 0 0 0 0 0 0 0 0 0 0 0 0 0])
  ("ispell-dictionary" .
   [1 0 0 0 0 0 0 0 0 0 0 0 0 0 0 0 0])
  ("ispell-local-dictionary" .
   [1 0 0 0 0 0 0 0 0 0 0 0 0 0 0 0 0 0 0 0 0 0 0])
  ("unforward-rmail-message" .
   [0 0 0 0 0 1 0 0 0 0 0 0 0 0 0 0 0 0 0 0 0 0 0])
  ("hscroll-step" .
   [0 0 0 1 0 0 0 0 0 0 0 0])
  ("indicate-empty-lines" .
   [0 0 0 0 0 0 0 0 0 0 0 0 0 0 0 0 0 0 0 1])
  ("show-trailing-whitespace" .
   [0 0 0 0 0 0 0 1 0 0 0 0 0 0 0 0 0 0 0 0 0 0 0 0])
  ("file" .
   [1 0 0 0])
  ("set-register" .
   [1 0 0 0 0 0 0 0 0 0 0 0])
  ("global-set-key" .
   [0 0 0 0 0 0 0 0 0 1 2 0 0 0])
  ("buffer-file-name" .
   [0 0 0 0 0 0 0 0 0 0 0 1 0 0 0 0])
  ("square-tri" .
   [0 0 0 0 1 0 0 0 0 0])
  ("the-list" .
   [3 0 0 0 0 0 0 0])
  ("set-mark" .
   [0 0 0 0 1 0 0 0])
  ("save-excursion" .
   [1 0 0 0 0 0 0 0 0 0 0 0 0 0])
  ("multiply-triangle" .
   [0 0 0 0 0 0 0 0 0 0 1 0 0 0 0 0 0])
  ("t" .
   [4])
  ("row" .
   [2 0 0])
  ("square-triangle" .
   [0 0 0 0 0 0 1 0 0 0 0 0 0 0 0])
  ("print" .
   [4 0 0 0 0])
  ("num" .
   [12 0 0])
  ("1-" .
   [4 0])
  ("counter" .
   [3 0 0 0 0 0 0])
  ("triangle" .
   [1 0 0 0 0 0 0 0])
  ("1+" .
   [2 0])
  ("total" .
   [9 0 0 0 0])
  ("number-of-rows" .
   [0 0 0 0 0 0 0 0 0 0 1 0 0 0])
  ("row-number" .
   [4 0 0 1 2 0 0 0 0 1])
  ("<=" .
   [2 0])
  ("while" .
   [5 0 0 0 0])
  ("count" .
   [2 0 0 0 0])
  ("length" .
   [0 0 0 1 0 0])
  ("more-flowers" .
   [2 0 0 0 0 1 0 0 1 0 0 0])
  ("More pages?" .
   [1 0 0 0 1 0 0 0 0 0 0])
  ("flowers" .
   [2 0 0 0 0 0 0])
  ("nil" .
   [10 0 0])
  ("kill-ring" .
   [4 0 0 0 2 0 0 0 0])
  ("fish" .
   [1 0 0 0])
  ("birds" .
   [3 0 0 0 0])
  ("cond" .
   [1 0 0 0])
  ("setcdr" .
   [3 0 0 0 0 0])
  ("domesticated-animals" .
   [0 0 0 0 1 0 0 0 0 0 0 0 0 0 0 0 0 0 0 1])
  ("animals" .
   [1 0 0 0 0 0 0])
  ("setcar" .
   [3 0 0 0 0 0])
  ("nthcdr" .
   [3 0 0 0 0 0])
  ("cons" .
   [8 0 0 0])
  ("to" .
   [1 0])
  ("some" .
   [1 0 0 0])
  ("car" .
   [6 0 0])
  ("lisp-mode" .
   [1 0 0 0 0 0 0 0 0])
  ("lisp" .
   [1 0 0 0])
  ("This" .
   [0 0 0 1])
  ("get-mode-local-parent" .
   [0 0 0 0 0 0 1 0 0 0 0 0 0 0 0 0 0 0 0 0 1])
  ("thestr" .
   [1 0 0 0 0 0])
  ("buffer-substring-no-properties" .
   [0 0 0 0 0 0 0 0 0 0 0 0 0 0 0 0 0 0 0 1 0 0 0 0 0 0 0 0 0 0])
  ("point-min" .
   [3 0 0 0 0 0 0 0 0])
  ("goto-char" .
   [2 0 0 0 0 0 0 0 0])
  ("widen" .
   [1 0 0 0 0])
  ("save-restriction" .
   [0 0 0 0 0 0 0 0 3 0 0 0 0 0 0 0])
  ("setq" .
   [35 0 0 0])
  ("let" .
   [7 0 0])
  ("test-arg" .
   [0 0 0 0 0 1 0 0])
  ("interactive" .
   [1 0 0 0 0 0 1 0 0 0 0])
  (">=" .
   [2 0])
  ("defun" .
   [7 0 0 0 0])
  ("message" .
   [8 0 0 0 0 0 1])
  ("->" .
   [1 0])
  ("fill-column" .
   [0 0 0 0 0 0 0 1 0 0 1])
  ("c" .
   [1])
  ("fill" .
   [1 0 0 0])
  ("less" .
   [1 0 0 0])
  ("or" .
   [2 0])
  ("arg" .
   [8 0 0])
  ("if" .
   [4 0])
  ("argv" .
   [1 0 0 1])
  ("x" .
   [1])
  ("HttpResponse" .
   [0 0 0 0 0 0 0 0 0 0 0 1])
  ("Client" .
   [3 0 0 0 0 0])
  ("objects" .
   [3 0 0 0 0 0 0])
  ("font" .
   [1 2 2 2])
  ("balance-windows" .
   [0 0 0 0 1 0 0 0 0 0 0 0 0 0 0])
  ("is" .
   [2 0])
  ("not" .
   [1 0 0])
  ("list" .
   [3 0 0 0])
  ("this" .
   [1 0 0 0])
  ("quoted" .
   [1 0 0 0 0 0])
  ("sdb" .
   [0 0 2])
  ("mwheel-scroll" .
   [0 0 0 0 0 0 1 1 0 0 0 0 0])
  ("mwheel-scroll-down-function" .
   [0 0 0 0 0 0 0 0 0 0 0 0 0 0 0 0 0 0 1 0 0 0 0 0 0 0 0])
  ("mouse-wheel-down-button" .
   [0 0 0 0 0 0 0 1 0 0 0 0 0 0 0 0 0 0 0 0 0 0 0])
  ("mwheel-install" .
   [0 0 0 1 0 0 0 0 0 0 0 0 0 0])
  ("mwheel-event-window" .
   [0 0 0 0 0 0 0 1 0 0 0 0 0 0 0 0 0 0 0])
  ("mwheel-scroll-up-function" .
   [0 0 0 0 0 0 0 1 0 0 0 0 0 0 0 0 0 0 0 0 0 0 0 0 0])
  ("switch-to-buffer" .
   [1 0 0 0 0 0 0 0 0 0 0 0 0 0 0 0])
  ("other-buffer" .
   [1 0 0 0 0 0 0 0 0 0 0 0])
  ("other-window" .
   [2 0 0 0 0 0 0 0 0 0 0 0])
  ("count-lines" .
   [1 0 0 0 0 0 0 0 0 0 0])
  ("point" .
   [1 0 0 0 0])
  ("last-command" .
   [1 0 0 0 0 0 0 0 0 0 0 0])
  ("ace-window" .
   [1 0 0 0 0 0 0 0 0 0])
  ("search-forward" .
   [0 0 0 0 0 0 1 0 0 0 0 0 0 0])
  ("test-search" .
   [0 0 0 0 0 0 0 1 0 0 0])
  ("asd" .
   [1 0 0])
  ("nth" .
   [4 0 0])
  ("key-sequence" .
   [0 0 0 1 0 0 0 0 0 0 0 1])
  ("execute-kbd-macro" .
   [0 0 0 0 0 0 0 0 0 0 0 0 0 0 0 0 1])
  ("C-f10" .
   [0 0 0 1 0])
  ("dotimes" .
   [1 0 0 0 0 0 0])
  ("number" .
   [2 0 0 1 0 0])
  ("numbers-list" .
   [2 0 0 0 0 0 0 0 0 0 0 0])
  ("square-each" .
   [2 0 0 0 0 0 0 0 0 0 0])
  ("cdr" .
   [1 0 0])
  ("re-search-forward" .
   [0 0 0 0 0 0 0 0 0 0 0 0 0 0 0 0 1])
  ("shell-command" .
   [0 0 0 0 0 0 0 0 0 0 0 0 2])
  ("major-mode" .
   [0 0 0 0 0 0 1 0 1 0])
  ("lisp-interaction-mode" .
   [1 0 0 0 0 0 0 0 0 0 0 0 0 0 0 0 0 0 0 0 0])
  ("eq" .
   [2 0])
  ("tooltip-delay" .
   [0 0 0 0 0 0 0 0 0 0 1 0 0])
  ("toggle" .
   [1 0 0 0 0 0])
  ("toggle-truncate-lines" .
   [0 0 0 0 0 0 0 0 0 0 0 1 0 0 0 0 0 0 0 0 0])
  ("visual-line-mode" .
   [1 0 0 0 0 0 0 0 0 0 0 0 0 0 0 0])
  ("scroll" .
   [1 0 0 0 0 1])
  ("scroll-left" .
   [2 0 0 0 0 0 0 0 0 0 0])
  ("source-directory" .
   [0 0 0 0 0 0 0 1 0 0 0 0 0 0 0 0])
  ("display-line-numbers" .
   [0 0 0 0 0 0 0 0 0 0 0 0 0 0 0 0 0 0 0 1])
  ("relative" .
   [1 0 0 0 0 0 0 0])
  ("ivy-mode" .
   [1 0 0 0 0 0 0 0])
  ("Indian" .
   [1 0 0 0 0 0])
  ("replace-regexp" .
   [0 0 0 0 0 0 0 0 0 0 0 0 0 1])
  ("df" .
   [3 0])
  ("undo" .
   [1 0 0 0])
  (">" .
   [1])
  ("lambda" .
   [1 0 0 0 0 0])
  ("alpha" .
   [2 0 0 0 0])
  ("prettify-symbols-alist" .
   [0 0 0 0 1 0 0 0 0 0 0 0 0 0 0 0 0 0 0 0 0 0])
  ("python" .
   [1 0 0 0 0 0])
  ("path" .
   [1 0 0 0])
  ("dump" .
   [13 0 0 0])
  ("await" .
   [0 1 0 0 0])
  ("add-hook" .
   [1 0 0 0 0 0 0 0])
  ("python-mode-hook" .
   [0 0 0 0 0 0 0 0 0 0 0 0 1 0 0 0])
  ("buffer" .
   [1 0 0 0 0 0])
  ("background-color" .
   [0 0 0 2 0 0 0 0 0 0 0 0 0 0 0 0])
  ("red" .
   [0 0 1])
  ("QQuickView" .
   [1 0 0 0 0 0 0 0 0 0])
  ("feedparser" .
   [1 0 0 0 0 0 0 0 0 0])
  ("filed" .
   [1 0 0 0 0])
  ("QFileDialog" .
   [0 0 0 0 0 0 3 0 0 0 0])
  ("fileName" .
   [2 0 0 0 0 0 0 0])
  ("app" .
   [3 0 0])
  ("form" .
   [4 0 0 0])
  ("Qt" .
   [1 0])
  ("QtGui" .
   [3 2 4 1 0])
  ("PySide2" .
   [1 0 2 0 0 0 0])
  ("appLabel" .
   [1 0 0 0 0 0 0 0])
  ("layout" .
   [1 0 0 0 0 0])
  ("window" .
   [0 0 0 1 0 0])
  ("setIcon" .
   [0 0 0 0 1 0 0])
  ("icon" .
   [3 0 0 0])
  ("widget" .
   [2 0 0 0 0 0])
  ("setWindowIcon" .
   [0 0 0 0 2 0 0 0 0 0 0 0 0])
  ("re" .
   [2 0])
  ("resize" .
   [1 0 0 0 0 0])
  ("QPushButton" .
   [0 0 1 1 0 0 0 0 0 0 0])
  ("QLineEdit" .
   [1 0 0 0 0 0 0 0 0])
  ("edit3" .
   [3 0 0 0 0])
  ("edit2" .
   [2 0 0 0 0])
  ("button2" .
   [1 0 0 0 0 0 1])
  ("clicked" .
   [0 0 0 1 0 0 0])
  ("connect" .
   [1 0 0 0 0 0 0])
  ("sum" .
   [1 0 0])
  ("add" .
   [1 0 0])
  ("calc" .
   [1 0 0 0])
  ("text" .
   [6 0 0 0])
  ("QWidget" .
   [0 0 0 1 0 0 0])
  ("line_edit" .
   [2 0 0 0 0 0 0 0 0])
  ("nm" .
   [1 0])
  ("name" .
   [1 0 0 0])))
