module go.blockdaemon.com/solana/solana-bigtable-checker-public

go 1.21

toolchain go1.22.4

require (
	cloud.google.com/go/bigtable v1.24.0
	github.com/avast/retry-go v3.0.0+incompatible
	github.com/gagliardetto/solana-go v1.10.0
	github.com/gin-contrib/zap v1.1.3
	github.com/gin-gonic/gin v1.10.0
	github.com/golang/protobuf v1.5.4
	github.com/klauspost/compress v1.17.8
	github.com/mattn/go-sqlite3 v1.14.22
	github.com/prometheus/client_golang v1.19.1
	github.com/pterm/pterm v0.12.79
	github.com/spf13/pflag v1.0.5
	github.com/swaggo/files/v2 v2.0.1
	github.com/swaggo/gin-swagger v1.6.0
	github.com/swaggo/swag v1.16.3
	github.com/tkanos/gonfig v0.0.0-20210106201359-53e13348de2f
	go.uber.org/atomic v1.11.0
	go.uber.org/zap v1.27.0
	golang.org/x/exp v0.0.0-20240604190554-fc45aab8b7f8
	golang.org/x/sync v0.7.0
	google.golang.org/api v0.183.0
	google.golang.org/protobuf v1.34.1
)

require (
	atomicgo.dev/cursor v0.2.0 // indirect
	atomicgo.dev/keyboard v0.2.9 // indirect
	atomicgo.dev/schedule v0.1.0 // indirect
	cloud.google.com/go v0.114.0 // indirect
	cloud.google.com/go/auth v0.5.1 // indirect
	cloud.google.com/go/auth/oauth2adapt v0.2.2 // indirect
	cloud.google.com/go/compute/metadata v0.3.0 // indirect
	cloud.google.com/go/iam v1.1.8 // indirect
	cloud.google.com/go/longrunning v0.5.7 // indirect
	filippo.io/edwards25519 v1.0.0 // indirect
	github.com/KyleBanks/depth v1.2.1 // indirect
	github.com/andres-erbsen/clock v0.0.0-20160526145045-9e14626cd129 // indirect
	github.com/beorn7/perks v1.0.1 // indirect
	github.com/blendle/zapdriver v1.3.1 // indirect
	github.com/bytedance/sonic v1.11.6 // indirect
	github.com/bytedance/sonic/loader v0.1.1 // indirect
	github.com/census-instrumentation/opencensus-proto v0.4.1 // indirect
	github.com/cespare/xxhash/v2 v2.2.0 // indirect
	github.com/cloudwego/base64x v0.1.4 // indirect
	github.com/cloudwego/iasm v0.2.0 // indirect
	github.com/cncf/xds/go v0.0.0-20240318125728-8a4994d93e50 // indirect
	github.com/containerd/console v1.0.3 // indirect
	github.com/davecgh/go-spew v1.1.1 // indirect
	github.com/envoyproxy/go-control-plane v0.12.0 // indirect
	github.com/envoyproxy/protoc-gen-validate v1.0.4 // indirect
	github.com/fatih/color v1.13.0 // indirect
	github.com/felixge/httpsnoop v1.0.4 // indirect
	github.com/gabriel-vasile/mimetype v1.4.3 // indirect
	github.com/gagliardetto/binary v0.8.0 // indirect
	github.com/gagliardetto/treeout v0.1.4 // indirect
	github.com/ghodss/yaml v1.0.0 // indirect
	github.com/gin-contrib/sse v0.1.0 // indirect
	github.com/go-logr/logr v1.4.1 // indirect
	github.com/go-logr/stdr v1.2.2 // indirect
	github.com/go-openapi/jsonpointer v0.19.6 // indirect
	github.com/go-openapi/jsonreference v0.20.2 // indirect
	github.com/go-openapi/spec v0.20.8 // indirect
	github.com/go-openapi/swag v0.22.3 // indirect
	github.com/go-playground/locales v0.14.1 // indirect
	github.com/go-playground/universal-translator v0.18.1 // indirect
	github.com/go-playground/validator/v10 v10.20.0 // indirect
	github.com/goccy/go-json v0.10.2 // indirect
	github.com/golang/groupcache v0.0.0-20210331224755-41bb18bfe9da // indirect
	github.com/google/s2a-go v0.1.7 // indirect
	github.com/google/uuid v1.6.0 // indirect
	github.com/googleapis/enterprise-certificate-proxy v0.3.2 // indirect
	github.com/googleapis/gax-go/v2 v2.12.4 // indirect
	github.com/gookit/color v1.5.4 // indirect
	github.com/josharian/intern v1.0.0 // indirect
	github.com/json-iterator/go v1.1.12 // indirect
	github.com/klauspost/cpuid/v2 v2.2.7 // indirect
	github.com/leodido/go-urn v1.4.0 // indirect
	github.com/lithammer/fuzzysearch v1.1.8 // indirect
	github.com/logrusorgru/aurora v2.0.3+incompatible // indirect
	github.com/mailru/easyjson v0.7.7 // indirect
	github.com/mattn/go-colorable v0.1.13 // indirect
	github.com/mattn/go-isatty v0.0.20 // indirect
	github.com/mattn/go-runewidth v0.0.15 // indirect
	github.com/mitchellh/go-testing-interface v1.14.1 // indirect
	github.com/modern-go/concurrent v0.0.0-20180306012644-bacd9c7ef1dd // indirect
	github.com/modern-go/reflect2 v1.0.2 // indirect
	github.com/mostynb/zstdpool-freelist v0.0.0-20201229113212-927304c0c3b1 // indirect
	github.com/mr-tron/base58 v1.2.0 // indirect
	github.com/onsi/gomega v1.15.0 // indirect
	github.com/pelletier/go-toml/v2 v2.2.2 // indirect
	github.com/prometheus/client_model v0.5.0 // indirect
	github.com/prometheus/common v0.48.0 // indirect
	github.com/prometheus/procfs v0.12.0 // indirect
	github.com/rivo/uniseg v0.4.4 // indirect
	github.com/streamingfast/logging v0.0.0-20230608130331-f22c91403091 // indirect
	github.com/tidwall/pretty v1.2.1 // indirect
	github.com/twitchyliquid64/golang-asm v0.15.1 // indirect
	github.com/ugorji/go/codec v1.2.12 // indirect
	github.com/xo/terminfo v0.0.0-20220910002029-abceb7e1c41e // indirect
	go.mongodb.org/mongo-driver v1.11.0 // indirect
	go.opencensus.io v0.24.0 // indirect
	go.opentelemetry.io/contrib/instrumentation/google.golang.org/grpc/otelgrpc v0.49.0 // indirect
	go.opentelemetry.io/contrib/instrumentation/net/http/otelhttp v0.49.0 // indirect
	go.opentelemetry.io/otel v1.24.0 // indirect
	go.opentelemetry.io/otel/metric v1.24.0 // indirect
	go.opentelemetry.io/otel/trace v1.24.0 // indirect
	go.uber.org/multierr v1.11.0 // indirect
	go.uber.org/ratelimit v0.2.0 // indirect
	golang.org/x/arch v0.8.0 // indirect
	golang.org/x/crypto v0.24.0 // indirect
	golang.org/x/net v0.26.0 // indirect
	golang.org/x/oauth2 v0.21.0 // indirect
	golang.org/x/sys v0.21.0 // indirect
	golang.org/x/term v0.21.0 // indirect
	golang.org/x/text v0.16.0 // indirect
	golang.org/x/time v0.5.0 // indirect
	golang.org/x/tools v0.22.0 // indirect
	google.golang.org/genproto v0.0.0-20240528184218-531527333157 // indirect
	google.golang.org/genproto/googleapis/api v0.0.0-20240521202816-d264139d666e // indirect
	google.golang.org/genproto/googleapis/rpc v0.0.0-20240528184218-531527333157 // indirect
	google.golang.org/grpc v1.64.0 // indirect
	gopkg.in/yaml.v2 v2.4.0 // indirect
	gopkg.in/yaml.v3 v3.0.1 // indirect
)
