module go.blockdaemon.com/pyth_exporter

go 1.17

require (
	github.com/gagliardetto/solana-go v1.3.1-0.20220222155336-dd0af958252d
	github.com/prometheus/client_golang v1.12.1
	go.blockdaemon.com/pyth v0.3.6
	go.uber.org/zap v1.21.0
	golang.org/x/sync v0.0.0-20210220032951-036812b2e83c
)

require (
	contrib.go.opencensus.io/exporter/stackdriver v0.13.4 // indirect
	filippo.io/edwards25519 v1.0.0-rc.1 // indirect
	github.com/andres-erbsen/clock v0.0.0-20160526145045-9e14626cd129 // indirect
	github.com/aybabtme/rgbterm v0.0.0-20170906152045-cc83f3b3ce59 // indirect
	github.com/beorn7/perks v1.0.1 // indirect
	github.com/blendle/zapdriver v1.3.1 // indirect
	github.com/buger/jsonparser v1.1.1 // indirect
	github.com/cenkalti/backoff/v4 v4.1.2 // indirect
	github.com/cespare/xxhash/v2 v2.1.2 // indirect
	github.com/davecgh/go-spew v1.1.1 // indirect
	github.com/dfuse-io/logging v0.0.0-20210109005628-b97a57253f70 // indirect
	github.com/fatih/color v1.9.0 // indirect
	github.com/gagliardetto/binary v0.6.1 // indirect
	github.com/gagliardetto/treeout v0.1.4 // indirect
	github.com/golang/groupcache v0.0.0-20200121045136-8c9f03a8e57e // indirect
	github.com/golang/protobuf v1.5.2 // indirect
	github.com/gorilla/rpc v1.2.0 // indirect
	github.com/gorilla/websocket v1.4.2 // indirect
	github.com/json-iterator/go v1.1.12 // indirect
	github.com/klauspost/compress v1.13.6 // indirect
	github.com/logrusorgru/aurora v2.0.3+incompatible // indirect
	github.com/mattn/go-colorable v0.1.4 // indirect
	github.com/mattn/go-isatty v0.0.11 // indirect
	github.com/matttproud/golang_protobuf_extensions v1.0.1 // indirect
	github.com/mitchellh/go-testing-interface v1.14.1 // indirect
	github.com/modern-go/concurrent v0.0.0-20180306012644-bacd9c7ef1dd // indirect
	github.com/modern-go/reflect2 v1.0.2 // indirect
	github.com/mostynb/zstdpool-freelist v0.0.0-20201229113212-927304c0c3b1 // indirect
	github.com/mr-tron/base58 v1.2.0 // indirect
	github.com/prometheus/client_model v0.2.0 // indirect
	github.com/prometheus/common v0.32.1 // indirect
	github.com/prometheus/procfs v0.7.3 // indirect
	github.com/shopspring/decimal v1.3.1 // indirect
	github.com/teris-io/shortid v0.0.0-20201117134242-e59966efd125 // indirect
	github.com/tidwall/gjson v1.9.3 // indirect
	github.com/tidwall/match v1.1.1 // indirect
	github.com/tidwall/pretty v1.2.0 // indirect
	go.opencensus.io v0.22.5 // indirect
	go.uber.org/atomic v1.7.0 // indirect
	go.uber.org/multierr v1.6.0 // indirect
	go.uber.org/ratelimit v0.2.0 // indirect
	golang.org/x/crypto v0.0.0-20210513164829-c07d793c2f9a // indirect
	golang.org/x/sys v0.0.0-20220114195835-da31bd327af9 // indirect
	golang.org/x/term v0.0.0-20201210144234-2321bbc49cbf // indirect
	google.golang.org/protobuf v1.26.0 // indirect
)
