{
    "$schema": "https://docs.renovatebot.com/renovate-schema.json",
    "extends": [
      "gitlab>blockdaemon/sre/renovate/config-presets",
      "gitlab>Blockdaemon/sre/renovate/config-presets//owners/special"
    ]
}
